<?xml version="1.0" encoding="UTF-8"?>

<!--
  Copyright (c) Steffen Grund.

  This file is subject to the terms and conditions defined in the top-level file LICENSE.
-->

<svg
  xmlns="http://www.w3.org/2000/svg"
  role="img"
  width="24px"
  height="24px"
  viewBox="0 0 24 24"
  fill="#FFFFFF">

  <defs>
    <linearGradient
      id="application-window-stroke-color-gradient"
      x1="2.500"
      y1="2.500"
      x2="21.500"
      y2="21.500"
      gradientUnits="userSpaceOnUse">

      <stop
        offset="0.000"
        style="stop-color:#F3F9E8;stop-opacity:1.000" />

      <stop
        offset="1.000"
        style="stop-color:#B9D878;stop-opacity:1.000" />
    </linearGradient>

    <linearGradient
      id="application-window-background-color-gradient"
      x1="2.500"
      y1="2.500"
      x2="21.500"
      y2="21.500"
      gradientUnits="userSpaceOnUse">

      <stop
        offset="0.000"
        style="stop-color:#B9D878;stop-opacity:1.000" />

      <stop
        offset="1.000"
        style="stop-color:#F3F9E8;stop-opacity:1.000" />
    </linearGradient>

    <linearGradient
      id="application-window-color-gradient"
      x1="13.500"
      y1="7.500"
      x2="22.500"
      y2="18.500"
      gradientUnits="userSpaceOnUse">

      <stop
        offset="0.000"
        style="stop-color:#076E09;stop-opacity:1.000" />

      <stop
        offset="1.000"
        style="stop-color:#7CB035;stop-opacity:1.000" />
    </linearGradient>
  </defs>

  <path
    id="application-window-stroke"
    style="fill:url(#application-window-stroke-color-gradient);fill-opacity:1.000"
    d="M 11.849279,0.00410065 2.0170413,0.02040485 1.7275596,0.13045821 C 0.93122446,0.43138071 0.33802798,1.1170765 0.16394165,1.9381863 c -0.10674086,0.5017213 -0.10643677,19.6274227 0,20.1295727 0.18792733,0.886601 0.88354945,1.620956 1.76340175,1.862754 0.1957136,0.05379 2.0769634,0.06637 10.0483306,0.06929 6.601018,0.0022 9.880465,-0.01404 10.03202,-0.04891 0.880594,-0.202747 1.637601,-0.981887 1.828637,-1.883134 0.107559,-0.507461 0.107559,-19.628225 0,-20.1356867 C 23.639677,1.0042907 22.876006,0.2394295 21.956729,0.04689918 21.752945,0.00418823 19.129806,-0.0072095 11.849279,0.00410065 Z" />

  <rect
    id="application-window-background"
    style="fill:url(#application-window-background-color-gradient);fill-opacity:1.000"
    width="20.500"
    height="20.500"
    x="1.500"
    y="1.500"
    rx="0.000"
    ry="0.000" />

  <path
    id="application-window"
    style="fill:url(#application-window-color-gradient);fill-opacity:1.000"
    d="M 2.3493695,23.433309 C 1.5064148,23.201583 0.84109387,22.498291 0.66104701,21.648624 0.55907365,21.167393 0.55787094,2.8382127 0.66013564,2.3573921 0.82692108,1.570488 1.3964173,0.91183387 2.1593579,0.6234472 L 2.4366057,0.51865053 11.856575,0.50398669 c 6.975218,-0.0108386 9.488398,-3.0968e-4 9.683636,0.0406217 0.880727,0.1845099 1.61077,0.91762213 1.799178,1.80675423 0.103048,0.4863219 0.103048,18.8109304 0,19.2972514 -0.183025,0.863703 -0.907576,1.61035 -1.751242,1.804651 -0.1452,0.03342 -3.287524,0.04864 -9.611729,0.04655 -7.637087,-0.0028 -9.4391778,-0.01494 -9.6266843,-0.06649 z M 21.28833,13.785712 21.300444,6.3911534 H 12.000172 2.6998998 v 7.3745856 c 0,4.05602 0.014394,7.389012 0.032056,7.406663 0.017662,0.01766 4.1973051,0.02659 9.2881412,0.01994 l 9.256052,-0.01211 z M 4.2281135,4.5428026 c 0.2926664,-0.08689 0.5901618,-0.3354023 0.7389583,-0.617222 0.143843,-0.2724567 0.143843,-0.7887439 0,-1.0611915 C 4.4894855,1.9598187 3.1930523,1.9787998 2.7984212,2.8961751 2.5078481,3.5716335 2.8687341,4.3663068 3.549075,4.5492774 c 0.3054093,0.082154 0.3832825,0.081426 0.6790385,-0.00637 z M 7.6446243,4.4460755 C 8.0628467,4.2341506 8.2849816,3.814891 8.2521654,3.2994328 8.2170981,2.7494643 7.8418042,2.3236561 7.2965988,2.2153801 6.7861043,2.113999 6.248441,2.3818107 5.9936538,2.8643891 5.8501117,3.1362629 5.8497562,3.6537796 5.992889,3.9223109 6.3244282,4.5441414 7.0174019,4.7638902 7.6445879,4.4460755 Z m 2.9593457,0.096727 c 0.292667,-0.08689 0.590162,-0.3354023 0.738959,-0.617222 0.07696,-0.1457463 0.102967,-0.2798161 0.102967,-0.5305958 0,-0.398129 -0.104643,-0.6341173 -0.399186,-0.9002075 C 10.498453,1.9994568 9.6404251,2.1294188 9.2459023,2.7675345 8.8938145,3.3370216 9.1141555,4.1796119 9.6864299,4.4521507 10.05104,4.6257946 10.256253,4.6460691 10.60397,4.5427755 Z" />

  <path
    id="grapes"
    style="fill:#6E076C;fill-opacity:1.000"
    d="m 13.448683,19.658989 c 0.789495,-0.126234 1.414549,-0.960427 1.181151,-1.753543 -0.14705,-0.977347 -1.426254,-1.472843 -2.217186,-0.910307 -0.751428,0.481765 -0.881938,1.678463 -0.195555,2.273108 0.322983,0.309843 0.785342,0.484408 1.23159,0.390742 z m 1.357523,-2.110491 c 0.668642,-0.331941 1.093505,-1.196257 0.779766,-1.908449 -0.328553,-0.756586 -1.326112,-1.180389 -2.056486,-0.725237 -0.568596,0.308386 -0.939206,1.047105 -0.689098,1.670224 0.642762,-0.09185 1.35675,0.148405 1.726308,0.715316 0.0751,0.08466 0.138612,0.19175 0.23951,0.248146 z m -3.275752,0.316426 c 0.278377,-0.389253 0.50145,-0.986956 1.043924,-1.140533 0.107018,-0.338802 -0.02745,-0.83111 0.07661,-1.219305 -0.437672,-0.542194 -1.268263,-0.744399 -1.873547,-0.361969 -0.760767,0.438278 -0.9802853,1.595501 -0.34927,2.237961 0.276195,0.304323 0.687997,0.501908 1.102288,0.483846 z m 1.265179,-2.533488 c 0.280373,-0.339458 0.627348,-0.633154 1.060246,-0.752155 0.349722,-0.403721 -0.453147,-0.967976 -0.853086,-1.0739 -0.820123,-0.25975 -1.736288,0.370945 -1.847715,1.206717 0.364618,0.118618 0.906181,0.04133 1.263596,0.337346 0.131829,0.08564 0.241416,0.20145 0.376959,0.281992 z m 2.281478,-0.602333 c 0.884225,-0.269542 1.240361,-1.508732 0.648443,-2.218484 -0.564688,-0.802493 -1.926612,-0.745712 -2.410798,0.112861 -0.310435,0.375601 -0.245799,0.81395 0.236605,0.968645 0.515072,0.198085 0.440316,1.009576 1.006772,1.00159 0.186859,5.49e-4 0.33747,0.15154 0.518978,0.135388 z m -5.05402,0.935995 c 0.222782,-0.313762 0.498517,-0.586404 0.833624,-0.778657 0.07501,-0.259978 0.413195,-0.638189 0.240275,-0.888964 -0.270033,-0.325119 -0.465398,-0.702556 -0.562352,-1.115078 -0.312614,-0.333286 -0.8883,-0.05762 -1.2162695,0.157733 -0.7884991,0.556219 -0.760104,1.887414 0.074797,2.385719 0.1896716,0.127819 0.4130327,0.179236 0.6299255,0.239247 z m 1.275684,-1.807853 c 0.412213,-0.376964 0.966172,-0.662726 1.543118,-0.584844 0.179498,-0.394975 0.316416,-0.870766 0.654759,-1.179526 -0.400588,-0.867078 -1.727421,-1.058926 -2.341018,-0.313427 -0.531984,0.558009 -0.569313,1.596542 0.08955,2.072317 z m 4.883896,-0.956226 c 0.686421,-0.42491 0.913514,-1.426155 0.424243,-2.082925 -0.506162,-0.801933 -1.787883,-0.8215766 -2.340256,-0.06075 -0.29989,0.316588 -0.595939,1.285823 0.164739,1.021796 0.683259,-0.08647 1.367931,0.326532 1.627226,0.961449 0.04226,0.04921 0.06063,0.129642 0.124048,0.160431 z m -7.6827431,1.310363 c 0.1044656,-0.560148 0.3411567,-1.146031 0.878602,-1.430057 0.2237365,-0.07823 0.2420233,-0.18478 0.045734,-0.320886 -0.3368801,-0.305252 -0.4603287,-0.750886 -0.5215137,-1.18491 -0.5400115,-0.05468 -1.1271911,0.09022 -1.4568471,0.555122 -0.5143317,0.614024 -0.3863882,1.63365 0.2943732,2.071019 0.2215022,0.168179 0.4890476,0.258707 0.7596744,0.3097 z m 2.0567871,-1.623439 c 0.114411,-0.56257 0.484371,-1.068347 1.003241,-1.330452 0.04651,-0.337357 0.307098,-0.909372 -0.118114,-1.130497 -0.661302,-0.5071413 -1.7673014,-0.3369624 -2.131475,0.454117 -0.4023903,0.659404 -0.1731253,1.632676 0.5404108,1.970839 0.2282122,0.06954 0.4716742,-0.0275 0.7059372,0.036 z m 3.178181,-0.624876 c 0.02391,-0.548306 0.173237,-1.191419 0.636372,-1.59067 0.280537,-0.4195712 -0.610784,-0.8183383 -0.996592,-0.8322122 -0.741082,-0.077534 -1.447711,0.4894612 -1.560336,1.2202852 -0.211073,0.69876 0.744139,0.190307 1.082726,0.533786 0.364763,0.117802 0.547028,0.486012 0.83783,0.668811 z" />

  <path
    id="grape-stalk"
    style="fill:#076E09;fill-opacity:1.000"
    d="m 9.3912233,8.8835399 c 0.7301787,0.2554803 1.4390747,0.6428565 2.0675877,1.0993715 0.128679,0.093393 0.245736,0.2011696 0.363666,0.3073556 -0.02767,-0.147628 -0.0311,-0.4050182 -0.07164,-0.5627043 C 11.603823,9.2180221 11.440716,8.4926965 10.966001,8.2403948 10.521476,8.0006727 9.950139,7.884725 9.4496695,7.8641571 8.8922581,7.8560753 8.1856024,8.3590696 7.6894343,8.6089483" />
</svg>
