<svg xmlns="http://www.w3.org/2000/svg" width="400" height="300" viewBox="0 0 400 300">
  <g>
    <g fill="none" stroke="#0065bd">
      <path d="M1,166.3a75.8,75.8,0,0,0,32.5-13c16.5-11.9,14.4-21.6,30.5-36.6,18.1-16.8,25.7-9.1,62.9-30.5C157,69,165.9,56,169.5,49.7c7.6-12.9,7.3-21.3,10.2-28.4S188,8.2,199.2,2.7" stroke-width="6"/>
      <path d="M200,103.3c-6-1.8-8.3-7.2-12.1-7.9-6.7-1.3-12.6,1.9-19.3,5.8-8.7,5.1-18.6,11.5-32.9,11.3l-2.7-.2c-7.6-.7-13.7-3.5-18.4-4.9-8.8-2.6-18.1-3.2-27.2-4" stroke-width="4"/>
      <path d="M133,112.4a35.4,35.4,0,0,1,13.8,19.2c4.2,15.2-3.8,27.4-5,29.1" stroke-linecap="round" stroke-width="3"/>
      <path d="M168.6,101.3a205.3,205.3,0,0,1,9.8-22.4c7.4-14.5,10.9-16.9,13.1-18.1a19.8,19.8,0,0,1,8.5-2.2" stroke-width="3"/>
    </g>
    <polyline points="172.1 1 172.1 25.9 108.6 89.3 79.2 89.3 43.6 124.9 1 124.9" fill="none" stroke="#6c757d" stroke-width="4"/>
    <g fill="#e37222">
      <rect x="20.3" y="8.2" width="20.3" height="20.31"/>
      <rect x="40.6" y="12.3" width="20.3" height="20.31"/>
      <rect x="46.7" y="32.6" width="20.3" height="20.31"/>
      <rect x="22.4" y="32.6" width="20.3" height="20.31"/>
      <rect x="51.8" y="78.2" width="20.3" height="20.31" transform="translate(80.6 -17.9) rotate(45)"/>
      <rect x="78.2" y="66" width="20.3" height="20.31"/>
      <rect x="102.5" y="55.8" width="20.3" height="20.31" transform="translate(79.7 -60.4) rotate(45)"/>
      <rect x="112.6" y="17.1" width="10.1" height="10.05"/>
      <rect x="15.1" y="83.4" width="10.1" height="10.05"/>
      <polygon points="63.3 144 63.3 182.9 78.2 182.9 78.2 170.5 102.3 170.5 102.3 173.8 110.6 173.8 110.6 144 94 144 94 138.2 83.2 138.2 83.2 148.1 74.1 148.1 74.1 144 63.3 144"/>
      <rect x="144.8" y="176.9" width="10.1" height="10.05"/>
      <rect x="168.2" y="120.3" width="15.1" height="15.08" transform="translate(-10.5 15.8) rotate(-5)"/>
      <rect x="169.8" y="144.9" width="15.1" height="15.08" transform="translate(19.9 -20.5) rotate(7)"/>
    </g>
    <g fill="#a2ad00">
      <circle cx="132" cy="100" r="3"/>
      <circle cx="153" cy="98" r="3"/>
      <circle cx="143" cy="88" r="3"/>
      <circle cx="163" cy="89" r="3"/>
      <circle cx="161" cy="75" r="3"/>
      <circle cx="185" cy="87" r="3"/>
      <circle cx="194" cy="70" r="3"/>
      <circle cx="195" cy="83" r="3"/>
      <circle cx="175" cy="70" r="3"/>
      <circle cx="179" cy="54" r="3"/>
      <circle cx="193" cy="51" r="3"/>
      <circle cx="185" cy="39" r="3"/>
      <circle cx="192" cy="24" r="3"/>
    </g>
    <rect x="1" y="1" width="199" height="199" rx="3" ry="3" fill="none" stroke="#343a40" stroke-width="2"/>
  </g>

  <g>
    <g fill="none" stroke="#0065bd">
      <path d="M399,107.8c-11.2,2.4-17.7,12-20.3,18.5s-2.6,15.6-10.2,28.4c-3.7,6.3-12.5,19.3-42.6,36.6a176.4,176.4,0,0,1-39.6,17.2c-8.4,2.7-14.7,5.1-23.4,13.2-16.1,14.9-14,24.7-30.5,36.6a75.8,75.8,0,0,1-32.5,13" stroke-width="6"/>
      <path d="M399,208.4c-6-1.8-8.3-7.2-12.1-7.9-6.7-1.3-12.6,1.9-19.3,5.8-8.7,5.1-18.6,11.5-32.9,11.3l-2.7-.2c-7.6-.7-13.7-3.5-18.4-4.9-8.8-2.6-18.1-3.2-27.2-4" stroke-width="4"/>
    </g>
    <polyline points="366.1 100 366.1 119.8 302.6 183.3 273.2 183.3 237.6 218.8 200 218.8" fill="none" stroke="#6c757d" stroke-width="4"/>
    <g fill="#e37222">
      <rect x="240.7" y="168.1" width="20.3" height="20.31" transform="translate(199.5 -125.2) rotate(45)"/>
      <rect x="277.2" y="153.9" width="20.3" height="20.31"/>
      <rect x="304.5" y="134.7" width="20.3" height="20.31" transform="translate(194.6 -180.1) rotate(45)"/>
      <polygon points="309.6 243 262.3 243 262.3 281.9 277.2 281.9 277.2 269.9 309.6 269.9 309.6 243"/>
      <rect x="367.9" y="221.6" width="15.1" height="15.08"/>
      <rect x="367.9" y="248" width="15.1" height="15.08"/>
      <rect x="217.1" y="107" width="45.2" height="45.23"/>
    </g>
    <path d="M399,118.4v83.5l-6-4.9c-4.1-3.4-6.3-5.6-10-6a13.8,13.8,0,0,0-8,2c-10.3,5.3-14.2,8.5-19,11a46.8,46.8,0,0,1-25,5c-4.3-.3-15.7-1.8-16-5-.4-5.2,28.7-3.5,48-24,7.8-8.3,15.1-21.3,16-23,4.1-7.4,6.2-11.1,8-17,2.7-8.6,2.1-12.6,6-17A21.4,21.4,0,0,1,399,118.4Z" fill="#a2ad00"/>
    <rect x="200" y="100" width="199" height="199" rx="3" ry="3" fill="none" stroke="#343a40" stroke-width="2"/>
  </g>

  <g>
    <path d="M170.7,250H104a4,4,0,0,1-4-4V217" fill="none" stroke="#343a40" stroke-width="4"/>
    <polygon points="157.4 233.6 154.7 236.6 169.1 250 154.7 263.4 157.4 266.4 175 250 157.4 233.6" fill="#343a40"/>
  </g>
</svg>
