<svg xmlns="http://www.w3.org/2000/svg" width="400" height="200" viewBox="0 0 400 300">
  <polyline points="50.0,171.80773289172637
53.03030303030303,170.44123923250115
56.06060606060606,169.0384332667868
59.09090909090909,167.6003647791211
62.121212121212125,166.128237340388
65.15151515151516,164.62341069421524
68.18181818181819,163.0874024821647
71.21212121212122,161.52188926747405
74.24242424242425,159.92870682014393
77.27272727272728,158.3098496296284
80.3030303030303,156.66746961526752
83.33333333333333,155.00387400888118
86.36363636363636,153.32152238860033
89.39393939393939,151.62302284802598
92.42424242424244,149.91112729013747
95.45454545454545,148.1887258409957
98.4848484848485,146.45884038415574
101.51515151515152,144.7246172227827
104.54545454545455,142.9893188826986
107.57575757575758,141.25631507593943
110.60606060606061,139.5290728508039
113.63636363636364,137.81114596078717
116.66666666666666,136.10616349114787
119.69696969696972,134.41781778810412
122.72727272727273,132.74985174173105
125.75757575757576,131.10604547948162
128.7878787878788,129.49020253282043
131.8181818181818,127.90613554468005
134.84848484848487,126.35765159028048
137.87878787878788,124.84853718822775
140.9090909090909,123.38254308269038
143.93939393939394,121.96336888078865
146.96969696969697,120.59464763208457
150.0,119.27993043919226
153.03030303030306,118.0226711900077
156.06060606060606,116.82621150285958
159.0909090909091,115.693765975987
162.12121212121212,114.6284078321478
165.15151515151516,113.63305504783978
168.1818181818182,112.7104570545835
171.21212121212122,111.86318209697393
174.24242424242425,111.09360532877348
177.27272727272728,110.40389772421483
180.3030303030303,109.79601587693422
183.33333333333334,109.27169275360058
186.36363636363637,108.83242946338493
189.3939393939394,108.47948809797293
192.42424242424244,108.21388568991476
195.45454545454547,108.03638932978889
198.4848484848485,107.94751247498827
201.51515151515153,107.94751247498827
204.54545454545456,108.03638932978889
207.5757575757576,108.21388568991476
210.6060606060606,108.47948809797293
213.63636363636365,108.83242946338493
216.66666666666669,109.27169275360058
219.69696969696972,109.79601587693423
222.72727272727275,110.40389772421484
225.75757575757575,111.09360532877348
228.7878787878788,111.86318209697393
231.8181818181818,112.71045705458351
234.84848484848487,113.63305504783979
237.87878787878788,114.62840783214781
240.90909090909093,115.693765975987
243.93939393939397,116.82621150285958
246.96969696969697,118.02267119000773
250.00000000000003,119.27993043919226
253.03030303030303,120.59464763208457
256.0606060606061,121.96336888078866
259.0909090909091,123.38254308269039
262.1212121212121,124.84853718822777
265.1515151515152,126.35765159028048
268.1818181818182,127.90613554468007
271.21212121212125,129.49020253282043
274.24242424242425,131.10604547948162
277.2727272727273,132.74985174173105
280.3030303030303,134.41781778810414
283.33333333333337,136.10616349114787
286.3636363636364,137.8111459607872
289.3939393939394,139.5290728508039
292.42424242424244,141.25631507593943
295.4545454545455,142.98931888269863
298.4848484848485,144.7246172227827
301.5151515151515,146.45884038415576
304.54545454545456,148.1887258409957
307.5757575757576,149.9111272901375
310.6060606060606,151.62302284802598
313.6363636363637,153.32152238860036
316.6666666666667,155.00387400888118
319.69696969696975,156.66746961526755
322.72727272727275,158.3098496296284
325.75757575757575,159.92870682014393
328.7878787878788,161.52188926747408
331.81818181818187,163.0874024821647
334.8484848484849,164.62341069421527
337.8787878787879,166.12823734038804
340.9090909090909,167.6003647791211
343.939393939394,169.03843326678683
346.969696969697,170.44123923250115
350.0,171.80773289172637
"
 style="fill:none;stroke:#e37222;stroke-width:3" />

 <polyline points="50.0,99.99546021312976
51.5,99.99498278353163
53.0,99.99445514752772
54.49999999999997,99.99387202603835
55.99999999999997,99.99322758503803
57.49999999999997,99.99251537724894
58.99999999999997,99.99172827771483
60.49999999999997,99.99085841261478
61.99999999999994,99.98989708060923
63.49999999999994,99.98883466593705
64.99999999999994,99.98766054240137
66.49999999999994,99.98636296729205
67.99999999999994,99.98492896419403
69.49999999999994,99.98334419352227
70.99999999999991,99.98159280950365
72.49999999999991,99.97965730219448
73.99999999999991,99.97751832297666
75.49999999999991,99.97515449181607
76.9999999999999,99.97254218438987
78.4999999999999,99.9696552969971
79.99999999999989,99.96646498695335
81.49999999999989,99.96293938593736
82.99999999999989,99.9590432835014
84.49999999999987,99.95473777767594
85.99999999999987,99.94997988929204
87.49999999999987,99.94472213630765
88.99999999999986,99.93891206405657
90.49999999999986,99.93249172693672
91.99999999999986,99.92539711661632
93.49999999999984,99.91755753136017
94.99999999999984,99.90889488055994
96.49999999999983,99.89932291799144
97.99999999999983,99.88874639671397
99.49999999999983,99.87706013787226
100.99999999999982,99.8641480049571
102.49999999999982,99.8498817743263
103.9999999999998,99.83411989198255
105.4999999999998,99.81670610575073
106.9999999999998,99.79746796109501
108.49999999999979,99.77621514787236
109.99999999999979,99.75273768433652
111.49999999999979,99.7268039236989
112.99999999999977,99.69815836752916
114.49999999999977,99.66651926925867
115.99999999999977,99.6315760100564
117.49999999999976,99.5929862284104
118.99999999999976,99.55037268390589
120.49999999999974,99.50331983499431
121.99999999999974,99.45137011005497
123.49999999999974,99.3940198508416
124.99999999999973,99.33071490757153
126.49999999999973,99.26084586557181
127.99999999999972,99.18374288468402
129.49999999999972,99.09867013471523
130.99999999999972,99.00481981330958
132.49999999999972,98.9013057369407
133.99999999999972,98.7871565015726
135.49999999999972,98.66130821723355
136.9999999999997,98.52259683067273
138.4999999999997,98.36975006285594
139.9999999999997,98.20137900379088
141.49999999999966,98.01596942659229
142.99999999999966,97.811872906387
144.49999999999966,97.58729785823313
145.99999999999966,97.34030064231348
147.49999999999966,97.06877692486444
148.99999999999966,96.77045353015502
150.49999999999966,96.44288107273647
151.99999999999963,96.08342772032366
153.49999999999963,95.68927450589149
154.99999999999963,95.25741268224344
156.49999999999963,94.78464369215835
157.9999999999996,94.26758241011326
159.4999999999996,93.7026643943005
160.9999999999996,93.08615796566549
162.4999999999996,92.41418199787583
163.9999999999996,91.68273035060797
165.4999999999996,90.88770389851462
166.9999999999996,90.02495108803173
168.49999999999957,89.09031788043897
169.99999999999957,88.07970779778854
171.49999999999957,86.98915256370054
172.99999999999957,85.81489350995157
174.49999999999955,84.55347349164691
175.99999999999955,83.20183851339286
177.49999999999955,81.75744761936483
178.99999999999955,80.21838885585866
180.49999999999955,78.58349830425638
181.99999999999955,76.85247834990233
183.49999999999952,75.02601055951234
184.99999999999952,73.10585786300112
186.49999999999952,71.09495026250106
187.99999999999952,68.99744811276194
189.49999999999952,66.81877721681735
190.9999999999995,64.5656306225803
192.4999999999995,62.24593312018625
193.9999999999995,59.86876601124602
195.4999999999995,57.44425168116675
196.9999999999995,54.98339973124865
198.49999999999946,52.497918747894886
199.99999999999946,50.00000000000089
201.49999999999946,47.5020812521069
202.99999999999946,45.0166002687531
204.49999999999946,42.55574831883499
205.99999999999943,40.13123398875569
207.49999999999943,37.75406687981542
208.99999999999943,35.43436937742132
210.49999999999943,33.18122278318424
211.99999999999943,31.002551887239576
213.49999999999943,28.905049737500406
214.9999999999994,26.894142137000287
216.4999999999994,24.973989440488992
217.9999999999994,23.147521650098952
219.4999999999994,21.416501695744813
220.9999999999994,19.781611144142474
222.49999999999937,18.24255238063624
223.99999999999937,16.798161486608123
225.49999999999937,15.446526508354012
226.99999999999937,14.185106490049293
228.49999999999937,13.010847436300253
229.99999999999937,11.92029220221221
231.49999999999935,10.909682119561708
232.99999999999935,9.975048911968912
234.49999999999935,9.112296101485967
235.99999999999935,8.317269649392571
237.49999999999932,7.585818002124668
238.99999999999932,6.913842034334962
240.49999999999932,6.297335605699914
241.99999999999932,5.732417589887135
243.49999999999932,5.215356307842001
244.99999999999932,4.742587317756886
246.49999999999932,4.3107254941087945
247.9999999999993,3.9165722796766147
249.4999999999993,3.5571189272637866
250.9999999999993,3.2295464698452037
252.4999999999993,2.931223075135776
253.99999999999926,2.659699357686719
255.49999999999926,2.4127021417670136
256.99999999999926,2.1881270936131614
258.49999999999926,1.984030573407864
259.99999999999926,1.7986209962092374
261.49999999999926,1.6302499371441854
262.99999999999926,1.4774031693273741
264.4999999999992,1.3386917827665599
265.9999999999992,1.212843498427489
267.4999999999992,1.0986942630593717
268.9999999999992,0.9951801866904901
270.4999999999992,0.9013298652848221
271.9999999999992,0.8162571153160343
273.4999999999992,0.7391541344282331
274.9999999999992,0.6692850924285239
276.4999999999992,0.6059801491584409
277.9999999999992,0.5486298899450759
279.4999999999992,0.49668016500572776
280.9999999999992,0.4496273160941371
282.4999999999992,0.40701377158963226
283.9999999999992,0.3684239899436079
285.49999999999915,0.333480730741357
286.99999999999915,0.30184163247085394
288.49999999999915,0.27319607630111875
289.99999999999915,0.247262315663491
291.4999999999992,0.2237848521276362
292.99999999999915,0.20253203890499094
294.4999999999991,0.18329389424930298
295.9999999999991,0.16588010801744701
297.49999999999915,0.15011822567370814
298.9999999999991,0.13585199504291268
300.4999999999991,0.1229398621277511
301.9999999999991,0.11125360328604472
303.4999999999991,0.1006770820085876
304.9999999999991,0.0911051194400585
306.4999999999991,0.08244246863982596
307.9999999999991,0.07460288338369025
309.4999999999991,0.06750827306329654
310.9999999999991,0.061087935943433536
312.49999999999903,0.055277863692353435
313.9999999999991,0.05002011070794765
315.4999999999991,0.0452622223240553
316.99999999999903,0.04095671649861288
318.49999999999903,0.037060614062639274
319.99999999999903,0.0335350130466594
321.4999999999991,0.030344703002882056
322.99999999999903,0.027457815610148373
324.499999999999,0.02484550818394382
325.99999999999903,0.022481677023336033
327.49999999999903,0.020342697805517673
328.999999999999,0.018407190496333214
330.499999999999,0.01665580647772913
331.999999999999,0.01507103580597402
333.49999999999903,0.013637032707961794
334.999999999999,0.0123394575986282
336.499999999999,0.011165334062951615
337.999999999999,0.0101029193907749
339.499999999999,0.009141587385215644
340.999999999999,0.00827172228515849
342.4999999999989,0.007484622751050551
343.999999999999,0.006772414961986328
345.499999999999,0.006127973961667976
346.999999999999,0.005544852472283424
348.4999999999989,0.005017216468388597
"
 style="fill:none;stroke:#a2ad00;stroke-width:3" />

  <polyline points="50.0,283.8 100,283.8 100,203.8 300,203.8 300,283.8 350,283.8"
  style="fill:none;stroke:#0065bd;stroke-width:3" />
  <g stroke="#64a9c4" fill="#343a40" stroke-width="4">
      <polyline points="50.0,283.8 350,283.8" stroke-dasharray="15,10">
      </polyline>
  </g>

  <g stroke="#64a9c4" fill="#343a40" stroke-width="4">
      <polyline points="50.0,183.8 350,183.8" stroke-dasharray="15,10">
      </polyline>
  </g>

  <g stroke="#64a9c4" fill="#343a40" stroke-width="4">
      <polyline points="50.0,100 350,100" stroke-dasharray="15,10">
      </polyline>
  </g>

   <g stroke="#64a9c4" fill="#343a40" stroke-width="4">
      <polyline points="200,0 200,400" stroke-dasharray="15,10">
      </polyline>
  </g>
</svg>
