<?xml version="1.0" encoding="UTF-8"?>
<svg width="36px" height="36px" viewBox="0 0 36 36" version="1.1" xmlns="http://www.w3.org/2000/svg" xmlns:xlink="http://www.w3.org/1999/xlink">
    <!-- Generator: Sketch 42 (36781) - http://www.bohemiancoding.com/sketch -->
    <title>Viber_Color</title>
    <desc>Created with Sketch.</desc>
    <defs></defs>
    <g id="Page-1" stroke="none" stroke-width="1" fill="none" fill-rule="evenodd">
        <g id="Social_icons_no_circle" transform="translate(-272.000000, -581.000000)">
            <g id="Color" transform="translate(71.000000, 182.000000)">
                <g id="Viber" transform="translate(201.000000, 399.000000)">
                    <circle fill="#7F4DA0" transform="translate(18.000000, 18.000000) scale(1, -1) translate(-18.000000, -18.000000) " cx="18" cy="18" r="18"></circle>
                    <path d="M20.0813618,16.957863 C20.7822634,16.8086495 21.3195451,16.5422179 21.7784926,16.1123548 C22.3690886,15.554648 22.6929086,14.8796507 22.8351856,13.9098055 C22.931245,13.2774557 22.8921109,13.0287951 22.6679547,12.8227423 C22.4580513,12.6309143 22.0702753,12.6238019 21.8354179,12.804978 C21.664642,12.932881 21.6112617,13.0678699 21.5721276,13.4337552 C21.5259035,13.9204641 21.4404858,14.2614991 21.2946572,14.5776905 C20.9815317,15.2491086 20.4300698,15.5972626 19.4979219,15.7109409 C19.0602446,15.7642404 18.9286028,15.8139673 18.7863192,15.9809121 C18.526574,16.2899912 18.6261784,16.7908918 18.9855281,16.9756339 C19.120781,17.0431251 19.1777063,17.0502374 19.4765196,17.0324731 C19.6615418,17.0218145 19.9355332,16.9898519 20.0813618,16.957863 L20.0813618,16.957863 Z" id="Path" fill="#FFFFFF" transform="translate(20.762374, 14.857308) rotate(-85.000000) translate(-20.762374, -14.857308) "></path>
                    <path d="M19.3235349,17.73611 C21.4832243,17.4199581 23.1554012,16.418124 24.2512349,14.7910854 C24.8667782,13.8745397 25.2510092,12.7981285 25.3826577,11.6435742 C25.4288818,11.2208168 25.4288818,10.449912 25.3791126,10.322009 C25.3328224,10.2012513 25.1833894,10.0378132 25.055286,9.97034838 C24.9165474,9.89928459 24.6212857,9.90636394 24.4575999,9.99165236 C24.1836085,10.130181 24.1018018,10.3504583 24.1018018,10.9472729 C24.1018018,11.8673582 23.8633995,12.8372034 23.4507355,13.5903439 C22.9810802,14.4500504 22.2979831,15.1605433 21.4654397,15.6543645 C20.750292,16.0806616 19.6935924,16.3968201 18.7294005,16.4749632 C18.3806926,16.5034125 18.1885738,16.5744499 18.0569319,16.7272031 C17.854178,16.9581324 17.8327757,17.2707512 18.0035516,17.5300638 C18.1885672,17.8178257 18.4731937,17.8640129 19.3235349,17.73611 L19.3235349,17.73611 Z" id="Path" fill="#FFFFFF" transform="translate(21.652830, 13.862720) rotate(-85.000000) translate(-21.652830, -13.862720) "></path>
                    <path d="M10.9447008,29.2128762 C11.0692526,29.1702616 11.2613714,29.0708079 11.371677,28.9997441 C12.0476312,28.5521101 13.9297841,26.1470939 14.5453274,24.9463194 C14.897521,24.2607031 15.0149167,23.7526902 14.9046771,23.37612 C14.7907605,22.9711335 14.6022528,22.7579684 13.7590082,22.0794315 C13.4210014,21.8059205 13.1043308,21.5252644 13.0545616,21.4506543 C12.9264648,21.2659121 12.8232493,20.9035665 12.8232493,20.647787 C12.8268604,20.054512 13.2110914,18.9781008 13.7163291,18.1503569 C14.1076502,17.5073551 14.8085517,16.6832168 15.5023632,16.050834 C16.3171154,15.3047729 17.0358082,14.7968259 17.8470153,14.3953461 C18.8894687,13.8767076 19.5263549,13.745265 19.9924585,13.9619367 C20.1098542,14.0152362 20.2343465,14.0863 20.27354,14.1182296 C20.309063,14.1502251 20.5830545,14.4841808 20.8819272,14.8535992 C21.458277,15.5783497 21.5899189,15.6955677 21.984851,15.8305567 C22.4865437,16.0010742 22.9988715,15.95492 23.5147443,15.6920281 C23.9061314,15.489515 24.7600177,14.9601982 25.3114796,14.576542 C26.0372624,14.0685291 27.5885052,12.8038295 27.7984812,12.5515632 C28.1684661,12.0968499 28.2325475,11.5142928 27.9834439,10.8712251 C27.7201537,10.1927541 26.6954915,8.92091576 25.9803437,8.37736769 C25.3328224,7.88711911 24.8738749,7.69889662 24.2690261,7.67044737 C23.7709445,7.64559712 23.5645795,7.68821167 22.9276934,7.95110356 C17.9324264,10.0080119 13.9440237,13.0773404 10.7774634,17.2942164 C9.12307769,19.4967657 7.86355814,21.7810242 7.00251578,24.1505513 C6.50088912,25.5324623 6.47600121,26.1328495 6.88866516,26.8397962 C7.06659719,27.1381903 7.82442406,27.8771326 8.37588594,28.289205 C9.29385362,28.9713081 9.7172187,29.2235479 10.0552255,29.2945788 C10.2864784,29.3443254 10.6885006,29.3052506 10.9447008,29.2128762 L10.9447008,29.2128762 Z" id="Path" fill="#FFFFFF" transform="translate(17.366631, 18.490326) rotate(-90.000000) translate(-17.366631, -18.490326) "></path>
                    <path d="M19.0780359,18.7685136 C20.3019664,18.6157604 21.2910461,18.3209126 22.3762381,17.7915891 C23.4435728,17.269345 24.1266765,16.7755568 25.030398,15.8767886 C25.8771876,15.0277341 26.3468429,14.3847059 26.8449245,13.3864708 C27.538736,11.9938682 27.9336681,10.3384133 28.0012286,8.51598056 C28.0261759,7.8943157 28.0083847,7.75572779 27.8660351,7.57813091 C27.5956547,7.23349028 27.0014477,7.29039537 26.7986937,7.67758463 C26.7346123,7.8054876 26.7168211,7.91556695 26.6954782,8.4129542 C26.6598892,9.17674666 26.6065749,9.67053491 26.4998144,10.2602702 C26.0799944,12.5729251 24.9699145,14.4202411 23.1980671,15.7453459 C21.7215541,16.8537065 20.1951992,17.3937149 18.1957101,17.5109329 C17.5196964,17.5500078 17.4022941,17.5748514 17.249316,17.6921024 C16.9646235,17.9159194 16.9504433,18.4416703 17.2243687,18.6867912 C17.3915996,18.8395774 17.5089953,18.8608814 18.0889561,18.8431171 C18.3913805,18.8324651 18.8360884,18.7969365 19.0780359,18.7685136 L19.0780359,18.7685136 Z" id="Path" fill="#FFFFFF" transform="translate(22.518890, 13.099340) rotate(-85.000000) translate(-22.518890, -13.099340) "></path>
                </g>
            </g>
        </g>
    </g>
</svg>