<?xml version="1.0" encoding="UTF-8"?>
<svg width="60px" height="60px" viewBox="0 0 60 60" version="1.1" xmlns="http://www.w3.org/2000/svg" xmlns:xlink="http://www.w3.org/1999/xlink">
    <!-- Generator: Sketch 42 (36781) - http://www.bohemiancoding.com/sketch -->
    <title>GooglePlay_White</title>
    <desc>Created with Sketch.</desc>
    <defs></defs>
    <g id="Page-1" stroke="none" stroke-width="1" fill="none" fill-rule="evenodd" opacity="0.5">
        <g id="Social_icons_white" transform="translate(-560.000000, -769.000000)" fill="#FFFFFF">
            <g id="White" transform="translate(60.000000, 169.000000)">
                <g id="GooglePlay" transform="translate(500.000000, 600.000000)">
                    <path d="M30,60 C13.4314575,60 0,46.5685425 0,30 C0,13.4314575 13.4314575,0 30,0 C46.5685425,0 60,13.4314575 60,30 C60,46.5685425 46.5685425,60 30,60 Z M36.4120331,30.3344557 L18.3569091,12.0425097 C17.611157,12.211002 17,12.8647635 17,14.1788328 L17,46.5538332 C17,47.7913409 17.4807769,48.6616948 18.3698347,48.7485025 L36.4120331,30.3344557 Z M37.2281494,29.4639893 L42.0529421,24.5769711 C42.0529421,24.5769711 21.0864628,12.9905635 19.8312727,12.2969559 C19.3488099,12.0302712 18.8227934,11.937202 18.3571901,12.0422251 L37.2281494,29.4639893 Z M38.0578003,30.3041992 L43.5022954,35.2558116 C43.5022954,35.2558116 49.6688288,31.8368875 49.9327934,31.6903634 C50.8229752,31.1968404 51.7555868,29.9374173 49.9327934,28.9307327 C49.4697206,28.6745016 43.5306093,25.3933117 43.5306093,25.3933117 L38.0578003,30.3041992 Z M18.3701157,48.7485025 C18.7775537,48.8008717 19.2676033,48.6915794 19.8312727,48.3790717 C20.9982314,47.7321409 33.5304628,40.7838255 42.058281,36.0557942 L37.2282715,31.0657959 L18.3701157,48.7485025 Z" id="Combined-Shape"></path>
                </g>
            </g>
        </g>
    </g>
</svg>