<?xml version="1.0" encoding="UTF-8"?>
<svg width="36px" height="36px" viewBox="0 0 36 36" version="1.1" xmlns="http://www.w3.org/2000/svg" xmlns:xlink="http://www.w3.org/1999/xlink">
    <!-- Generator: Sketch 42 (36781) - http://www.bohemiancoding.com/sketch -->
    <title>WhatsApp_Color</title>
    <desc>Created with Sketch.</desc>
    <defs></defs>
    <g id="Page-1" stroke="none" stroke-width="1" fill="none" fill-rule="evenodd">
        <g id="Social_icons_no_circle" transform="translate(-273.000000, -680.000000)" fill="#25D366">
            <g id="Color" transform="translate(71.000000, 182.000000)">
                <g id="WhatsApp" transform="translate(202.000000, 498.000000)">
                    <path d="M17.9888438,35.6906459 L17.9814635,35.6906459 C14.9958808,35.6896161 12.0622518,34.9405344 9.45668517,33.5193146 L0,36 L2.53076835,26.7560558 C0.969666457,24.0506494 0.148223583,20.9818582 0.149562332,17.8378054 C0.153475599,8.00211683 8.15602151,0 17.9886721,0 C22.7607987,0.00205961439 27.2397734,1.8598318 30.6077579,5.23176383 C33.9757423,8.60352423 35.8295669,13.0854168 35.8276789,17.8518794 C35.8237313,27.6853367 27.8243607,35.6866297 17.9888438,35.6906459 L17.9888438,35.6906459 Z M9.8948338,30.2898564 L10.4362549,30.6111906 C12.7127296,31.9620917 15.3222438,32.676898 17.9828365,32.6779278 L17.9888438,32.6779278 C26.1610504,32.6779278 32.8124035,26.0264203 32.8156645,17.8508496 C32.8172092,13.8890097 31.276446,10.1638538 28.4770868,7.36123348 C25.6777276,4.55861319 21.9549745,3.0144173 17.9946793,3.01304422 C9.81615653,3.01304422 3.16471766,9.66388237 3.16147377,17.8388352 C3.16032382,20.64046 3.94421306,23.3688998 5.42842268,25.729544 L5.78096001,26.2905315 L4.28310544,31.7619315 L9.8948338,30.2898564 Z M26.9759712,22.0939127 C26.8645804,21.907981 26.567481,21.7964357 26.1217461,21.5732422 C25.6760112,21.3501516 23.4845815,20.2719606 23.0759197,20.1230677 C22.6674295,19.9743807 22.3701585,19.9000801 22.0730591,20.3461582 C21.7759597,20.7923222 20.9217347,21.7964357 20.6617083,22.0939127 C20.401682,22.3913039 20.1416557,22.4286515 19.6960925,22.205458 C19.2503576,21.9823674 17.8141198,21.5117284 16.1115567,19.993106 C14.7864695,18.8111448 13.8919103,17.3515647 13.6319011,16.9053149 C13.371892,16.4590652 13.6041822,16.2179186 13.8273242,15.9956519 C14.027862,15.7958693 14.2730934,15.4749128 14.4959437,15.2147148 C14.718794,14.9545168 14.7930774,14.768465 14.9416614,14.471194 C15.0902283,14.1735797 15.015962,13.9133818 14.9045025,13.6902569 C14.7930774,13.467132 13.9016591,11.2731278 13.5302248,10.3806282 C13.1683849,9.51147091 12.8009325,9.6292122 12.5273471,9.61548143 C12.2676469,9.60243721 11.9701699,9.59969106 11.6730534,9.59969106 C11.3759197,9.59969106 10.8929916,9.7112535 10.4844327,10.1575033 C10.0758739,10.6037531 8.92439499,11.6821328 8.92439499,13.8759654 C8.92439499,16.0699697 10.5215573,18.1894845 10.7444419,18.4869272 C10.9672922,18.7845414 13.8874821,23.2866182 18.3588878,25.2173523 C19.4223354,25.6766291 20.2525316,25.9508839 20.8999371,26.156279 C21.9676755,26.4956176 22.9394702,26.4477316 23.7073631,26.3329081 C24.5638194,26.2049888 26.3445277,25.2547171 26.7161165,24.2135648 C27.087362,23.1722066 27.087362,22.2797586 26.9759712,22.0939127 L26.9759712,22.0939127 Z" id="Page-1"></path>
                </g>
            </g>
        </g>
    </g>
</svg>