<?xml version="1.0" encoding="UTF-8"?>
<svg width="60px" height="60px" viewBox="0 0 60 60" version="1.1" xmlns="http://www.w3.org/2000/svg" xmlns:xlink="http://www.w3.org/1999/xlink">
    <!-- Generator: Sketch 42 (36781) - http://www.bohemiancoding.com/sketch -->
    <title>TeamViewer_Black</title>
    <desc>Created with Sketch.</desc>
    <defs></defs>
    <g id="Page-1" stroke="none" stroke-width="1" fill="none" fill-rule="evenodd" opacity="0.5">
        <g id="Social_icons_black" transform="translate(-260.000000, -1369.000000)" fill="#000000">
            <g id="Black" transform="translate(60.000000, 169.000000)">
                <g id="TeamViewer" transform="translate(200.000000, 1200.000000)">
                    <path d="M0,30 C0,13.4314567 13.4314567,0 30,0 C46.5685433,0 60,13.4314567 60,30 C60,46.5685433 46.5685433,60 30,60 C13.4314567,60 0,46.5685433 0,30 Z M44.238247,12 L15.7195667,12 C13.6504382,12.026648 11.9900891,13.6948479 12.0000445,15.7371094 L12.0000445,44.2628906 C11.9901691,46.3131902 13.6632694,47.9847222 15.7406604,48 L44.2593407,48 C46.3367316,47.9847222 48.009832,46.3131902 47.9999565,44.2628906 L47.9999565,15.7371094 C48.0046908,14.7487877 47.6106844,13.7992421 46.9049159,13.0980892 C46.1991475,12.3969362 45.2396537,12.0018329 44.238247,12 L44.238247,12 Z" id="Combined-Shape"></path>
                    <path d="M29.9859381,44.8851563 C21.7170415,44.8221531 15.0631009,38.1603291 15.1183963,30 C15.0631009,21.8396709 21.7170415,15.1778469 29.9859381,15.1148438 C38.2589651,15.1721313 44.9193065,21.8356366 44.8640267,30 C44.9193065,38.1643634 38.2589651,44.8278687 29.9859381,44.8851563 L29.9859381,44.8851563 Z M44,29.9981584 L33.5317436,25 L34.3727708,28.2025783 L25.6272292,28.2025783 L26.4682564,25 L16,30.0018416 L26.4753898,35 L25.6343626,31.7974217 L34.3799042,31.7974217 L33.538877,35 L44,30.0018416 L44,29.9981584 Z" id="Combined-Shape"></path>
                </g>
            </g>
        </g>
    </g>
</svg>