<?xml version="1.0" encoding="UTF-8"?>
<svg width="60px" height="60px" viewBox="0 0 60 60" version="1.1" xmlns="http://www.w3.org/2000/svg" xmlns:xlink="http://www.w3.org/1999/xlink">
    <!-- Generator: Sketch 42 (36781) - http://www.bohemiancoding.com/sketch -->
    <title>Utorrent_White</title>
    <desc>Created with Sketch.</desc>
    <defs></defs>
    <g id="Page-1" stroke="none" stroke-width="1" fill="none" fill-rule="evenodd" opacity="0.5">
        <g id="Social_icons_white" transform="translate(-560.000000, -1269.000000)" fill="#FFFFFF">
            <g id="White" transform="translate(60.000000, 169.000000)">
                <g id="Utorrent" transform="translate(500.000000, 1100.000000)">
                    <path d="M30,60 C13.4314565,60 0,46.5685435 0,30 C0,13.4314565 13.4314565,0 30,0 C46.5685435,0 60,13.4314565 60,30 C60,46.5685435 46.5685435,60 30,60 Z M12.0274974,29.0432297 C11.5670323,36.7288111 16.941916,44.2971832 24.225637,46.6246251 C22.4005207,38.6292762 17.9884277,31.4460204 16.4144742,23.3836948 C18.1642416,22.4460204 20.1567998,22.3874158 22.0907533,22.4292762 C23.3633114,24.6478809 24.3093579,27.0255553 25.1465672,29.4367181 C26.0172649,31.7474158 27.0470323,34.4181134 29.5502881,35.3809041 C32.5642416,36.9967181 36.9344742,35.0460204 37.369823,31.5716018 C36.4237765,27.5948576 33.8535439,24.1706716 33.2758695,20.0767181 C34.7828463,19.7418344 36.2981951,19.4488111 37.821916,19.2060204 C39.9484277,22.8478809 41.0200556,27.0255553 43.3558695,30.5502065 C44.2349393,31.9818344 45.8423812,32.576253 47.4581951,32.5929972 C49.3921486,22.5632297 40.7354044,12.416253 30.705637,12.0311367 C21.2786602,11.428346 12.4042416,19.6664855 12.0274974,29.0432297 Z M34.9251719,39.0646251 C32.9493579,39.7678809 30.8061021,39.4999739 28.7465672,39.508346 C29.5837765,42.3967181 30.6637765,45.2348576 32.3716835,47.7297413 C38.7261021,46.5074158 44.0926137,41.9446251 46.6544742,36.0590437 C44.3437765,35.908346 42.049823,35.5818344 39.79773,35.0376483 C38.1986602,36.4022995 36.8005207,38.0599739 34.9251719,39.0646251 Z" id="Combined-Shape"></path>
                </g>
            </g>
        </g>
    </g>
</svg>