<?xml version="1.0" encoding="UTF-8"?>
<svg width="36px" height="33px" viewBox="0 0 36 33" version="1.1" xmlns="http://www.w3.org/2000/svg" xmlns:xlink="http://www.w3.org/1999/xlink">
    <!-- Generator: Sketch 42 (36781) - http://www.bohemiancoding.com/sketch -->
    <title>Amazon_Color</title>
    <desc>Created with Sketch.</desc>
    <defs></defs>
    <g id="Page-1" stroke="none" stroke-width="1" fill="none" fill-rule="evenodd">
        <g id="Social_icons_no_circle" transform="translate(-172.000000, -1183.000000)">
            <g id="Color" transform="translate(71.000000, 182.000000)">
                <g id="Amazon" transform="translate(101.000000, 1001.000000)">
                    <path d="M9.91473934,16.0737592 C9.91473934,14.5660708 10.2860358,13.2789099 11.0286286,12.2100263 C11.7712214,11.1411426 12.783848,10.3332917 14.0732592,9.78647331 C15.2501563,9.28466058 16.7015877,8.92461558 18.4253032,8.70633829 C19.0103763,8.63882985 19.9734967,8.55331916 21.3056632,8.44530566 L21.3056632,7.88948619 C21.3056632,6.49431179 21.1481435,5.55369421 20.8443555,5.07663458 C20.3875484,4.41955244 19.6674584,4.09101138 18.6840855,4.09101138 L18.4298037,4.09101138 C17.7097137,4.15851981 17.0863858,4.38354794 16.5620703,4.77959745 C16.0377547,5.17339667 15.7002125,5.72021503 15.5494437,6.41780223 C15.4594324,6.85435679 15.2411551,7.1063883 14.8923615,7.17164646 L11.127641,6.71258907 C10.7585948,6.62257782 10.5718215,6.42680335 10.5718215,6.1207651 C10.5718215,6.05325666 10.5830729,5.97899737 10.6055757,5.8912364 C10.9768721,3.94924366 11.888236,2.50906363 13.3374172,1.57069634 C14.7888486,0.632329041 16.487811,0.108013502 18.4275534,3.55271368e-15 L19.2444056,3.55271368e-15 C21.7309664,3.55271368e-15 23.6729591,0.643580448 25.0726341,1.93074134 C25.2886611,2.14901863 25.4889361,2.38529816 25.6757095,2.63507938 C25.8624828,2.88711089 26.0132517,3.10763845 26.1190149,3.30566321 C26.2315289,3.50368796 26.3260408,3.7872234 26.4115514,4.1607701 C26.5015627,4.52756595 26.5690711,4.78409801 26.6095762,4.92586573 C26.6545818,5.06763345 26.6860858,5.37592199 26.7085886,5.8439805 C26.7310914,6.312039 26.7400925,6.59107388 26.7400925,6.67658457 L26.7400925,14.5975747 C26.7400925,15.1668959 26.8211026,15.6844606 26.9876235,16.1502688 C27.1451431,16.6228279 27.3071634,16.96037 27.4601825,17.1673959 L28.2117765,18.1665208 C28.3422928,18.3622953 28.4075509,18.5378172 28.4075509,18.6908364 C28.4075509,18.864108 28.3220403,19.0171271 28.1465183,19.1476435 C26.3327916,20.7228404 25.351669,21.5711964 25.1986498,21.7017127 C24.9376172,21.8997375 24.6203275,21.9222403 24.2490311,21.7692212 C23.9429929,21.5081885 23.6774597,21.256157 23.447931,21.0153769 C23.2184023,20.7768471 23.0541318,20.6013252 22.9573697,20.4933117 C22.8583573,20.3807976 22.7008376,20.1715214 22.4848106,19.8542318 C22.264283,19.5346918 22.1112639,19.3231654 22.0235029,19.2129016 C20.7993499,20.5450681 19.59995,21.3731716 18.4230529,21.7017127 C17.6804601,21.9222403 16.7623453,22.0302538 15.6709589,22.0302538 C13.992249,22.0302538 12.6105763,21.5126891 11.5304413,20.4775597 C10.4503063,19.4424303 9.91023878,17.9729966 9.91023878,16.0737592 L9.91473934,16.0737592 Z M15.5449431,15.4166771 C15.5449431,16.2672834 15.7564696,16.9468684 16.1817727,17.4644331 C16.6093262,17.9752469 17.1786473,18.2295287 17.8987373,18.2295287 C17.9662458,18.2295287 18.056257,18.2205276 18.1777722,18.200275 C18.2970371,18.1777722 18.3802975,18.1665208 18.4253032,18.1665208 C19.3389174,17.9257407 20.0500063,17.3384173 20.551819,16.40005 C20.7903488,15.983748 20.9703713,15.5314414 21.0918865,15.0408801 C21.2111514,14.5525691 21.2764096,14.1542693 21.287661,13.848231 C21.2989124,13.5421928 21.3034129,13.0381298 21.3034129,12.3405426 L21.3034129,11.5236905 C20.0365046,11.5236905 19.0756345,11.6137017 18.4230529,11.7869734 C16.5013127,12.3315414 15.5426928,13.5421928 15.5426928,15.4189274 L15.5449431,15.4166771 Z" id="Shape" fill="#221F1F"></path>
                    <path d="M29.2896612,25.9569946 C29.3346668,25.8669834 29.4021753,25.7814727 29.4854357,25.6937117 C30.032254,25.3246656 30.5565696,25.0726341 31.0606326,24.9421178 C31.8864858,24.7260908 32.6943368,24.6045756 33.479685,24.5820728 C33.6979622,24.5595699 33.9072384,24.5730716 34.1007626,24.615827 C35.0841355,24.7058382 35.6759595,24.8678585 35.8694837,25.1108889 C35.9594949,25.2391549 36,25.4349294 36,25.695962 L36,25.9254907 C36,26.6905863 35.7929741,27.5906988 35.3789224,28.6258282 C34.9626203,29.6609576 34.384298,30.4980623 33.6462058,31.1303913 C33.5336917,31.2204026 33.4369296,31.2609076 33.3491686,31.2609076 C33.304163,31.2609076 33.2591574,31.2496562 33.2186523,31.2294037 C33.0836355,31.1618952 33.0543818,31.0426303 33.11964,30.8693587 C33.9297412,28.9701213 34.3302913,27.6514564 34.3302913,26.9088636 C34.3302913,26.6680835 34.2852857,26.4925616 34.199775,26.3845481 C33.9814977,26.1257657 33.3716715,25.9929991 32.3657957,25.9929991 C31.9967496,25.9929991 31.560195,26.0155019 31.0606326,26.0605076 C30.5115639,26.128016 30.0097512,26.1910239 29.5529441,26.256282 C29.4179272,26.256282 29.3346668,26.2337792 29.2896612,26.1887736 C29.2446556,26.143768 29.2356545,26.1032629 29.2581573,26.0582573 C29.2581573,26.0357545 29.2671584,26.0042505 29.2896612,25.9614952 L29.2896612,25.9569946 Z" id="Path" fill="#FF9900"></path>
                    <path d="M0.0675084386,25.4011751 C0.17552194,25.2256532 0.348793599,25.2144018 0.589573697,25.3674209 C6.04425553,28.5313164 11.9804976,30.1155144 18.3960495,30.1155144 C22.6715839,30.1155144 26.8953619,29.3166646 31.0651331,27.7234654 L31.5376922,27.527691 C31.7447181,27.4376797 31.8909864,27.3746718 31.9787473,27.3319165 C32.3072884,27.2014002 32.5638205,27.2644081 32.7505938,27.527691 C32.9351169,27.7887236 32.8743593,28.0295037 32.5705713,28.247781 C32.1767721,28.5313164 31.6749594,28.8598575 31.0628829,29.2289036 C29.1883985,30.3427928 27.0933867,31.2046506 24.7800975,31.8167271 C22.4690586,32.424303 20.2120265,32.7325916 18.0067508,32.7325916 C14.6020753,32.7325916 11.384173,32.136267 8.35304413,30.9481185 C5.3151644,29.75997 2.60132517,28.0835104 0.200275034,25.9232404 C0.0675084386,25.8174772 0,25.7049631 0,25.5969496 C0,25.5294412 0.0225028129,25.4664333 0.0675084386,25.4011751 L0.0675084386,25.4011751 Z" id="Path" fill="#FF9900"></path>
                </g>
            </g>
        </g>
    </g>
</svg>