<?xml version="1.0" encoding="UTF-8"?>
<svg width="32px" height="32px" viewBox="0 0 32 32" version="1.1" xmlns="http://www.w3.org/2000/svg" xmlns:xlink="http://www.w3.org/1999/xlink">
    <!-- Generator: Sketch 42 (36781) - http://www.bohemiancoding.com/sketch -->
    <title>Instagram_Color</title>
    <desc>Created with Sketch.</desc>
    <defs></defs>
    <g id="Page-1" stroke="none" stroke-width="1" fill="none" fill-rule="evenodd">
        <g id="Social_icons_no_circle" transform="translate(-374.000000, -183.000000)">
            <g id="Color" transform="translate(71.000000, 182.000000)">
                <g id="Instagram" transform="translate(303.000000, 1.000000)">
                    <path d="M16.0015,0 C11.6561214,0 11.1107824,0.0190001979 9.40409796,0.0966676736 C7.70074688,0.174668486 6.5380681,0.444337962 5.52072417,0.84000875 C4.46837988,1.24867967 3.57570391,1.79535203 2.68636132,2.68502797 C1.79635205,3.57437057 1.24967968,4.46704653 0.839675413,5.51905749 C0.443004615,6.53673476 0.173001802,7.69974687 0.0963343368,9.40243128 C0.0200002083,11.1091157 0,11.6547881 0,16.0001667 C0,20.3455453 0.0193335347,20.8892176 0.0966676736,22.595902 C0.175001823,24.2992531 0.444671299,25.4619319 0.84000875,26.4792758 C1.24901301,27.5316201 1.79568537,28.4242961 2.68536131,29.3136387 C3.57437057,30.203648 4.46704653,30.7516537 5.51872415,31.1603246 C6.53673476,31.5559954 7.69974687,31.8256649 9.40276461,31.9036657 C11.1094491,31.9813331 11.6544547,32.0003333 15.9995,32.0003333 C20.3452119,32.0003333 20.8888843,31.9813331 22.5955687,31.9036657 C24.2989198,31.8256649 25.4629319,31.5559954 26.4809425,31.1603246 C27.5329535,30.7516537 28.4242961,30.203648 29.3133053,29.3136387 C30.2033146,28.4242961 30.749987,27.5316201 31.1599912,26.4796092 C31.5533287,25.4619319 31.8233315,24.2989198 31.9033323,22.5962354 C31.9799998,20.8895509 32,20.3455453 32,16.0001667 C32,11.6547881 31.9799998,11.1094491 31.9033323,9.40276461 C31.8233315,7.69941354 31.5533287,6.53673476 31.1599912,5.51939083 C30.749987,4.46704653 30.2033146,3.57437057 29.3133053,2.68502797 C28.4232961,1.7950187 27.5332868,1.24834634 26.4799425,0.84000875 C25.4599319,0.444337962 24.2965864,0.174668486 22.5932353,0.0966676736 C20.8865509,0.0190001979 20.3432119,4.73700092e-15 15.9965,4.73700092e-15 L16.0015,0 Z" id="Path" fill="#000000"></path>
                    <path d="M14.5661517,2.88336337 C14.9921562,2.88269669 15.4674945,2.88336337 16.0015,2.88336337 C20.2735445,2.88336337 20.7798831,2.89869686 22.4669007,2.97536433 C24.0269169,3.0466984 24.8735924,3.30736779 25.4375983,3.52637007 C26.1842728,3.81637309 26.7166116,4.16304337 27.2762841,4.7230492 C27.83629,5.28305503 28.1829602,5.81639392 28.4736299,6.56306837 C28.6926322,7.12640757 28.9536349,7.97308305 29.0246357,9.5330993 C29.1013031,11.2197835 29.11797,11.7264555 29.11797,15.9965 C29.11797,20.2665444 29.1013031,20.7732164 29.0246357,22.4599006 C28.9533016,24.0199169 28.6926322,24.8665924 28.4736299,25.4299316 C28.1836269,26.176606 27.83629,26.7082782 27.2762841,27.2679507 C26.7162783,27.8279565 26.1846061,28.1746268 25.4375983,28.4646298 C24.8742591,28.6846321 24.0269169,28.9446348 22.4669007,29.0159689 C20.7802165,29.0926364 20.2735445,29.1093032 16.0015,29.1093032 C11.7291222,29.1093032 11.2227836,29.0926364 9.53609933,29.0159689 C7.97608308,28.9439682 7.1294076,28.6832988 6.56506839,28.4642965 C5.81839394,28.1742935 5.28505505,27.8276232 4.72504922,27.2676174 C4.16504339,26.7076115 3.81837311,26.175606 3.52770341,25.4285982 C3.30870113,24.865259 3.04769841,24.0185835 2.97669767,22.4585673 C2.90003021,20.771883 2.88469672,20.2652111 2.88469672,15.9924999 C2.88469672,11.7197887 2.90003021,11.2157835 2.97669767,9.52909926 C3.04803175,7.96908301 3.30870113,7.12240753 3.52770341,6.55840165 C3.81770643,5.81172721 4.16504339,5.27838832 4.72504922,4.71838248 C5.28505505,4.15837665 5.81839394,3.81170637 6.56506839,3.52103668 C7.12907426,3.30103439 7.97608308,3.04103168 9.53609933,2.96936426 C11.0121147,2.9026969 11.5841207,2.88269669 14.5661517,2.87936333 L14.5661517,2.88336337 Z" id="Path" fill="#FFFFFF"></path>
                    <path d="M24.5422556,5.54005771 C23.4822446,5.54005771 22.6222356,6.39906666 22.6222356,7.45941104 C22.6222356,8.51942208 23.4822446,9.37943104 24.5422556,9.37943104 C25.6022667,9.37943104 26.4622756,8.51942208 26.4622756,7.45941104 C26.4622756,6.39939999 25.6022667,5.53939104 24.5422556,5.53939104 L24.5422556,5.54005771 Z M16.0015,7.78341441 C11.4637861,7.78341441 7.78474776,11.4624527 7.78474776,16.0001667 C7.78474776,20.5378806 11.4637861,24.2152522 16.0015,24.2152522 C20.539214,24.2152522 24.2169189,20.5378806 24.2169189,16.0001667 C24.2169189,11.4624527 20.5388806,7.78341441 16.0011667,7.78341441 L16.0015,7.78341441 Z M16.0015,10.6667778 C18.946864,10.6667778 21.3348889,13.0544693 21.3348889,16.0001667 C21.3348889,18.9455307 18.946864,21.3335556 16.0015,21.3335556 C13.0558027,21.3335556 10.6681111,18.9455307 10.6681111,16.0001667 C10.6681111,13.0544693 13.0558027,10.6667778 16.0015,10.6667778 L16.0015,10.6667778 Z" id="Shape" fill="#000000"></path>
                </g>
            </g>
        </g>
    </g>
</svg>