<?xml version="1.0" encoding="UTF-8"?>
<svg width="60px" height="60px" viewBox="0 0 60 60" version="1.1" xmlns="http://www.w3.org/2000/svg" xmlns:xlink="http://www.w3.org/1999/xlink">
    <!-- Generator: Sketch 42 (36781) - http://www.bohemiancoding.com/sketch -->
    <title>Photoshop_White</title>
    <desc>Created with Sketch.</desc>
    <defs></defs>
    <g id="Page-1" stroke="none" stroke-width="1" fill="none" fill-rule="evenodd" opacity="0.5">
        <g id="Social_icons_white" transform="translate(-60.000000, -1469.000000)" fill="#FFFFFF">
            <g id="White" transform="translate(60.000000, 169.000000)">
                <g id="Photoshop" transform="translate(0.000000, 1300.000000)">
                    <path d="M0,30 C0,13.4314567 13.4314567,0 30,0 C46.5685433,0 60,13.4314567 60,30 C60,46.5685433 46.5685433,60 30,60 C13.4314567,60 0,46.5685433 0,30 Z M39.7651277,27.2748994 L39.7651277,27.2748994 C41.2664707,27.2748994 42.7951066,27.6670469 43.8341031,28.294483 C44.0650431,28.3729125 44.1805131,28.2550306 44.1805131,28.0591945 L44.1805131,24.8036569 C44.1805131,24.6467979 44.1420231,24.4509618 43.9495731,24.3330798 C43.1797733,23.9803847 41.7666073,23.6666667 39.7651277,23.6666667 C35.6854218,23.6666667 33.3375322,26.2158634 33.3375322,29.2746142 C33.3375322,32.0194093 34.723172,33.666429 38.0333113,35.2744716 C40.3812009,36.5291061 40.9200608,37.2744241 40.9200608,38.1371487 C40.9200608,39.195947 40.1502609,39.9802421 38.3027413,39.9802421 C36.7629083,39.9802421 35.065383,39.5486421 33.6027633,38.5685109 C33.4488033,38.4511044 33.3333333,38.5295339 33.3333333,38.7648224 L33.3333333,42.2549355 C33.3333333,42.4510093 33.3718233,42.5686535 33.5257833,42.6470831 C34.5265231,43.2350667 36.2627717,43.6666667 38.3027413,43.6666667 C42.1517405,43.6666667 45,41.6274994 45,37.8234306 C45,35.2747093 43.8453002,33.5492601 40.1887509,31.7453814 C37.7251581,30.4510568 37.3017682,29.8630732 37.3017682,29.0003486 C37.3017682,28.2160535 37.9176081,27.2748994 39.7651277,27.2748994 Z M15,17.386236 L15,17.386236 L15,42.5627341 C15,42.7560861 15.0785266,42.8333333 15.2748429,42.8333333 L18.9489339,42.8333333 C19.1452503,42.8333333 19.2237769,42.7560861 19.2237769,42.5627341 L19.2237769,33.5692884 C19.8519893,33.5692884 20.1660956,33.6081461 21.069151,33.6081461 C26.4482201,33.6081461 30.8333333,31.0589888 30.8333333,25.1109551 C30.8333333,20.5533708 28.2643251,17 21.6680944,17 C19.3125357,17 17.0642966,17.0386236 15.5330287,17.1158708 C15.3367124,17.1158708 15,17.2317416 15,17.386236 Z" id="Combined-Shape"></path>
                    <path d="M21.1476775,29.8614232 C23.9353703,29.8614232 26.553636,28.8958333 26.553636,25.1879682 C26.553636,22.2137172 24.6813725,20.7076311 21.501047,20.7076311 C20.5587283,20.7076311 19.6556729,20.7460206 19.2237769,20.7848783 L19.2237769,29.8227996 C19.7734628,29.8614232 20.2053588,29.8614232 21.1476775,29.8614232 Z" id="Combined-Shape"></path>
                </g>
            </g>
        </g>
    </g>
</svg>