<?xml version="1.0" encoding="UTF-8"?>
<svg width="60px" height="60px" viewBox="0 0 60 60" version="1.1" xmlns="http://www.w3.org/2000/svg" xmlns:xlink="http://www.w3.org/1999/xlink">
    <!-- Generator: Sketch 42 (36781) - http://www.bohemiancoding.com/sketch -->
    <title>Weibo_White</title>
    <desc>Created with Sketch.</desc>
    <defs></defs>
    <g id="Page-1" stroke="none" stroke-width="1" fill="none" fill-rule="evenodd" opacity="0.5">
        <g id="Social_icons_white" transform="translate(-660.000000, -769.000000)" fill="#FFFFFF">
            <g id="White" transform="translate(60.000000, 169.000000)">
                <g id="Weibo" transform="translate(600.000000, 600.000000)">
                    <path d="M30,60 C13.4314575,60 0,46.5685425 0,30 C0,13.4314575 13.4314575,0 30,0 C46.5685425,0 60,13.4314575 60,30 C60,46.5685425 46.5685425,60 30,60 Z M38.69471,29.9039855 C38.194552,29.7502986 37.8513063,29.6511458 38.1111923,28.986822 C38.6799995,27.5441487 38.7388416,26.299781 38.1209993,25.4074058 C36.9686744,23.7416387 33.8108138,23.8308762 30.1920232,25.362787 C30.1920232,25.362787 29.0544088,25.8635087 29.3486194,24.9562605 C29.9027161,23.1467218 29.8193564,21.6346416 28.9563386,20.7571393 C26.9949345,18.7691255 21.772696,20.8315039 17.2957911,25.3578294 C13.9466936,28.7438977 12,32.3381868 12,35.4466273 C12,41.3858803 19.5366953,45 26.9066713,45 C36.5714901,45 42.9999921,39.3235019 42.9999921,34.817007 C43.0048956,32.0903048 40.7345703,30.5435211 38.69471,29.9039855 Z M45.4694908,19.0481144 C43.0328202,16.5065529 39.4392429,15.5390266 36.1220947,16.2032984 C35.3542363,16.3573324 34.867926,17.0697398 35.0317357,17.7869608 C35.1955455,18.5089953 35.9480468,18.9662838 36.7159052,18.8122498 C39.0757899,18.3405206 41.6301989,19.0288601 43.3604398,20.8339465 C45.0906807,22.6390328 45.5616338,25.0987637 44.8193707,27.2552402 C44.5787751,27.9580205 44.9882996,28.7089364 45.7356817,28.9351739 C46.4830639,29.1614113 47.2816366,28.7763263 47.5222322,28.0783596 L47.5222322,28.073546 C48.5665197,25.0458145 47.9061614,21.5848624 45.4694908,19.0481144 Z M41.7237466,22.5537407 C40.4920804,21.2570736 38.6764347,20.7626247 37.0041293,21.1057117 C36.3192805,21.2419374 35.8839502,21.8877483 36.0272907,22.5386045 C36.17594,23.1894608 36.8501711,23.6031834 37.529711,23.4619123 C38.3472825,23.2954141 39.2391787,23.5375932 39.839085,24.1682679 C40.4389914,24.803988 40.6035675,25.6667509 40.3434311,26.4235605 C40.1310748,27.0542352 40.4920804,27.7353638 41.1610026,27.9422251 C41.8299247,28.144041 42.5413181,27.800954 42.7589832,27.1652339 C43.2845649,25.6162969 42.9554127,23.8504079 41.7237466,22.5537407 Z" id="Combined-Shape"></path>
                    <path d="M26.9311888,42.8682147 C21.0469765,43.4581739 15.9669398,40.7661752 15.584466,36.8645124 C15.2019922,32.9578919 19.6641866,29.3189839 25.5434954,28.7290248 C31.4277078,28.1390656 36.5077444,30.8310642 36.8853147,34.7327271 C37.272692,38.6393476 32.8104977,42.2832132 26.9311888,42.8682147 Z M28.1631644,32.1970262 C25.181597,31.4544717 21.8136268,32.8747941 20.5186553,35.3815385 C19.1975755,37.9381187 20.476882,40.7787634 23.4845578,41.7057106 C26.60711,42.667543 30.2831581,41.1924012 31.5624646,38.4364774 C32.8261061,35.7353732 31.249165,32.9595151 28.1631644,32.1970262 Z" id="Combined-Shape"></path>
                    <path d="M27.8864165,36.2835677 C27.6671068,36.642386 27.1814925,36.811828 26.805533,36.6623204 C26.4295736,36.5177963 26.3146971,36.1141258 26.5287851,35.7652747 C26.7480948,35.4164236 27.2128225,35.2469816 27.5835603,35.386522 C27.9595197,35.5160953 28.0952829,35.9197659 27.8864165,36.2835677" id="Path"></path>
                    <path d="M25.886521,38.7255255 C25.2808085,39.6474891 23.9806154,40.0511597 23.0041651,39.6275548 C22.0433798,39.2089334 21.7561886,38.1374622 22.361901,37.2354329 C22.9623918,36.3383872 24.2155901,35.9397002 25.1868187,36.32842 C26.1684906,36.7320906 26.4817902,37.7935947 25.886521,38.7255255" id="Path"></path>
                </g>
            </g>
        </g>
    </g>
</svg>