<?xml version="1.0" encoding="UTF-8"?>
<svg width="60px" height="60px" viewBox="0 0 60 60" version="1.1" xmlns="http://www.w3.org/2000/svg" xmlns:xlink="http://www.w3.org/1999/xlink">
    <!-- Generator: Sketch 42 (36781) - http://www.bohemiancoding.com/sketch -->
    <title>Hola_Black</title>
    <desc>Created with Sketch.</desc>
    <defs></defs>
    <g id="Page-1" stroke="none" stroke-width="1" fill="none" fill-rule="evenodd" opacity="0.5">
        <g id="Social_icons_black" transform="translate(-360.000000, -1369.000000)" fill="#000000">
            <g id="Black" transform="translate(60.000000, 169.000000)">
                <g id="Hola" transform="translate(300.000000, 1200.000000)">
                    <path d="M0,30 C0,13.4314567 13.4314567,0 30,0 C46.5685433,0 60,13.4314567 60,30 C60,46.5685433 46.5685433,60 30,60 C13.4314567,60 0,46.5685433 0,30 Z M45.19,36.29 C45.1702732,32.6823051 44.5622928,29.1019762 43.39,25.69 C42.49,23.09 44.29,19.99 44.29,19.99 C44.29,19.99 43.39,20.09 41.49,21.79 C40.329587,22.8964596 39.6175641,24.3917076 39.49,25.99 C37.09,20.49 32.29,16.89 30.49,14.49 C28.69,12.09 30,9 30,9 C26.4,10.6 24.6,14.4 24,19 C23.8637048,21.5263423 22.5730026,23.8496063 20.5,25.3 C20,21 15.1,20 15.1,20 C16.1,20.3 17.9,25.2 16,28.9 C14.7689097,31.2142967 14.0847209,33.7800048 14,36.4 C14,44.8 19.4,51.69 29.49,51.69 C33.6494838,51.8533701 37.6921153,50.2935254 40.6638375,47.3785876 C43.6355598,44.4636499 45.2730999,40.4518613 45.19,36.29 Z" id="Combined-Shape"></path>
                    <ellipse id="Oval" cx="35.09" cy="34.39" rx="2.2" ry="3.1"></ellipse>
                    <ellipse id="Oval" cx="24" cy="34.39" rx="2.2" ry="3.1"></ellipse>
                    <path d="M29.49,49.38 C23.2334951,49.446814 18.0986965,44.4460832 18,38.19 C18,37.6377153 18.4477153,37.19 19,37.19 C19.270303,37.1721181 19.5351798,37.2717185 19.7267306,37.4632694 C19.9182815,37.6548202 20.0178819,37.919697 20,38.19 C20.0821557,43.3699444 24.3194801,47.518062 29.5,47.49 C31.9938622,47.5193295 34.3969415,46.5553267 36.1791506,44.8106378 C37.9613598,43.0659488 38.976268,40.6839217 39,38.19 C39,37.6377153 39.4477153,37.19 40,37.19 C40.270303,37.1721181 40.5351798,37.2717185 40.7267306,37.4632694 C40.9182815,37.6548202 41.0178819,37.919697 41,38.19 C40.9684967,41.2037141 39.7354357,44.0802068 37.5744739,46.1810898 C35.4135121,48.2819727 32.5034046,49.4334605 29.49,49.38 L29.49,49.38 Z" id="Shape"></path>
                </g>
            </g>
        </g>
    </g>
</svg>