<?xml version="1.0" encoding="UTF-8"?>
<svg width="60px" height="60px" viewBox="0 0 60 60" version="1.1" xmlns="http://www.w3.org/2000/svg" xmlns:xlink="http://www.w3.org/1999/xlink">
    <!-- Generator: Sketch 42 (36781) - http://www.bohemiancoding.com/sketch -->
    <title>Google +_Black</title>
    <desc>Created with Sketch.</desc>
    <defs></defs>
    <g id="Page-1" stroke="none" stroke-width="1" fill="none" fill-rule="evenodd" opacity="0.5">
        <g id="Social_icons_black" transform="translate(-360.000000, -269.000000)" fill="#000000">
            <g id="Black" transform="translate(60.000000, 169.000000)">
                <g id="Google-+" transform="translate(300.000000, 100.000000)">
                    <path d="M0,30 C0,13.4314567 13.4314567,0 30,0 C46.5685433,0 60,13.4314567 60,30 C60,46.5685433 46.5685433,60 30,60 C13.4314567,60 0,46.5685433 0,30 Z M24.5100354,29.1428571 L24.5100354,32.4 L29.9158599,32.4 C29.6979929,33.7978571 28.2818575,36.4985714 24.5100354,36.4985714 C21.2556474,36.4985714 18.6003935,33.8114286 18.6003935,30.5 C18.6003935,27.1885714 21.2556474,24.5014286 24.5100354,24.5014286 C26.3619048,24.5014286 27.6010232,25.2885714 28.3090909,25.9671429 L30.8962613,23.4835714 C29.2350256,21.9364286 27.0835891,21 24.5100354,21 C19.2403778,21 14.978355,25.2478571 14.978355,30.5 C14.978355,35.7521429 19.2403778,40 24.5100354,40 C30.0111767,40 33.6604486,36.1457143 33.6604486,30.7171429 C33.6604486,30.0928571 33.5923652,29.6178571 33.5106651,29.1428571 L24.5100354,29.1428571 Z M44.9350649,29.1428571 L42.2117277,29.1428571 L42.2117277,26.4285714 L39.4883904,26.4285714 L39.4883904,29.1428571 L36.7650531,29.1428571 L36.7650531,31.8571429 L39.4883904,31.8571429 L39.4883904,34.5714286 L42.2117277,34.5714286 L42.2117277,31.8571429 L44.9350649,31.8571429 L44.9350649,29.1428571 Z" id="Combined-Shape"></path>
                </g>
            </g>
        </g>
    </g>
</svg>