<?xml version="1.0" encoding="UTF-8"?>
<svg width="36px" height="37px" viewBox="0 0 36 37" version="1.1" xmlns="http://www.w3.org/2000/svg" xmlns:xlink="http://www.w3.org/1999/xlink">
    <!-- Generator: Sketch 42 (36781) - http://www.bohemiancoding.com/sketch -->
    <title>Pinterest_Color</title>
    <desc>Created with Sketch.</desc>
    <defs></defs>
    <g id="Page-1" stroke="none" stroke-width="1" fill="none" fill-rule="evenodd">
        <g id="Social_icons_no_circle" transform="translate(-573.000000, -281.000000)">
            <g id="Color" transform="translate(71.000000, 182.000000)">
                <g id="Pinterest" transform="translate(502.000000, 99.000000)">
                    <path d="M17.9704301,36.2058758 C8.04417444,36.2058758 0.000384962406,28.1519495 0.000384962406,18.2198653 C0.000384962406,8.28778105 8.04417444,0.235781053 17.9704301,0.235781053 C27.8947609,0.235781053 35.9404752,8.28778105 35.9404752,18.2198653 C35.9404752,28.1519495 27.8947609,36.2058758 17.9704301,36.2058758 Z" id="Fill-1892" fill="#FFFFFF"></path>
                    <path d="M17.9488722,1.9215 C8.95422556,1.9215 1.66303759,9.21645789 1.66303759,18.2200579 C1.66303759,25.1239737 5.95536842,31.0223526 12.0127519,33.3975 C11.8703158,32.1087947 11.7432782,30.1304684 12.0704962,28.7204053 C12.3649925,27.4490368 13.9799098,20.6202474 13.9799098,20.6202474 C13.9799098,20.6202474 13.4929323,19.6436053 13.4929323,18.2007947 C13.4929323,15.9335211 14.8037293,14.2422158 16.4398195,14.2422158 C17.827609,14.2422158 18.4993684,15.2862789 18.4993684,16.5383842 C18.4993684,17.9368895 17.6101053,20.0269421 17.1500752,21.9648158 C16.7670376,23.5887 17.9642707,24.9101526 19.5618647,24.9101526 C22.456782,24.9101526 24.6818647,21.8550158 24.6818647,17.4456789 C24.6818647,13.5429632 21.8812632,10.8153 17.8795789,10.8153 C13.2465564,10.8153 10.526797,14.2942263 10.526797,17.8887316 C10.526797,19.2891632 11.0638195,20.7916895 11.7375038,21.6084474 C11.8703158,21.7702579 11.8895639,21.9108789 11.8510677,22.0765421 C11.7278797,22.5908684 11.4526316,23.6985 11.3987368,23.9238789 C11.3275188,24.2224579 11.161985,24.2860263 10.8520902,24.1434789 C8.81948872,23.1957316 7.54911278,20.2176474 7.54911278,17.8290158 C7.54911278,12.6876789 11.2813233,7.96435263 18.308812,7.96435263 C23.9581353,7.96435263 28.3486316,11.9942053 28.3486316,17.3782579 C28.3486316,22.9953947 24.8089023,27.5164579 19.8987068,27.5164579 C18.247218,27.5164579 16.6958195,26.6573211 16.1645714,25.6440789 C16.1645714,25.6440789 15.3484511,28.7550789 15.1501955,29.5179 C14.7825564,30.9337421 13.7893534,32.7078789 13.127218,33.7904684 C14.6497444,34.2643421 16.2685113,34.5186158 17.9488722,34.5186158 C26.9435188,34.5186158 34.2347068,27.2217316 34.2347068,18.2200579 C34.2347068,9.21645789 26.9435188,1.9215 17.9488722,1.9215" id="Fill-1894" fill="#BD071C"></path>
                </g>
            </g>
        </g>
    </g>
</svg>