<?xml version="1.0" encoding="UTF-8"?>
<svg width="60px" height="60px" viewBox="0 0 60 60" version="1.1" xmlns="http://www.w3.org/2000/svg" xmlns:xlink="http://www.w3.org/1999/xlink">
    <!-- Generator: Sketch 42 (36781) - http://www.bohemiancoding.com/sketch -->
    <title>Digg_Black</title>
    <desc>Created with Sketch.</desc>
    <defs></defs>
    <g id="Page-1" stroke="none" stroke-width="1" fill="none" fill-rule="evenodd" opacity="0.5">
        <g id="Social_icons_black" transform="translate(-560.000000, -869.000000)" fill="#000000">
            <g id="Black" transform="translate(60.000000, 169.000000)">
                <g id="Digg" transform="translate(500.000000, 700.000000)">
                    <path d="M30,60 C13.4314575,60 0,46.5685425 0,30 C0,13.4314575 13.4314575,0 30,0 C46.5685425,0 60,13.4314575 60,30 C60,46.5685425 46.5685425,60 30,60 Z M21,37 L21,20 L17.5385042,20 L17.5385042,24.9567483 L12,24.9567483 L12,37 L21,37 Z M23,37 L27,37 L27,25 L23,25 L23,37 Z M37,41 L37,25 L28,25 L28,36.8253598 L33.5407238,36.8253598 L33.5407238,38.2169065 L28,38.2169065 L28,41 L37,41 Z M23,24 L27,24 L27,20 L23,20 L23,24 Z M48,41 L48,25 L39,25 L39,36.8253598 L44.5398705,36.8253598 L44.5398705,38.2169065 L39,38.2169065 L39,41 L48,41 Z" id="Combined-Shape"></path>
                    <path d="M42.4606846,34.0439388 L42.4606846,27.7830935 L44.5398705,27.7830935 L44.5398705,34.0439388 L42.4606846,34.0439388 Z M31.4620507,34.0439388 L31.4620507,27.7830935 L33.5407238,27.7830935 L33.5407238,34.0439388 L31.4620507,34.0439388 Z M15.4614958,34.1673291 L15.4614958,27.7911225 L17.5379493,27.7911225 L17.5379493,34.1673291 L15.4614958,34.1673291 Z" id="Combined-Shape"></path>
                </g>
            </g>
        </g>
    </g>
</svg>