<?xml version="1.0" encoding="UTF-8"?>
<svg width="60px" height="60px" viewBox="0 0 60 60" version="1.1" xmlns="http://www.w3.org/2000/svg" xmlns:xlink="http://www.w3.org/1999/xlink">
    <!-- Generator: Sketch 42 (36781) - http://www.bohemiancoding.com/sketch -->
    <title>Reddit_White</title>
    <desc>Created with Sketch.</desc>
    <defs></defs>
    <g id="Page-1" stroke="none" stroke-width="1" fill="none" fill-rule="evenodd" opacity="0.5">
        <g id="Social_icons_white" transform="translate(-460.000000, -869.000000)" fill="#FFFFFF">
            <g id="White" transform="translate(60.000000, 169.000000)">
                <g id="Reddit" transform="translate(400.000000, 700.000000)">
                    <path d="M30,60 C13.4314575,60 0,46.5685425 0,30 C0,13.4314575 13.4314575,0 30,0 C46.5685425,0 60,13.4314575 60,30 C60,46.5685425 46.5685425,60 30,60 Z M52,29.6093514 C52,26.8655676 49.7581364,24.6330811 47.0017386,24.6330811 C45.7410568,24.6330811 44.5908068,25.1044865 43.7107727,25.8741081 C40.5791023,23.8712432 36.4388864,22.5679459 31.8540114,22.3397838 L34.2649432,14.753027 L40.8429659,16.2951892 C40.91675,18.5052973 42.7408295,20.2824324 44.9792727,20.2824324 C47.2636477,20.2824324 49.1224205,18.4323243 49.1224205,16.1575135 C49.1224205,13.8827027 47.2631591,12.0325946 44.9792727,12.0325946 C43.3198636,12.0325946 41.889625,13.0109189 41.2280114,14.4158919 L33.8364091,12.6844865 C33.3467955,12.5701622 32.8493636,12.8508649 32.6993523,13.3285946 L29.8452273,22.3101081 C24.96375,22.4054595 20.5352386,23.718 17.2164205,25.8084324 C16.3461591,25.0767568 15.2227841,24.6330811 13.9982614,24.6330811 C11.2418636,24.6335676 9,26.8655676 9,29.6093514 C9,31.3563243 9.91081818,32.8921622 11.2819318,33.7795135 C11.2120568,34.2251351 11.1744318,34.6765946 11.1744318,35.1334054 C11.1744318,42.2093514 19.80375,47.9664324 30.4120455,47.9664324 C41.0193636,47.9664324 49.6496591,42.2093514 49.6496591,35.1334054 C49.6496591,34.7096757 49.6174091,34.2908108 49.5573068,33.8763243 C51.0158864,33.0084324 52,31.4234595 52,29.6093514 Z" id="Combined-Shape"></path>
                    <path d="M49.0300682,31.9002162 C48.3269205,30.0977838 47.0466932,28.4490811 45.3330455,27.0445946 C45.8138636,26.7327568 46.3865455,26.5498378 47.0022273,26.5498378 C48.6968182,26.5498378 50.0752614,27.9222162 50.0752614,29.6093514 C50.0742841,30.5215135 49.6687159,31.3397838 49.0300682,31.9002162 L49.0300682,31.9002162 Z" id="Shape"></path>
                    <path d="M44.9792727,13.9503243 C46.2023295,13.9503243 47.1971932,14.9412973 47.1971932,16.158973 C47.1971932,17.3766486 46.2023295,18.3671351 44.9792727,18.3671351 C43.7557273,18.3671351 42.7608636,17.3766486 42.7608636,16.158973 C42.7608636,14.9412973 43.7557273,13.9503243 44.9792727,13.9503243 L44.9792727,13.9503243 Z" id="Shape"></path>
                    <path d="M47.7244318,35.1343784 C47.7244318,41.1527027 39.9570682,46.0501622 30.4120455,46.0501622 C20.8655568,46.0501622 13.0996591,41.1531892 13.0996591,35.1343784 C13.0996591,34.9222703 13.1113864,34.7130811 13.1299545,34.5043784 C13.1881023,33.8646486 13.3366477,33.239027 13.5628864,32.6328649 C14.1497386,31.0615135 15.2755568,29.6195676 16.8132955,28.3902162 C17.3053523,27.9966486 17.8384545,27.624973 18.4091818,27.2781081 C21.5242386,25.3851892 25.7548523,24.2176216 30.4120455,24.2176216 C35.1366705,24.2176216 39.4244545,25.4182703 42.5497727,27.3598378 C43.1219659,27.7144865 43.6536023,28.0949189 44.1432159,28.4972432 C45.619875,29.7081081 46.6992727,31.1198919 47.2685341,32.6547568 C47.4928182,33.2628649 47.6413636,33.888973 47.6970682,34.5301622 C47.7141705,34.7310811 47.7244318,34.9315135 47.7244318,35.1343784 Z M27.0213977,32.826973 C27.0213977,31.2108649 25.7050114,29.855027 24.0812727,29.855027 C22.4580227,29.855027 21.0966818,31.2108649 21.0966818,32.826973 C21.0966818,34.4425946 22.4585114,35.7546486 24.0812727,35.7546486 C25.7050114,35.7527027 27.0213977,34.4425946 27.0213977,32.826973 Z M36.9631932,29.8540541 C35.3399432,29.8540541 33.9742045,31.2094054 33.9742045,32.8255135 C33.9742045,34.4421081 35.3399432,35.7531892 36.9631932,35.7531892 C38.5869318,35.7531892 39.9042955,34.4430811 39.9042955,32.8255135 C39.9033182,31.2084324 38.5869318,29.8540541 36.9631932,29.8540541 Z M36.1325114,39.9223784 C35.0433409,41.0052973 33.2094886,41.5311892 30.5224773,41.5311892 C30.5141705,41.5311892 30.5068409,41.5336216 30.4990227,41.5336216 C30.4907159,41.5336216 30.483875,41.5311892 30.4760568,41.5311892 C27.7885568,41.5311892 25.9542159,41.0052973 24.8665114,39.9223784 C24.49075,39.5477838 23.8809318,39.5477838 23.5051705,39.9223784 C23.1289205,40.2974595 23.1289205,40.9041081 23.5051705,41.2772432 C24.9715682,42.7376757 27.2520341,43.4484324 30.4760568,43.4484324 C30.4843636,43.4484324 30.4912045,43.4455135 30.4990227,43.4455135 C30.5068409,43.4455135 30.5141705,43.4484324 30.5224773,43.4484324 C33.7460114,43.4484324 36.0269659,42.7376757 37.4948295,41.2782162 C37.8715682,40.9031351 37.8715682,40.296973 37.4958068,39.9233514 C37.1190682,39.5487568 36.50925,39.5487568 36.1325114,39.9223784 Z" id="Combined-Shape"></path>
                    <path d="M10.9252273,29.6093514 C10.9252273,27.9227027 12.3036705,26.5498378 13.9977727,26.5498378 C14.5699659,26.5498378 15.1045341,26.7098919 15.5643409,26.9828108 C13.8497159,28.3697838 12.5665568,30.0019459 11.8428864,31.7858919 C11.2765568,31.2308108 10.9252273,30.4607027 10.9252273,29.6093514 L10.9252273,29.6093514 Z" id="Shape"></path>
                </g>
            </g>
        </g>
    </g>
</svg>