<?xml version="1.0" encoding="UTF-8"?>
<svg width="60px" height="60px" viewBox="0 0 60 60" version="1.1" xmlns="http://www.w3.org/2000/svg" xmlns:xlink="http://www.w3.org/1999/xlink">
    <!-- Generator: Sketch 42 (36781) - http://www.bohemiancoding.com/sketch -->
    <title>MailChimp_Black</title>
    <desc>Created with Sketch.</desc>
    <defs></defs>
    <g id="Page-1" stroke="none" stroke-width="1" fill="none" fill-rule="evenodd" opacity="0.5">
        <g id="Social_icons_black" transform="translate(-360.000000, -1269.000000)">
            <g id="Black" transform="translate(60.000000, 169.000000)">
                <g id="MailChimp" transform="translate(300.000000, 1100.000000)">
                    <path d="M0,30 C0,13.4314567 13.4314567,0 30,0 C46.5685433,0 60,13.4314567 60,30 C60,46.5685433 46.5685433,60 30,60 C13.4314567,60 0,46.5685433 0,30 Z M45.580311,37.0367431 C46.2751841,36.2200788 46.0863084,35.4155607 45.1683006,35.4154502 C44.876197,35.4154502 44.6555416,35.4909773 44.6555416,35.4909773 C44.6555416,35.4909773 44.6589224,34.2993277 44.0963525,33.3712499 C43.6627048,33.8491465 42.4589043,34.7958852 40.8792682,35.530618 C39.398127,36.2196371 37.4215817,36.8230809 34.9722837,36.9030248 L34.972171,36.9030248 C34.2864262,36.932286 33.8620195,36.8227496 33.6232202,37.6061776 C33.6039495,37.6760733 33.5916658,37.7544713 33.5850169,37.8345256 C36.2696205,38.6607964 40.5162799,37.0488892 40.9281776,36.9553637 C40.9454198,36.9516095 40.9562384,36.9492906 40.9666063,36.9491802 C41.2325649,36.97016 38.6866879,38.5438619 35.1539469,38.5438619 C34.5573433,38.5438619 34.0433446,38.4927375 33.637307,38.4130145 C33.8304651,39.0618408 34.3353355,39.3479383 34.9996684,39.4993237 C35.5035247,39.6143811 36.0387099,39.6252022 36.0387099,39.6252022 C40.9332488,39.7596935 44.9607177,36.0441802 45.1270545,35.853154 C45.1270545,35.853154 45.0831038,35.9537464 45.0779198,35.9652301 C44.3605079,37.5462197 40.2062579,40.4131574 36.0712786,40.3310051 L36.0577552,40.3356427 C35.0988394,40.3321093 33.933693,40.0902901 33.3279612,39.3543426 C32.3696088,38.1899667 32.8669288,36.2537568 34.3943874,36.2084847 C34.3961905,36.2083743 34.7474586,36.2004241 34.9037656,36.1965594 C38.6856737,36.0826062 42.0791245,34.7212414 44.5088136,31.8782648 C44.8428395,31.471589 44.469596,30.9129756 43.7456478,30.8959709 L43.7352799,30.8959709 C43.7352799,30.8959709 43.7312229,30.8911125 43.7287436,30.8885728 C42.8702385,29.9879895 42.1156374,29.6697599 41.4442048,29.335409 C40.0366529,28.6329187 40.1690687,29.2397855 39.8416918,25.832012 C39.7531141,24.9133199 39.5755079,23.6603873 38.7518252,23.1799731 C38.5359029,23.0540284 38.2999211,23 38.0549236,23 C37.8128563,22.9999779 37.6948654,23.0484411 37.6471957,23.0588096 C37.1960804,23.156785 36.9394755,23.4073052 36.6180713,23.6977091 C35.0992902,25.069895 33.8854599,24.6974493 32.0736736,24.6817697 C30.3719897,24.6671943 28.8695492,25.8302453 28.5821788,27.6162843 L28.581728,27.6172781 C28.441987,28.5522019 28.5323679,29.5021428 28.6819132,29.9291358 C28.6819132,29.9291358 28.220092,29.6282421 28,29.3616889 C28.2664093,30.9933611 29.7856412,32.0597948 29.7856412,32.0597948 C29.5462785,32.1136797 29.2021101,32.0912645 29.2021101,32.0912645 C29.2035751,32.0924791 30.0692928,32.7633893 30.8207384,32.9973687 C30.6249884,33.1167324 29.6345181,34.0744027 29.1237876,35.3925934 C28.645851,36.6263129 28.8404741,38.1073727 28.8404741,38.1073727 L29.2556399,37.501058 C29.2556399,37.501058 28.9844974,38.8522642 29.5092021,40.1609587 C29.6834275,39.7716188 30.0637707,39.0767475 30.0637707,39.0767475 C30.0637707,39.0767475 30.0034793,40.5278835 30.7163834,41.7161101 C30.7347526,41.4418275 30.8418122,40.743754 30.8418122,40.743754 C30.8418122,40.743754 31.2508925,41.9825529 32.1960596,42.8487957 C33.9654728,44.3871633 38.6501749,44.6649793 42.2157099,41.9197241 C45.0398291,39.7455597 45.5332048,37.126956 45.580311,37.0367431 Z M20.4994811,39 C22.6764361,39 24.3287845,36.7496143 23.9441957,34.2911861 C23.9441957,34.2911861 23.7222176,34.8537238 23.5154603,35.1525058 L23.5154494,35.1525058 C23.5655393,34.27238 23.4379168,33.4016573 23.1885609,32.5739535 C23.1885609,32.5739535 23.0787572,33.0673788 22.8609037,33.6685865 C22.6516781,31.7443692 21.9078431,31.3370995 21.9078431,31.3370995 C21.4769317,31.1203591 21.0004988,31 20.4994811,31 C18.5667724,31 17,32.7908115 17,34.9999412 C17,37.2091885 18.5667724,39 20.4994811,39 Z M29.0315675,21.4508539 C32.8623493,19.0512229 36.6888379,18.7753687 37.9996698,19.749492 C37.9997798,19.749375 37.9998899,19.7492579 38,19.7491303 C37.9975782,19.7427044 37.9764429,19.6865101 37.968297,19.6711583 C37.6354153,18.9876134 36.8586912,18.5107277 36.1668388,18.319399 C36.2881469,18.4412455 36.4638345,18.6642993 36.5348361,18.7968804 C36.0126169,18.4503098 35.318783,18.1450073 34.5946772,18 C34.5946772,18 34.6809799,18.0599285 34.6957306,18.0732271 C34.8400454,18.2031272 35.0321349,18.408446 35.1107319,18.5847846 C34.4186594,18.3161861 33.5437441,18.1657424 32.7948703,18.3050685 C32.7844127,18.3070048 32.7013023,18.3259951 32.7013023,18.3259951 C32.7013023,18.3259951 32.7987231,18.3494431 32.8204088,18.3556561 C33.0687492,18.4268193 33.4232065,18.5730819 33.57941,18.7735813 C32.3361672,18.562241 30.9686442,18.796157 30.2309985,19.1947195 C30.3258874,19.1908363 30.3250068,19.1904959 30.405145,19.1925598 C30.6763819,19.1995389 31.2230389,19.2351683 31.4525555,19.3763031 C30.6683461,19.5304491 29.533532,19.8694767 28.9225884,20.3772469 C29.0304667,20.3651186 29.6426213,20.2897106 29.8930531,20.3285955 C26.5304413,22.1883058 25,25 25,25 L25,24.9998936 C25.9913799,23.7513204 27.2776639,22.5495686 29.0315675,21.4508539 Z M14.3399955,30.6863694 C14.5330942,31.0107612 15.8910121,31.9962072 15.905373,32 C16.435427,31.2727957 17.0423166,30.7381293 17.65373,30.4050365 L17.5952149,30.4070444 C18.8228925,26.1679754 22.1219615,21.8131383 25.4839791,18.9763499 C26.3227293,18.2686783 28.0091418,17.146035 28.0091418,17.146035 L26.1035374,15.485825 L25.9647798,14.5264486 L28.5865087,16.6671667 C28.5863959,16.6673117 28.5861703,16.6674679 28.5859447,16.6676129 C28.4672675,16.7637591 28.3483646,16.862248 28.2293489,16.9629121 C27.9708988,17.181553 27.7117718,17.4105125 27.4532089,17.6484184 C27.076984,17.9944066 26.7017745,18.3592693 26.3306261,18.7387563 C25.5310213,19.5561389 24.7500304,20.4413447 24.0181123,21.3516051 C22.7239777,22.9610368 22.1853726,23.7119458 21.367876,25.2418748 C21.364345,25.2463369 25.8374162,19.9422075 26.9514253,18.8496274 C28.9954488,16.8447344 32.3411991,14.611897 32.3760577,14.5919739 C33.8045841,13.7275166 35.0104214,13.2201915 36,13 C34.3740543,13.164148 32.6347334,13.9904324 31.2698325,14.800843 C31.2673506,14.7987681 29.2853732,13.1423955 29.2828914,13.1403206 L28.5560498,13.415719 C25.9134508,12.7957046 20.0952207,17.1370551 16.5996009,22.6380729 C15.1851646,24.8639383 13.1974451,28.7798425 14.3399955,30.6863694 Z" id="Combined-Shape" fill="#000000"></path>
                    <g id="mc_freddie_bw_web" transform="translate(18.000000, 14.000000)">
                        <path d="M12,1.5519795 L10,1 L11.3216087,2 C11.5141104,1.86877287 11.7420586,1.71710389 12,1.5519795" id="Fill-26" fill="#000000"></path>
                        <path d="M2.83804609,20.8320387 C2.76262272,20.7626986 2.72753059,20.7035555 2.70678285,20.6122916 C2.67594132,20.4463341 2.69201011,20.3498443 2.81423397,20.2502953 C2.90835117,20.1753467 2.98414797,20.139402 2.98440059,20.0922405 C2.98866217,20.0033985 2.67374463,19.9117522 2.45358132,20.1632377 C2.27073979,20.3892305 2.21303273,20.8604631 2.50468733,21.2276854 C2.82936916,21.6344215 3.3343224,21.730274 3.41300786,22.2414027 C3.42335427,22.3139294 3.43104268,22.3946138 3.42563883,22.4741511 C3.42679209,22.5656699 3.40044279,22.6972122 3.39913576,22.7054973 C3.30149286,23.1992909 2.89763132,23.6705235 2.23173755,23.5503254 C2.10906337,23.5296763 2.02956515,23.5122138 2.00591777,23.5514726 C1.95457013,23.6344513 2.23993121,24.0134004 2.76235912,23.9996343 C3.50838816,23.9812795 4.12539458,23.1012715 3.97810648,22.1178906 C3.8448772,21.2608259 3.11095193,21.0846714 2.83804609,20.8320387" id="Fill-18" fill="#000000"></path>
                        <path d="M16.3419431,15.7986296 C16.6865981,15.911307 16.9200316,15.997897 16.9853787,15.9337823 C17.018112,15.9025778 16.9963694,15.8273257 16.9152531,15.7277924 C16.7011728,15.4647113 16.2918875,15.2398582 15.927282,15.1272812 C15.0947342,14.8671098 14.1203821,15.0145035 13.4111216,15.4897953 C13.0584625,15.7305015 12.9023224,15.9784318 13.0635995,15.9985994 C13.1626355,16.011041 13.3688312,15.9389998 13.6597271,15.8458879 C14.8100504,15.4800627 15.459937,15.5222038 16.3419431,15.7986296" id="Fill-15" fill="#000000"></path>
                        <path d="M24.6411257,31 L24.7252717,31.5753315 L24.8081174,31 L25,31 L25,32 L24.8773103,32 L24.8773103,31.2760145 L24.7770038,32 L24.6723321,32 L24.5720256,31.2778224 L24.5720256,32 L24.4492431,32 L24.4492431,31 L24.6411257,31 Z M24,31.2398554 L24,31 L24.4080988,31 L24.4080988,31.2398554 L24.270456,31.2398554 L24.270456,32 L24.1358781,32 L24.1358781,31.2398554 L24,31.2398554 L24,31.2398554 Z" id="Fill-33" fill="#FFFFFF"></path>
                        <path d="M15.6635988,16.5688113 C15.8448725,16.5859364 15.9663945,16.6012216 15.9945545,16.5320136 C16.0569305,16.383549 15.5762927,15.8730515 14.9195288,16.0294418 C14.8376731,16.0469914 14.7618732,16.0825154 14.6873855,16.1105382 C14.6601339,16.1200207 14.6338916,16.1336076 14.6084567,16.1486097 C14.4469657,16.2438592 14.307175,16.3467513 14.1715225,16.5290415 C14.0158855,16.7400622 13.9716773,16.9359393 14.016693,16.9840594 C14.0609011,17.0335947 14.1685955,16.9602824 14.3351331,16.8658821 C14.8928828,16.5407884 15.2875266,16.5321551 15.6635988,16.5688113" id="Fill-16" fill="#000000"></path>
                        <path d="M20.1257275,13.7871631 C20.4379677,13.7505817 20.7415651,13.8248912 21,14 C20.9800031,12.993841 20.5471035,11.8605073 20.2201198,12.0140572 L20.2201198,12.0139425 C20.2198656,12.0141718 20.2199503,12.0140572 20.2197809,12.0141718 C20.0284543,12.0986874 19.9962559,12.5531447 20.000323,12.8281355 C20.0095589,13.158285 20.0471802,13.4634354 20.1257275,13.7871631" id="Fill-25" fill="#000000"></path>
                        <path d="M19.3144401,16.8997255 C19.5708491,17.0655817 19.8617162,17.0210662 19.9641784,16.8004033 C20.0666407,16.5796208 19.9417806,16.2662173 19.685473,16.1003612 C19.429064,15.9343854 19.1381969,15.9789009 19.035836,16.1996834 C18.9333737,16.4203462 19.0581324,16.7337497 19.3144401,16.8997255" id="Fill-20" fill="#000000"></path>
                        <path d="M21.0111422,15.4435365 C20.9534481,15.717912 21.1255026,15.9655245 21.3954754,15.996748 C21.6654483,16.0279716 21.931017,15.830839 21.9888578,15.5565723 C22.0465519,15.2821967 21.8744974,15.0344755 21.6045246,15.0032519 C21.3345517,14.9720284 21.0688362,15.169161 21.0111422,15.4435365" id="Fill-19" fill="#000000"></path>
                        <path d="M3.52152736,20.3753268 C3.70707571,20.6620203 3.64803958,20.8293178 3.72418494,20.9105834 C3.75165579,20.9400153 3.79091858,20.9493096 3.83009402,20.9319126 C3.93527156,20.8844878 3.98699232,20.701819 3.99688444,20.5743202 C3.99689536,20.5743202 3.99696087,20.5734861 3.99696087,20.5734861 L3.99694995,20.5734861 C4.02336171,20.2671316 3.87497981,19.9227657 3.67822913,19.6787307 L3.67770504,19.6780157 L3.67769412,19.6780157 C3.42175446,19.3535492 3.01852474,19.1035563 2.56181639,19.0262229 C2.14569197,18.9555624 1.73633699,19.0460031 1.62205345,19.0832995 L1.62261029,19.0830611 C1.56369427,19.1017689 1.49081354,19.1185701 1.428218,19.1452615 C0.309086564,19.6216541 -0.1756058,20.8129932 0.0568810107,21.9983744 L0.0568264184,21.9981361 C0.114301202,22.2845913 0.231718342,22.6070321 0.414962889,22.8188946 L0.415541568,22.8194903 L0.415552486,22.8194903 C0.644720085,23.0898593 0.895877465,23.0380256 0.78864725,22.7866028 C0.763054376,22.7170147 0.624641033,22.4323469 0.606025055,21.9169896 C0.587026932,21.3868569 0.699803725,20.8361098 1.01042305,20.4151255 C1.2410974,20.1072219 1.52452975,19.9692372 1.5576782,19.9490996 L1.55768912,19.9490996 C1.59741048,19.9261021 1.63879145,19.9103733 1.68357899,19.887495 C1.70105944,19.8795115 1.7213787,19.8727195 1.74360869,19.8659275 C1.88606186,19.8220774 1.80522157,19.8411427 1.94958547,19.8076593 L1.94945445,19.8077785 C2.71909684,19.6297568 3.27527237,19.9946178 3.52152736,20.3753268" id="Fill-17" fill="#000000"></path>
                        <polyline id="Fill-12" fill="#000000" points="11.1107893 1.77964908 11.5 2 11.1851014 0 11 0.99636732 11.1107893 1.77964908"></polyline>
                        <path d="M13,1.66414136 L12,1 L12.3632401,2 C12.5630713,1.89164197 12.7759809,1.77902805 13,1.66414136" id="Fill-14" fill="#000000"></path>
                    </g>
                </g>
            </g>
        </g>
    </g>
</svg>