<?xml version="1.0" encoding="UTF-8"?>
<svg width="29px" height="24px" viewBox="0 0 29 24" version="1.1" xmlns="http://www.w3.org/2000/svg" xmlns:xlink="http://www.w3.org/1999/xlink">
    <!-- Generator: Sketch 42 (36781) - http://www.bohemiancoding.com/sketch -->
    <title>Mail_Color</title>
    <desc>Created with Sketch.</desc>
    <defs></defs>
    <g id="Page-1" stroke="none" stroke-width="1" fill="none" fill-rule="evenodd">
        <g id="Social_icons_no_circle" transform="translate(-276.000000, -1287.000000)" fill="#0971BD">
            <g id="Color" transform="translate(71.000000, 182.000000)">
                <g id="Mail" transform="translate(205.000000, 1105.000000)">
                    <path d="M14.418,10.31628 C12.0744,10.31628 0,3.4692 0,3.4692 L0,2.4 C0,1.0752 1.0752,0 2.4024,0 L26.4336,0 C27.762,0 28.8372,1.0752 28.8372,2.4 L28.818,3.6 C28.818,3.6 16.8744,10.31628 14.418,10.31628 Z M14.418,13.61628 C16.9872,13.61628 28.818,7.2 28.818,7.2 L28.8372,21.6 C28.8372,22.9248 27.762,24 26.4336,24 L2.4024,24 C1.0764,24 0,22.9248 0,21.6 L0.0192,7.2 C0.018,7.2 12.0744,13.61628 14.418,13.61628 Z" id="Shape"></path>
                </g>
            </g>
        </g>
    </g>
</svg>