<?xml version="1.0" encoding="UTF-8"?>
<svg width="36px" height="36px" viewBox="0 0 36 36" version="1.1" xmlns="http://www.w3.org/2000/svg" xmlns:xlink="http://www.w3.org/1999/xlink">
    <!-- Generator: Sketch 42 (36781) - http://www.bohemiancoding.com/sketch -->
    <title>Dailymotion_Color</title>
    <desc>Created with Sketch.</desc>
    <defs></defs>
    <g id="Page-1" stroke="none" stroke-width="1" fill="none" fill-rule="evenodd">
        <g id="Social_icons_no_circle" transform="translate(-472.000000, -781.000000)">
            <g id="Color" transform="translate(71.000000, 182.000000)">
                <g id="Dailymotion" transform="translate(401.000000, 599.000000)">
                    <circle id="Oval" fill="#0064DD" cx="18" cy="18" r="18"></circle>
                    <g id="Square_Icon" transform="translate(12.600000, 9.000000)" fill="#FFFFFF">
                        <path d="M7.53150453,14.9513067 C5.57562645,14.9513067 4.17515434,13.5567493 4.17515434,11.7217343 C4.17515434,9.96017381 5.57562645,8.46770966 7.38663812,8.46770966 C9.17346907,8.46770966 10.5497847,9.88676831 10.5497847,11.7706631 C10.5497847,13.5812014 9.17346907,14.9513067 7.53150453,14.9513067 L7.53150453,14.9513067 Z M14.22,0.18 L10.4049183,0.980961242 L10.4049183,6.70610015 C9.5356472,5.58066352 8.3283303,5.04242189 6.75881106,5.04242189 C5.11684652,5.04242189 3.64392909,5.65406903 2.43658798,6.85291117 C1.08442887,8.17411216 0.36,9.86226711 0.36,11.7462109 C0.36,13.8013934 1.13264506,15.5629784 2.62974319,16.908607 C3.764639,17.9362105 5.11684652,18.45 6.68636575,18.45 C8.23172849,18.45 9.39078079,18.0340682 10.5256282,16.908607 L10.5256282,18.3765945 L14.22,18.3765945 L14.22,0.18 L14.22,0.18 Z" id="Fill-3"></path>
                    </g>
                </g>
            </g>
        </g>
    </g>
</svg>