<?xml version="1.0" encoding="UTF-8"?>
<svg width="36px" height="36px" viewBox="0 0 36 36" version="1.1" xmlns="http://www.w3.org/2000/svg" xmlns:xlink="http://www.w3.org/1999/xlink">
    <!-- Generator: Sketch 42 (36781) - http://www.bohemiancoding.com/sketch -->
    <title>Ubuntu_Color</title>
    <desc>Created with Sketch.</desc>
    <defs></defs>
    <g id="Page-1" stroke="none" stroke-width="1" fill="none" fill-rule="evenodd">
        <g id="Social_icons_no_circle" transform="translate(-572.000000, -1180.000000)">
            <g id="Color" transform="translate(71.000000, 182.000000)">
                <g id="Ubuntu" transform="translate(501.000000, 998.000000)">
                    <ellipse id="Oval" fill="#DD4814" cx="18" cy="18" rx="18" ry="18"></ellipse>
                    <path d="M8.84930371,18.0000649 C8.84930371,19.298115 7.80880196,20.3494496 6.52507707,20.3494496 C5.24092697,20.3494496 4.2,19.2976852 4.2,18.0000649 C4.2,16.7024445 5.24092697,15.6502503 6.52507707,15.6502503 C7.80837674,15.6502503 8.84930371,16.7024445 8.84930371,18.0000649 L8.84930371,18.0000649 Z M22.0747741,29.425055 C22.7172744,30.5485991 24.1379186,30.933716 25.2502817,30.2846909 C26.360944,29.6360956 26.7427873,28.1992143 26.100287,27.0752405 C25.4586372,25.9512666 24.0371426,25.5665796 22.9256299,26.2156046 C21.8141171,26.8650595 21.4331243,28.301511 22.0747741,29.425055 L22.0747741,29.425055 Z M26.100287,8.92445943 C26.7427873,7.80091538 26.3622196,6.36403406 25.2502817,5.715009 C24.1391942,5.06641376 22.7172744,5.45153061 22.0747741,6.57507466 C21.4331243,7.69861871 21.8141171,9.13592984 22.9256299,9.78452509 C24.0371426,10.43398 25.4594876,10.0484333 26.100287,8.92445943 L26.100287,8.92445943 Z M18.2329542,11.2992034 C21.6971829,11.2992034 24.5393218,13.9834164 24.836122,17.4060565 L28.2,17.3531889 C28.0405443,14.8086668 26.9494419,12.520746 25.2677155,10.8341405 C24.3764643,11.1818632 23.3436165,11.1345832 22.4523653,10.6140737 C21.5602636,10.0935642 21.0032316,9.21200762 20.8556819,8.25738201 C20.0197087,8.02828906 19.141214,7.90536113 18.2329542,7.90536113 C16.6430743,7.90536113 15.1390879,8.28145181 13.8034868,8.95067832 L15.4401403,11.9220096 C16.2892952,11.5222789 17.2358244,11.2992034 18.2329542,11.2992034 L18.2329542,11.2992034 Z M11.6042734,18.0000649 C11.6042734,15.7327753 12.7179122,13.7289642 14.4226002,12.5164478 L12.6953758,9.59841393 C10.694738,10.9489018 9.20393324,13.009449 8.57546508,15.424166 C9.31959179,16.0302093 9.79583289,16.958616 9.79583289,18.0000649 C9.79583289,19.0415137 9.31959179,19.9699204 8.57546508,20.5759637 C9.20435846,22.9911106 10.694738,25.0512279 12.6953758,26.4021456 L14.4226002,23.4841117 C12.7179122,22.2715954 11.6042734,20.2673544 11.6042734,18.0000649 L11.6042734,18.0000649 Z M18.2329542,24.7013561 C17.2358244,24.7013561 16.2892952,24.4778508 15.4401403,24.0789797 L13.8034868,27.050311 C15.1390879,27.7195375 16.6430743,28.0951984 18.2329542,28.0951984 C19.141214,28.0951984 20.0197087,27.9727003 20.8556819,27.7431775 C21.0032316,26.7881221 21.5602636,25.9069954 22.4523653,25.3864858 C23.3436165,24.8659763 24.3764643,24.8191262 25.2677155,25.1664191 C26.9494419,23.4789539 28.0405443,21.1906033 28.2,18.6473706 L24.836122,18.5936434 C24.5393218,22.0167133 21.6971829,24.7013561 18.2329542,24.7013561 L18.2329542,24.7013561 Z" id="Shape" fill="#FFFFFF"></path>
                </g>
            </g>
        </g>
    </g>
</svg>