<?xml version="1.0" encoding="UTF-8"?>
<svg width="30px" height="36px" viewBox="0 0 30 36" version="1.1" xmlns="http://www.w3.org/2000/svg" xmlns:xlink="http://www.w3.org/1999/xlink">
    <!-- Generator: Sketch 42 (36781) - http://www.bohemiancoding.com/sketch -->
    <title>Evernote_Color</title>
    <desc>Created with Sketch.</desc>
    <defs>
        <path d="M22.3447683,17.0283396 C21.860201,17.0113372 21.3941139,17.0420533 20.9594866,17.1121727 C21.0818028,16.1203856 21.489544,14.9034095 22.9339751,14.9543547 C24.5329239,15.0095816 24.7569745,16.5268303 24.7627225,17.5545459 C24.0884693,17.252784 23.2538267,17.0604209 22.3447683,17.0283396 L22.3447683,17.0283396 Z M29.1820513,6.26376029 C28.9147358,4.82705584 28.0639615,4.11909742 27.2947726,3.84072934 C26.4648891,3.53958795 24.78213,3.22764939 22.6678339,2.9774532 C20.9668416,2.77634064 18.9675685,2.79235022 17.7599203,2.82983001 C17.6149827,1.83314072 16.9186643,0.922642536 16.1395244,0.607415194 C14.0636723,-0.231474261 10.8562565,-0.0288103837 10.032801,0.202894123 C9.37838775,0.386507844 8.65413256,0.762857023 8.25102688,1.34267676 C7.98068278,1.73000926 7.80576878,2.22624411 7.80440903,2.91949605 C7.80440903,3.31185481 7.81528707,4.23612868 7.82523801,5.05727108 C7.83512714,5.88108175 7.84588157,6.61783258 7.84588157,6.62279679 C7.84551073,7.35619678 7.25346085,7.95308099 6.51974918,7.95401178 L3.15398487,7.95401178 C2.43609581,7.95401178 1.8874963,8.07513851 1.4685062,8.2662606 C1.04883623,8.45756884 0.751606053,8.71552161 0.525762727,9.02063437 C0.076178135,9.62645417 -0.001822364,10.3741883 3.18482684e-05,11.1371874 C3.18482684e-05,11.1371874 0.00664520517,11.7606922 0.156280092,12.9674917 C0.280635907,13.9012596 1.28926571,20.4243558 2.24733703,22.4082403 C2.61873569,23.1801129 2.86621118,23.5016076 3.59596719,23.8417801 C5.22192566,24.5406788 8.93584916,25.3181982 10.6765215,25.540843 C12.4140418,25.7640463 13.5045656,26.2332262 14.1544669,24.865152 C14.1566302,24.8618011 14.2846944,24.5247933 14.4607209,24.0304821 C15.0249576,22.3139203 15.1035144,20.7908386 15.1035144,19.6887219 C15.1035144,19.5766548 15.2673031,19.5715045 15.2673031,19.6887219 C15.2673031,20.4668618 15.1192752,23.2204471 17.1911098,23.9591836 C18.0090027,24.2503966 19.7056685,24.5100248 21.4296529,24.7128748 C22.9884889,24.8927654 24.1197436,25.5086377 24.1197436,29.523815 C24.1197436,31.9666413 23.6087228,32.3015393 20.9370506,32.3015393 C18.7712693,32.3015393 17.9458977,32.3578211 17.9458977,30.6304621 C17.9458977,29.2343394 19.3212285,29.3806595 20.3405506,29.3806595 C20.7958215,29.3806595 20.4654009,29.0406111 20.4654009,28.1793207 C20.4654009,27.322498 20.9991049,26.827194 20.4942648,26.8145973 C16.9695933,26.7172367 14.8956572,26.8105639 14.8956572,31.2362198 C14.8956572,35.2539412 16.4271127,36 21.4296529,36 C25.3519293,36 26.7345533,35.8710546 28.3540839,30.8259899 C28.6746771,29.8300453 29.4496759,26.790645 29.9187297,21.687437 C30.2151564,18.4607004 29.6390528,8.72178893 29.1820513,6.26376029 L29.1820513,6.26376029 Z M2.99631505,6.97258744 L2.9985401,6.97258744 L6.36374815,6.97258744 C6.55658619,6.97258744 6.71166012,6.81491172 6.71209277,6.62279679 C6.71209277,6.62155574 6.67123829,3.72586993 6.67123829,2.920613 L6.67123829,2.91111895 C6.67123829,2.24976205 6.80943889,1.673107 7.05030103,1.18996525 L7.16538578,0.972967216 C7.15252991,0.975139057 7.13961224,0.981468425 7.12681817,0.994313319 L0.588126056,7.50419229 C0.575331994,7.51474124 0.567358882,7.52845487 0.563650458,7.54247876 C0.698946433,7.47527577 0.883811365,7.38343788 0.909955754,7.37195815 C1.47938425,7.11400538 2.16983097,6.97258744 2.99631505,6.97258744 L2.99631505,6.97258744 Z" id="path-1"></path>
    </defs>
    <g id="Page-1" stroke="none" stroke-width="1" fill="none" fill-rule="evenodd">
        <g id="Social_icons_no_circle" transform="translate(-675.000000, -581.000000)">
            <g id="Color" transform="translate(71.000000, 182.000000)">
                <g id="Evernote" transform="translate(604.000000, 399.000000)">
                    <mask id="mask-2" fill="white">
                        <use xlink:href="#path-1"></use>
                    </mask>
                    <use id="Clip-2" fill="#20C05C" xlink:href="#path-1"></use>
                </g>
            </g>
        </g>
    </g>
</svg>