<?xml version="1.0" encoding="UTF-8"?>
<svg width="60px" height="60px" viewBox="0 0 60 60" version="1.1" xmlns="http://www.w3.org/2000/svg" xmlns:xlink="http://www.w3.org/1999/xlink">
    <!-- Generator: Sketch 42 (36781) - http://www.bohemiancoding.com/sketch -->
    <title>Twitch_Black</title>
    <desc>Created with Sketch.</desc>
    <defs></defs>
    <g id="Page-1" stroke="none" stroke-width="1" fill="none" fill-rule="evenodd" opacity="0.5">
        <g id="Social_icons_black" transform="translate(-260.000000, -1069.000000)" fill="#000000">
            <g id="Black" transform="translate(60.000000, 169.000000)">
                <g id="Twitch" transform="translate(200.000000, 900.000000)">
                    <path d="M30,60 C13.4314575,60 0,46.5685425 0,30 C0,13.4314575 13.4314575,0 30,0 C46.5685425,0 60,13.4314575 60,30 C60,46.5685425 46.5685425,60 30,60 Z M15.413944,14.000036 L13.066144,20.261036 L13.066144,45.302036 L21.670744,45.302036 L21.670744,50.000036 L26.368504,50.000036 L31.061584,45.302036 L38.103184,45.302036 L47.493904,35.914676 L47.493904,14.000036 L15.413944,14.000036 Z" id="Combined-Shape"></path>
                    <path d="M18.541864,17.128556 L44.364664,17.128556 L44.364664,34.346276 L38.885944,39.825356 L30.280024,39.825356 L25.588264,44.516876 L25.588264,39.825356 L18.541864,39.825356 L18.541864,17.128556 Z M27.14992,32.78312 L30.28,32.78312 L30.28,23.39288 L27.14992,23.39288 L27.14992,32.78312 Z M35.75644,32.78312 L38.88592,32.78312 L38.88592,23.39288 L35.75644,23.39288 L35.75644,32.78312 Z" id="Combined-Shape"></path>
                </g>
            </g>
        </g>
    </g>
</svg>