<?xml version="1.0" encoding="UTF-8"?>
<svg width="60px" height="60px" viewBox="0 0 60 60" version="1.1" xmlns="http://www.w3.org/2000/svg" xmlns:xlink="http://www.w3.org/1999/xlink">
    <!-- Generator: Sketch 42 (36781) - http://www.bohemiancoding.com/sketch -->
    <title>Pixate_Black</title>
    <desc>Created with Sketch.</desc>
    <defs></defs>
    <g id="Page-1" stroke="none" stroke-width="1" fill="none" fill-rule="evenodd" opacity="0.5">
        <g id="Social_icons_black" transform="translate(-260.000000, -969.000000)" fill="#000000">
            <g id="Black" transform="translate(60.000000, 169.000000)">
                <g id="Pixate" transform="translate(200.000000, 800.000000)">
                    <path d="M30,60 C13.4314575,60 0,46.5685425 0,30 C0,13.4314575 13.4314575,0 30,0 C46.5685425,0 60,13.4314575 60,30 C60,46.5685425 46.5685425,60 30,60 Z M32.6419753,22.7525454 L31,29 L32.728395,29 C38.6049382,29 40.5061728,25.8762727 42.5802469,20.9303711 L45,15.1167675 C36.7901234,14.509376 34.3703703,16.1580099 32.6419753,22.7525454 Z M16,15.1461588 L18.4197531,20.9474548 C20.4938272,25.8828857 22.3950617,29 28.271605,29 L30,29 L28.3580247,22.7657715 C26.6296296,16.0986104 24.2098765,14.4534667 16,15.1461588 Z M28.3580247,37.2474547 L30,31 L28.271605,31 C22.3950617,31 20.4938272,34.1237273 18.4197531,39.0696289 L16,44.8832325 C24.2098765,45.490624 26.6296296,43.8419901 28.3580247,37.2474547 Z M45,44.8538412 L42.5802469,39.0525452 C40.5061728,34.1171143 38.6049382,31 32.728395,31 L31,31 L32.6419753,37.2342285 C34.3703703,43.9013896 36.7901234,45.5465333 45,44.8538412 Z" id="Combined-Shape"></path>
                </g>
            </g>
        </g>
    </g>
</svg>