<?xml version="1.0" encoding="UTF-8"?>
<svg width="60px" height="60px" viewBox="0 0 60 60" version="1.1" xmlns="http://www.w3.org/2000/svg" xmlns:xlink="http://www.w3.org/1999/xlink">
    <!-- Generator: Sketch 42 (36781) - http://www.bohemiancoding.com/sketch -->
    <title>HTML5_White</title>
    <desc>Created with Sketch.</desc>
    <defs></defs>
    <g id="Page-1" stroke="none" stroke-width="1" fill="none" fill-rule="evenodd" opacity="0.5">
        <g id="Social_icons_white" transform="translate(-260.000000, -1169.000000)" fill="#FFFFFF">
            <g id="White" transform="translate(60.000000, 169.000000)">
                <g id="HTML5" transform="translate(200.000000, 1000.000000)">
                    <path d="M0,30 C0,13.4314567 13.4314567,0 30,0 C46.5685433,0 60,13.4314567 60,30 C60,46.5685433 46.5685433,60 30,60 C13.4314567,60 0,46.5685433 0,30 Z M16.8963675,46.4013127 L29.8935653,50 L42.9266486,46.3962371 L45.826087,14 L14,14 L16.8963675,46.4013127 Z" id="Combined-Shape"></path>
                    <g id="icon" transform="translate(20.000000, 20.000000)">
                        <polygon id="Path" points="4.80090361 8.72088353 4.44297189 4.53654618 19.9287149 4.54116466 20.2843373 0.504618474 0 0.5 1.07379518 12.8313253 15.1231928 12.8313253 14.6220884 18.1056225 10.1421687 19.3433735 5.59297189 18.0963855 5.30431727 14.8495984 1.28624498 14.8495984 1.79427711 21.2692771 10.1421687 23.5 18.4230924 21.2785141 19.5684739 8.72088353 4.80090361 8.72088353"></polygon>
                    </g>
                </g>
            </g>
        </g>
    </g>
</svg>