<?xml version="1.0" encoding="UTF-8"?>
<svg width="37px" height="36px" viewBox="0 0 37 36" version="1.1" xmlns="http://www.w3.org/2000/svg" xmlns:xlink="http://www.w3.org/1999/xlink">
    <!-- Generator: Sketch 42 (36781) - http://www.bohemiancoding.com/sketch -->
    <title>Xbox_Color</title>
    <desc>Created with Sketch.</desc>
    <defs></defs>
    <g id="Page-1" stroke="none" stroke-width="1" fill="none" fill-rule="evenodd">
        <g id="Social_icons_no_circle" transform="translate(-172.000000, -1082.000000)" fill="#7EB900">
            <g id="Color" transform="translate(71.000000, 182.000000)">
                <g id="Xbox" transform="translate(101.000000, 900.000000)">
                    <path d="M14.101221,35.2961888 C9.77135307,34.189443 4.9429306,31.0884241 4.9429306,29.4143428 C4.9429306,27.1731744 9.8434464,20.900348 15.2150955,16.2656211 L18.2369594,13.658319 L19.592256,14.6022987 C21.7212287,16.0851556 28.5332208,23.1408767 30.0572146,25.4416852 C32.529975,29.1748715 32.4196883,30.0072392 29.1394842,32.3682259 C25.183258,35.2157927 18.7142512,36.4753135 14.101221,35.2961888 L14.101221,35.2961888 Z M2.89211604,27.5848477 C0.0687904979,23.4382813 -0.838270143,16.610177 0.845355892,12.1774301 C1.88813143,9.43194804 4.346112,5.69327317 5.68518209,4.81588082 C6.65244144,4.18210734 6.83777492,4.18878575 8.16837323,4.90536157 C8.95923181,5.33126579 10.6100334,6.57874124 11.8368194,7.67752952 L14.0673467,9.67532663 L11.6787023,12.6335378 C6.87901561,18.5776904 3.18238005,25.9967808 3.89756872,28.2501443 C4.25842804,29.3871111 4.00512402,29.219503 2.89211604,27.5848477 L2.89211604,27.5848477 Z M32.7630919,27.4559948 C32.7152317,23.988098 30.0013777,18.7483338 25.0882332,12.6377703 L22.7131095,9.68379158 L24.8425474,7.7296875 C26.0137354,6.65493005 27.677981,5.39748137 28.5408646,4.93535721 L30.1097524,4.09513185 L31.8476107,5.78893682 C32.8034363,6.72052977 34.1989408,8.72604495 34.9487294,10.2456373 C36.123447,12.6264318 36.3322753,13.5514103 36.4587331,16.9339748 C36.6283351,21.4707449 35.9377551,24.3996629 34.0244265,27.2584372 L32.7859038,29.1089602 L32.7631132,27.4559948 L32.7630919,27.4559948 Z M16.2606537,4.90239453 C15.3260011,4.34902654 13.3628149,3.57186049 11.8980168,3.17535824 C10.4332187,2.77885643 9.32096605,2.31494658 9.42633619,2.14444789 C9.53171059,1.97394921 10.9734962,1.39857679 12.6303028,0.865842563 C16.9668372,-0.528540217 22.0994882,-0.221323107 25.923623,1.66152071 C27.4120013,2.39433503 28.2282837,2.89636276 27.7375821,2.77713775 C26.6447484,2.51161175 21.883268,3.95414824 19.9769558,5.1282948 C18.3038672,6.15879202 18.3917646,6.16413457 16.2606537,4.90239453 L16.2606537,4.90239453 Z" id="path3505"></path>
                </g>
            </g>
        </g>
    </g>
</svg>