<?xml version="1.0" encoding="UTF-8"?>
<svg width="60px" height="60px" viewBox="0 0 60 60" version="1.1" xmlns="http://www.w3.org/2000/svg" xmlns:xlink="http://www.w3.org/1999/xlink">
    <!-- Generator: Sketch 42 (36781) - http://www.bohemiancoding.com/sketch -->
    <title>Picasa_White</title>
    <desc>Created with Sketch.</desc>
    <defs></defs>
    <g id="Page-1" stroke="none" stroke-width="1" fill="none" fill-rule="evenodd" opacity="0.5">
        <g id="Social_icons_white" transform="translate(-260.000000, -769.000000)" fill="#FFFFFF">
            <g id="White" transform="translate(60.000000, 169.000000)">
                <g id="Picasa" transform="translate(200.000000, 600.000000)">
                    <path d="M30,60 C13.4314575,60 0,46.5685425 0,30 C0,13.4314575 13.4314575,0 30,0 C46.5685425,0 60,13.4314575 60,30 C60,46.5685425 46.5685425,60 30,60 Z M29.9998262,12 C20.0590945,12 12,20.0590945 12,29.9998262 C12,39.9409055 20.0590945,48 29.9998262,48 C39.9409055,48 48,39.9409055 48,29.9998262 C48,20.0590945 39.9409055,12 29.9998262,12 Z" id="Combined-Shape"></path>
                    <g id="Group" transform="translate(15.000000, 15.000000)">
                        <polygon id="Fill-13" points="15.0975059 7.99330842 18.4325193 10.4373859 21.7675328 12.8925871 20.4747545 16.8355783 19.1712001 20.7573651 15.032502 20.7462414 10.8938038 20.7246893 9.62257756 16.7813505 8.37359868 12.8380116 11.7301642 10.4047102"></polygon>
                        <path d="M13.1547581,22 C12.2465711,22 11.7697817,22.5963333 12.110044,23.5313333 L14.4524697,29.9793333 C14.692096,29.9896667 14.9355929,30 15.1780341,30 C21.2024703,30 26.4249855,26.75 29,22 L13.1547581,22" id="Fill-14"></path>
                        <path d="M21.0824337,18.539717 C20.8084502,19.3731193 21.2258858,20.0057551 22.2088475,19.9999605 L28.9862138,19.9641702 C29.0683758,19.7477242 29.1515316,19.5275288 29.2247485,19.3049473 C31.0429128,13.7768826 29.558697,7.91988807 25.86406,4 L21.0824337,18.539717" id="Fill-16"></path>
                        <path d="M7.34402711,14.8492592 C7.07732279,13.9808579 6.35989833,13.7176525 5.55470206,14.3454593 L0,18.6701542 C0.060321943,18.9026229 0.121999435,19.1389779 0.193165772,19.37074 C1.96351313,25.1312294 6.64456368,29.0736582 12,30 L7.34402711,14.8492592" id="Fill-17"></path>
                        <path d="M12.4860765,7.78461714 C13.1892924,7.25657071 13.1937194,6.49061327 12.3573523,5.92228923 L6.59370639,2 C6.40164162,2.1307316 6.20651199,2.26385254 6.01887424,2.40482421 C1.35244946,5.90863579 -0.702030635,11.6092843 0.212660817,17 L12.4860765,7.78461714" id="Fill-18"></path>
                        <path d="M20.2703704,10.7270776 C20.9737374,11.2479814 21.696633,11.0239515 21.9878788,10.0488032 L24,3.32618983 C23.8205387,3.1801581 23.6380471,3.03172115 23.4505051,2.89256151 C18.7851852,-0.563064495 12.8124579,-0.847225051 8,1.6380631 L20.2703704,10.7270776" id="Fill-19"></path>
                    </g>
                </g>
            </g>
        </g>
    </g>
</svg>