<?xml version="1.0" encoding="UTF-8"?>
<svg width="60px" height="60px" viewBox="0 0 60 60" version="1.1" xmlns="http://www.w3.org/2000/svg" xmlns:xlink="http://www.w3.org/1999/xlink">
    <!-- Generator: Sketch 42 (36781) - http://www.bohemiancoding.com/sketch -->
    <title>Instagram_White</title>
    <desc>Created with Sketch.</desc>
    <defs></defs>
    <g id="Page-1" stroke="none" stroke-width="1" fill="none" fill-rule="evenodd" opacity="0.5">
        <g id="Social_icons_white" transform="translate(-360.000000, -169.000000)" fill="#FFFFFF">
            <g id="White" transform="translate(60.000000, 169.000000)">
                <g id="Instagram" transform="translate(300.000000, 0.000000)">
                    <path d="M0,30 C0,13.4314567 13.4314567,0 30,0 C46.5685433,0 60,13.4314567 60,30 C60,46.5685433 46.5685433,60 30,60 C13.4314567,60 0,46.5685433 0,30 Z M30.0015,14 C25.6561214,14 25.1107824,14.0190002 23.404098,14.0966677 C21.7007469,14.1746685 20.5380681,14.444338 19.5207242,14.8400088 C18.4683799,15.2486797 17.5757039,15.795352 16.6863613,16.685028 C15.796352,17.5743706 15.2496797,18.4670465 14.8396754,19.5190575 C14.4430046,20.5367348 14.1730018,21.6997469 14.0963343,23.4024313 C14.0200002,25.1091157 14,25.6547881 14,30.0001667 C14,34.3455453 14.0193335,34.8892176 14.0966677,36.595902 C14.1750018,38.2992531 14.4446713,39.4619319 14.8400088,40.4792758 C15.249013,41.5316201 15.7956854,42.4242961 16.6853613,43.3136387 C17.5743706,44.203648 18.4670465,44.7516537 19.5187242,45.1603246 C20.5367348,45.5559954 21.6997469,45.8256649 23.4027646,45.9036657 C25.1094491,45.9813331 25.6544547,46.0003333 29.9995,46.0003333 C34.3452119,46.0003333 34.8888843,45.9813331 36.5955687,45.9036657 C38.2989198,45.8256649 39.4629319,45.5559954 40.4809425,45.1603246 C41.5329535,44.7516537 42.4242961,44.203648 43.3133053,43.3136387 C44.2033146,42.4242961 44.749987,41.5316201 45.1599912,40.4796092 C45.5533287,39.4619319 45.8233315,38.2989198 45.9033323,36.5962354 C45.9799998,34.8895509 46,34.3455453 46,30.0001667 C46,25.6547881 45.9799998,25.1094491 45.9033323,23.4027646 C45.8233315,21.6994135 45.5533287,20.5367348 45.1599912,19.5193908 C44.749987,18.4670465 44.2033146,17.5743706 43.3133053,16.685028 C42.4232961,15.7950187 41.5332868,15.2483463 40.4799425,14.8400088 C39.4599319,14.444338 38.2965864,14.1746685 36.5932353,14.0966677 C34.8865509,14.0190002 34.3432119,14 29.9965,14 L30.0015,14 Z" id="Combined-Shape"></path>
                    <path d="M28.5661517,16.8833634 C28.9921562,16.8826967 29.4674945,16.8833634 30.0015,16.8833634 C34.2735445,16.8833634 34.7798831,16.8986969 36.4669007,16.9753643 C38.0269169,17.0466984 38.8735924,17.3073678 39.4375983,17.5263701 C40.1842728,17.8163731 40.7166116,18.1630434 41.2762841,18.7230492 C41.83629,19.283055 42.1829602,19.8163939 42.4736299,20.5630684 C42.6926322,21.1264076 42.9536349,21.9730831 43.0246357,23.5330993 C43.1013031,25.2197835 43.11797,25.7264555 43.11797,29.9965 C43.11797,34.2665444 43.1013031,34.7732164 43.0246357,36.4599006 C42.9533016,38.0199169 42.6926322,38.8665924 42.4736299,39.4299316 C42.1836269,40.176606 41.83629,40.7082782 41.2762841,41.2679507 C40.7162783,41.8279565 40.1846061,42.1746268 39.4375983,42.4646298 C38.8742591,42.6846321 38.0269169,42.9446348 36.4669007,43.0159689 C34.7802165,43.0926364 34.2735445,43.1093032 30.0015,43.1093032 C25.7291222,43.1093032 25.2227836,43.0926364 23.5360993,43.0159689 C21.9760831,42.9439682 21.1294076,42.6832988 20.5650684,42.4642965 C19.8183939,42.1742935 19.2850551,41.8276232 18.7250492,41.2676174 C18.1650434,40.7076115 17.8183731,40.175606 17.5277034,39.4285982 C17.3087011,38.865259 17.0476984,38.0185835 16.9766977,36.4585673 C16.9000302,34.771883 16.8846967,34.2652111 16.8846967,29.9924999 C16.8846967,25.7197887 16.9000302,25.2157835 16.9766977,23.5290993 C17.0480318,21.969083 17.3087011,21.1224075 17.5277034,20.5584017 C17.8177064,19.8117272 18.1650434,19.2783883 18.7250492,18.7183825 C19.2850551,18.1583766 19.8183939,17.8117064 20.5650684,17.5210367 C21.1290743,17.3010344 21.9760831,17.0410317 23.5360993,16.9693643 C25.0121147,16.9026969 25.5841207,16.8826967 28.5661517,16.8793633 L28.5661517,16.8833634 Z M38.5422556,19.5400577 C37.4822446,19.5400577 36.6222356,20.3990667 36.6222356,21.459411 C36.6222356,22.5194221 37.4822446,23.379431 38.5422556,23.379431 C39.6022667,23.379431 40.4622756,22.5194221 40.4622756,21.459411 C40.4622756,20.3994 39.6022667,19.539391 38.5422556,19.539391 L38.5422556,19.5400577 Z M30.0015,21.7834144 C25.4637861,21.7834144 21.7847478,25.4624527 21.7847478,30.0001667 C21.7847478,34.5378806 25.4637861,38.2152522 30.0015,38.2152522 C34.539214,38.2152522 38.2169189,34.5378806 38.2169189,30.0001667 C38.2169189,25.4624527 34.5388806,21.7834144 30.0011667,21.7834144 L30.0015,21.7834144 Z" id="Combined-Shape"></path>
                    <path d="M30.0015,24.6667778 C32.946864,24.6667778 35.3348889,27.0544693 35.3348889,30.0001667 C35.3348889,32.9455307 32.946864,35.3335556 30.0015,35.3335556 C27.0558027,35.3335556 24.6681111,32.9455307 24.6681111,30.0001667 C24.6681111,27.0544693 27.0558027,24.6667778 30.0015,24.6667778 L30.0015,24.6667778 Z" id="Shape"></path>
                </g>
            </g>
        </g>
    </g>
</svg>