<?xml version="1.0" encoding="UTF-8"?>
<svg width="60px" height="60px" viewBox="0 0 60 60" version="1.1" xmlns="http://www.w3.org/2000/svg" xmlns:xlink="http://www.w3.org/1999/xlink">
    <!-- Generator: Sketch 42 (36781) - http://www.bohemiancoding.com/sketch -->
    <title>Visa_Black</title>
    <desc>Created with Sketch.</desc>
    <defs></defs>
    <g id="Page-1" stroke="none" stroke-width="1" fill="none" fill-rule="evenodd" opacity="0.5">
        <g id="Social_icons_black" transform="translate(-660.000000, -969.000000)" fill="#000000">
            <g id="Black" transform="translate(60.000000, 169.000000)">
                <g id="Visa" transform="translate(600.000000, 800.000000)">
                    <path d="M30,60 C13.4314575,60 0,46.5685425 0,30 C0,13.4314575 13.4314575,0 30,0 C46.5685425,0 60,13.4314575 60,30 C60,46.5685425 46.5685425,60 30,60 Z M30.6316441,28.8426442 C30.611146,30.4718207 32.0719086,31.3810274 33.1723354,31.9215486 C34.30297,32.4762081 34.6827251,32.8318428 34.6784097,33.3277737 C34.6697789,34.086896 33.7764913,34.4218668 32.9403827,34.4349177 C31.4817778,34.4577566 30.6338018,34.0379554 29.9595207,33.7203856 L29.4341209,36.1989526 C30.1105597,36.5132597 31.3631043,36.7873267 32.6620394,36.79929 C35.7108689,36.79929 37.7056622,35.282133 37.7164507,32.9297239 C37.728318,29.9443503 33.620058,29.77904 33.6481081,28.4445944 C33.6578178,28.0400192 34.0408095,27.6082548 34.8801546,27.4984104 C35.2955118,27.4429445 36.4423291,27.4005293 37.7423431,28.0041295 L38.252639,25.6060425 C37.5535444,25.3493765 36.6548625,25.1035862 35.5360953,25.1035862 C32.6663548,25.1035862 30.6478269,26.641407 30.6316441,28.8426442 Z M43.1560113,25.3102241 C42.5993248,25.3102241 42.1300252,25.637582 41.9207283,26.1400383 L37.5654117,36.623104 L40.6120835,36.623104 L41.2183971,34.9341113 L44.9415077,34.9341113 L45.2932128,36.623104 L47.9784699,36.623104 L45.6352082,25.3102241 L43.1560113,25.3102241 Z M26.9376625,25.3102241 L24.5361428,36.623104 L27.4393276,36.623104 L29.8397684,25.3102241 L26.9376625,25.3102241 Z M22.6427614,25.3102241 L19.6209032,33.0102039 L18.3985664,26.4630459 C18.2550794,25.7322004 17.6886832,25.3102241 17.0597138,25.3102241 L12.1196606,25.3102241 L12.0506142,25.6386696 C13.064733,25.8605334 14.2169446,26.2183432 14.9149604,26.601167 C15.3421849,26.8349941 15.4640949,27.0394568 15.6043454,27.595204 L17.9195571,36.623104 L20.9878059,36.623104 L25.6915909,25.3102241 L22.6427614,25.3102241 Z" id="Combined-Shape"></path>
                    <polygon id="path10273-path" points="44.4614196 28.3662895 42.0534269 28.3662895 43.582157 32.6143292"></polygon>
                </g>
            </g>
        </g>
    </g>
</svg>