<?xml version="1.0" encoding="utf-8"?>
<!-- Generator: Adobe Illustrator 22.0.1, SVG Export Plug-In . SVG Version: 6.00 Build 0)  -->
<svg version="1.1" id="Слой_1" xmlns="http://www.w3.org/2000/svg" xmlns:xlink="http://www.w3.org/1999/xlink" x="0px" y="0px"
	 viewBox="0 0 56.4 56.4" style="enable-background:new 0 0 56.4 56.4;" xml:space="preserve">
<style type="text/css">
	.st0{fill:#02458a;}
</style>
<g>
	<g>
		<path class="st0" d="M28.2,56.4c15.5,0,28.2-12.6,28.2-28.2S43.8,0,28.2,0S0,12.6,0,28.2C0,43.7,12.6,56.4,28.2,56.4L28.2,56.4z
			 M28.2,3.9c13.4,0,24.2,10.9,24.2,24.2S41.5,52.4,28.2,52.4S3.9,41.5,3.9,28.2S14.8,3.9,28.2,3.9L28.2,3.9z"/>
		<path class="st0" d="M18,29.4c-0.4-0.4-0.6-0.8-0.6-1.4s0.2-1,0.6-1.4l12.8-12.9c0.8-0.8,2.1-0.8,2.8,0c0.8,0.8,0.8,2.1,0,2.8
			L22.2,28l11.5,11.5c0.8,0.8,0.8,2.1,0,2.8c-0.4,0.4-0.9,0.6-1.4,0.6c-0.5,0-1-0.2-1.4-0.6L18,29.4z"/>
	</g>
</g>
</svg>
