<svg
  xmlns="http://www.w3.org/2000/svg" width="12" height="12" viewBox="0 0 12 12">
  <path fill="#000" d="M12 1.209L10.791 0 6 4.791 1.209 0 0 1.209 4.791 6 0 10.791 1.209 12 6 7.209 10.791 12 12 10.791 7.209 6z"/>
</svg>
