<?xml version="1.0" encoding="utf-8"?>
<!-- Generator: Adobe Illustrator 22.0.1, SVG Export Plug-In . SVG Version: 6.00 Build 0)  -->
<svg version="1.1" id="Слой_1" xmlns="http://www.w3.org/2000/svg" xmlns:xlink="http://www.w3.org/1999/xlink" x="0px" y="0px"
	 viewBox="0 0 512 508.5" style="enable-background:new 0 0 512 508.5;" xml:space="preserve">
<style type="text/css">
	.st0{fill:#1F3C84;}
	.st1{fill:#FFCD06;}
</style>
<g>
	<g>
		<g>
			<path class="st0" d="M215.2,439.2c-4.9-6.3-11.2-11.3-18.6-14.8c-3.1-1.4-6.4-2.6-9.9-3.4l-1-0.2l-14.6-3.4l-8.2-1.9
				c-7.3-1.7-12.4-8.1-12.4-15.6v-7.4c6.2-4,11.7-9,16.2-14.9c3.4-4.4,6.3-9.2,8.5-14.4c3.4-7.8,5.2-16.5,5.2-25.5v-41.3
				c2.2-1.1,6.9-2.4,13.7-8.5c2.2-2,2.2-4,1.9-5.6c-0.3-1.4-0.8-2.7-1.1-4c-0.8-2.8-1.8-5.6-2.7-8.3c-5.9-16.2-14.1-29.4-24.5-39.5
				c-4.8-4.7-9.6-8.4-14.3-11.4c-4.8-3.1-9.4-5.4-13.8-7.1c-8-3.1-15.2-4.3-21.1-4.6c-0.6,0-9.5-0.4-21.3,2.8c-3.8,1-8,2.5-12.3,4.5
				c-4.1-2-8.4-3.5-12.8-4.5c-4.2-0.9-8.5-1.4-12.9-1.4c-1.1,0-2.2,0-3.2,0.1c-3.3,0.2-6.5,0.6-9.7,1.3c-2.2,0.5-4.4,1.1-6.6,1.9
				c-1.8,0.6-3.6,1.3-5.3,2.1C14.1,223.7,0,244.2,0,268c0,2,0.1,3.9,0.3,5.8c0.9,9.2,3.9,18,8.9,25.8c0.6,1,1.3,2.1,2.1,3.1
				c1.7,2.3,3.5,4.5,5.6,6.6c2.1,2.2,4.4,4.2,6.8,6c1.8,1.4,3.7,2.6,5.6,3.8c6.4,3.8,13.5,6.3,20.9,7.4v11.2
				c0,9.5,2.1,18.6,5.8,26.8c2.3,5.1,5.3,9.9,8.8,14.2c4.9,6,10.8,11.1,17.5,15.1v6c0,7.5-5.1,13.9-12.4,15.6l-8.8,2.1L46.4,421
				l-0.3,0.1c-3.4,0.8-6.8,2-9.9,3.4c-6.9,3.2-12.9,7.9-17.7,13.6C11.3,446.9,7,458.2,7,470.4v30.5c0,4.2,3.4,7.6,7.6,7.6h203.8
				c4.2,0,7.6-3.4,7.6-7.6v-30.5C225.9,458.7,222,447.9,215.2,439.2z M76.6,237.8c14.9-12.7,32-14.9,38.5-15.2c1.7-0.1,2.6,0,2.7,0
				c0.7,0,1.4,0.1,2.2,0.2c0.2,0,0.3,0,0.5,0c0.4,0,0.8,0.1,1.2,0.1c0.4,0,0.8,0.1,1.2,0.2c0.1,0,0.1,0,0.2,0
				c0.4,0.1,0.8,0.1,1.1,0.2c0.4,0.1,0.8,0.1,1.2,0.2c2.4,0.5,4.7,1.1,7,1.9c0.6,0.2,1.3,0.5,1.9,0.7c0.8,0.3,1.6,0.6,2.3,1
				c0.5,0.2,1,0.4,1.5,0.7c0,0,0.1,0,0.1,0.1c0.3,0.1,0.6,0.3,0.8,0.4c0.9,0.5,1.9,1,2.8,1.5c0.2,0.1,0.4,0.2,0.6,0.4
				c0.5,0.3,1,0.6,1.5,0.9c1,0.6,2.1,1.3,3.1,2c0.3,0.2,0.5,0.3,0.8,0.5c0.5,0.4,1.1,0.8,1.6,1.2c0.5,0.4,0.9,0.7,1.4,1.1
				c2.1,1.7,4.3,3.5,6.3,5.5c0.6,0.6,1.2,1.2,1.8,1.8c0.6,0.6,1.1,1.2,1.6,1.8c0,0,0.1,0.1,0.1,0.1c0.5,0.5,0.9,1.1,1.4,1.6
				c0.1,0.1,0.2,0.2,0.3,0.3c1,1.3,2.1,2.6,3.1,4c0.5,0.6,0.9,1.3,1.3,1.9c0.2,0.2,0.3,0.5,0.5,0.7c0.4,0.6,0.8,1.2,1.2,1.8
				c0.5,0.8,1,1.5,1.4,2.3c0.9,1.6,1.9,3.3,2.7,5c0.4,0.7,0.8,1.5,1.1,2.2c0,0,0.1,0.1,0.1,0.2c0.4,0.8,0.7,1.6,1.1,2.4
				c0.1,0.2,0.1,0.3,0.2,0.5c0.4,0.8,0.7,1.6,1.1,2.5c0.4,0.9,0.8,1.8,1.1,2.8c0.3,0.9,0.7,1.8,1,2.7c0,0,0,0.1,0,0.1
				c0.3,0.9,0.7,1.9,1,2.9c-1.7,1-3.3,2.3-7.3,4.2c0,0,0,0-0.1,0c-1.3,0.6-2.9,1.3-4.8,2.1c0,0,0,0-0.1,0c-1.8,0.7-3.9,1.5-6.3,2.4
				c-1.3,0.4-2.6,0.7-4,1.1c-0.4,0.1-0.9,0.2-1.3,0.3c-0.5,0.1-0.9,0.2-1.4,0.3c-1.2,0.2-2.4,0.5-3.6,0.6c-0.4,0.1-0.7,0.1-1.1,0.2
				c-3.2,0.5-6.3,0.8-8.8,0.8c-0.2,0-0.4,0-0.7,0c-0.3,0-0.5,0-0.8,0c-1,0-2,0-3.1-0.1c-0.8,0-1.5-0.1-2.3-0.1c-0.4,0-0.9,0-1.3-0.1
				c-0.6,0-1.1-0.1-1.7-0.2c-0.6,0-1.1-0.1-1.7-0.2c-0.4,0-0.8-0.1-1.2-0.2c-0.7-0.1-1.4-0.2-2.1-0.3c-0.4-0.1-0.7-0.1-1.1-0.2
				c-0.8-0.1-1.7-0.3-2.5-0.5c-0.4-0.1-0.9-0.2-1.3-0.3c-0.4-0.1-0.8-0.2-1.3-0.3c-0.2,0-0.4-0.1-0.6-0.2c-0.9-0.2-1.7-0.4-2.5-0.7
				c-0.5-0.1-1-0.3-1.5-0.4c-0.9-0.3-1.8-0.5-2.6-0.8c-0.4-0.1-0.9-0.3-1.3-0.4c-0.2-0.1-0.4-0.2-0.6-0.2c-0.5-0.2-0.9-0.3-1.4-0.5
				c-0.1,0-0.3-0.1-0.4-0.2c-0.6-0.2-1.3-0.5-1.9-0.8c-0.7-0.3-1.4-0.6-2-0.9c0,0,0,0,0,0c-0.7-0.3-1.4-0.6-2-0.9
				c-0.7-0.3-1.3-0.6-2-1c-0.7-0.3-1.3-0.7-2-1c-0.7-0.3-1.3-0.7-2-1.1c-0.6-0.4-1.3-0.7-1.9-1.1c0,0,0,0,0,0
				c-0.6-0.4-1.3-0.8-1.9-1.2c-0.6-0.4-1.2-0.8-1.9-1.2c-0.1,0-0.1-0.1-0.1-0.1c-0.5-0.3-0.9-0.6-1.4-1c-1.2-0.8-2.3-1.6-3.5-2.5
				c-0.4-0.3-0.8-0.6-1.2-0.9c-0.4-0.3-0.8-0.6-1.2-1l-18.6-20C68.4,245.8,72.3,241.4,76.6,237.8z M50.2,311.2
				c-9-1.9-17-6.4-23.1-12.8c-6.1-6.4-10.2-14.7-11.6-24c-0.3-2.1-0.4-4.2-0.4-6.3c0-16.5,9.1-30.9,22.6-38.5c0.5-0.3,1-0.6,1.5-0.8
				c4.2-2.1,8.7-3.6,13.6-4.3c2.1-0.3,4.2-0.5,6.4-0.5c3.1,0,6.2,0.3,9.2,1c-0.5,0.4-1.1,0.9-1.6,1.3c-4.5,3.8-8.6,8.3-12.3,13.3
				c-1.9,2.6-3.7,5.3-5.4,8.1c0,0,0,0,0,0c0,0,0,0,0,0.1c0,0,0,0.1,0,0.1c0,0,0,0,0,0c-3.9,6.3-6.9,13.1-8.8,20.2
				c-0.3,1.2-0.6,2.5-0.9,3.7c0,0.2-0.1,0.3-0.1,0.5c-1.6,7.7-2,15.7-1.1,23.5c0.2,2.2,1.4,4.1,3.2,5.4c1.3,0.9,2.8,1.4,4.3,1.4
				c0.6,0,1.2-0.1,1.8-0.2c0.3-0.1,0.7-0.2,1-0.3c0.6-0.2,1.2-0.3,1.8-0.5V311.2z M63.7,278.7c-2.6,1.8-4.6,2.9-5.5,3.4
				c-0.8,0.4-1.6,0.8-2.4,1.2c-0.9,0.2-1.6,0.6-2.4,1.1c-0.2,0.1-0.5,0.2-0.7,0.3c0.2-3.1,0.6-6.3,1.2-9.3c0.3-1.5,0.7-3,1.1-4.5
				c0.5-1.7,1.1-3.4,1.7-5.1c3.2,3.8,6.6,7.3,10.1,10.6C65.7,277.3,64.7,278,63.7,278.7z M74.1,366.1c-3-4.3-5.3-9-6.8-14.2
				c-1.3-4.5-2.1-9.3-2.1-14.2v-42.3c0,0,0.1,0,0.1,0c2.2-1.2,7.1-4,12.7-8.6c0.2-0.2,0.5-0.4,0.7-0.6c0.9,0.7,1.9,1.3,2.8,1.9
				c9.6,6.5,19.9,11.3,30.7,14.3c0.9,0.3,1.8,0.5,2.8,0.7c7.8,2,15.9,3,24.1,3c5.2,0,15.6-1,25-3.7c0.4-0.1,0.8-0.2,1.2-0.4v35.6
				c0,4.5-0.6,9-1.8,13.2c-1.4,5.1-3.6,10-6.5,14.3c-9,13.6-24.4,22.6-41.8,22.6C98.3,387.8,83.1,379.2,74.1,366.1z M73.3,430.2
				c4.5-1.1,8.6-3.1,12.1-5.8c7.3-5.7,11.8-14.4,12-24.1c5.7,1.6,11.7,2.5,17.9,2.5c7,0,13.8-1.1,20.1-3.2v0.2
				c0,9.9,4.6,18.8,12,24.6c3.5,2.7,7.6,4.7,12.1,5.8l4.9,1.1l1.1,0.3c-11.3,15.5-29.4,24.8-49,24.8c-20.2,0-38.4-10.1-48.6-25
				L73.3,430.2z M210.8,493.3H22.1v-23c0-16.6,11.3-30.8,27.4-34.6l2.1-0.5c7.5,12.1,18.3,22.1,31.1,28.4c0.6,0.3,1.2,0.5,1.8,0.6
				c8.8,4.1,20.8,6.9,31.2,7.2c0,0-0.1,0-0.1,0c0.2,0,0.7,0,0.7,0c26.7,0,51-13.8,64.8-36.3l2.1,0.5c16.1,3.8,27.4,18,27.4,34.6
				V493.3z"/>
			<path class="st1" d="M179.3,278.9c-1.7,1-3.3,2.3-7.3,4.2c0,0,0,0-0.1,0c-1.3,0.6-2.9,1.3-4.8,2.1c0,0,0,0-0.1,0
				c-1.8,0.7-3.9,1.5-6.3,2.4c-1.3,0.4-2.6,0.7-4,1.1c-0.4,0.1-0.9,0.2-1.3,0.3c-0.5,0.1-0.9,0.2-1.4,0.3c-1.2,0.2-2.4,0.5-3.6,0.6
				c-0.4,0.1-0.7,0.1-1.1,0.2c-3.2,0.5-6.3,0.8-8.8,0.8c-0.2,0-0.4,0-0.7,0c-0.3,0-0.5,0-0.8,0c-1,0-2,0-3.1-0.1
				c-0.8,0-1.5-0.1-2.3-0.1c-0.4,0-0.9,0-1.3-0.1c-0.6,0-1.1-0.1-1.7-0.2c-0.6,0-1.1-0.1-1.7-0.2c-0.4,0-0.8-0.1-1.2-0.2
				c-0.7-0.1-1.4-0.2-2.1-0.3c-0.4-0.1-0.7-0.1-1.1-0.2c-0.8-0.1-1.7-0.3-2.5-0.5c-0.4-0.1-0.9-0.2-1.3-0.3
				c-0.4-0.1-0.8-0.2-1.3-0.3c-0.2,0-0.4-0.1-0.6-0.2c-0.9-0.2-1.7-0.4-2.5-0.7c-0.5-0.1-1-0.3-1.5-0.4c-0.9-0.3-1.8-0.5-2.6-0.8
				c-0.4-0.1-0.9-0.3-1.3-0.4c-0.2-0.1-0.4-0.2-0.6-0.2c-0.5-0.2-0.9-0.3-1.4-0.5c-0.1,0-0.3-0.1-0.4-0.2c-0.6-0.3-1.3-0.5-1.9-0.8
				c-0.7-0.3-1.4-0.6-2-0.9c0,0,0,0,0,0c-0.7-0.3-1.4-0.6-2-0.9c-0.7-0.3-1.3-0.6-2-1c-0.7-0.3-1.3-0.7-2-1c-0.7-0.3-1.3-0.7-2-1.1
				c-0.6-0.4-1.3-0.7-1.9-1.1c0,0,0,0,0,0c-0.6-0.4-1.3-0.8-1.9-1.2c-0.6-0.4-1.2-0.8-1.9-1.2c-0.1,0-0.1-0.1-0.1-0.1
				c-0.5-0.3-0.9-0.6-1.4-1c-1.2-0.8-2.3-1.6-3.5-2.5c-0.4-0.3-0.8-0.6-1.2-0.9c-0.4-0.3-0.8-0.6-1.2-1l-18.6-20
				c3.5-5.1,7.4-9.4,11.6-13.1c14.9-12.7,32-14.9,38.5-15.2c1.7-0.1,2.6,0,2.7,0c0.7,0,1.4,0.1,2.2,0.2c0.2,0,0.3,0,0.5,0
				c0.4,0,0.8,0.1,1.2,0.1c0.4,0,0.8,0.1,1.2,0.2c0.1,0,0.1,0,0.2,0c0.4,0.1,0.8,0.1,1.1,0.2c0.4,0.1,0.8,0.1,1.2,0.2
				c2.4,0.5,4.7,1.1,7,1.9c0.6,0.2,1.3,0.5,1.9,0.7c0.8,0.3,1.6,0.6,2.3,1c0.5,0.2,1,0.4,1.5,0.7c0,0,0.1,0,0.1,0.1
				c0.3,0.1,0.6,0.3,0.8,0.4c0.9,0.5,1.9,1,2.8,1.5c0.2,0.1,0.4,0.2,0.6,0.4c0.5,0.3,1,0.6,1.5,0.9c1,0.6,2.1,1.3,3.1,2
				c0.3,0.2,0.5,0.3,0.8,0.5c0.5,0.4,1.1,0.8,1.6,1.2c0.5,0.4,0.9,0.7,1.4,1.1c2.1,1.7,4.3,3.5,6.3,5.5c0.6,0.6,1.2,1.2,1.8,1.8
				c0.6,0.6,1.1,1.2,1.6,1.8c0,0,0.1,0.1,0.1,0.1c0.5,0.5,0.9,1.1,1.4,1.6c0.1,0.1,0.2,0.2,0.3,0.3c1,1.3,2.1,2.6,3.1,4
				c0.5,0.6,0.9,1.3,1.3,1.9c0.2,0.2,0.3,0.5,0.5,0.7c0.4,0.6,0.8,1.2,1.2,1.8c0.5,0.8,1,1.5,1.4,2.3c0.9,1.6,1.9,3.3,2.7,5
				c0.4,0.7,0.8,1.5,1.1,2.2c0,0,0.1,0.1,0.1,0.2c0.4,0.8,0.7,1.6,1.1,2.4c0.1,0.2,0.1,0.3,0.2,0.5c0.4,0.8,0.7,1.6,1.1,2.5
				c0.4,0.9,0.8,1.8,1.1,2.8c0.3,0.9,0.7,1.8,1,2.7c0,0,0,0.1,0,0.1C178.6,277,178.9,277.9,179.3,278.9z"/>
		</g>
	</g>
	<g>
		<g>
			<circle class="st0" cx="92.5" cy="319.1" r="6.4"/>
		</g>
	</g>
	<g>
		<g>
			<circle class="st0" cx="135.9" cy="319.1" r="6.4"/>
		</g>
	</g>
	<g>
		<g>
			<g>
				<path class="st0" d="M121.8,359.5c-3.7,3.7-9.8,3.7-13.5,0c-2.9-2.9-7.7-2.9-10.6,0c-2.9,2.9-2.9,7.7,0,10.6
					c4.8,4.8,11.1,7.2,17.4,7.2s12.6-2.4,17.4-7.2c2.9-2.9,2.9-7.7,0-10.6C129.5,356.6,124.7,356.6,121.8,359.5z"/>
				<path class="st0" d="M382.4,377.3c6.3,0,12.6-2.4,17.4-7.2c2.9-2.9,2.9-7.7,0-10.6s-7.7-2.9-10.6,0c-3.7,3.7-9.8,3.7-13.5,0
					c-2.9-2.9-7.7-2.9-10.6,0c-2.9,2.9-2.9,7.7,0,10.6C369.8,374.9,376.1,377.3,382.4,377.3z"/>
				<path class="st0" d="M496.6,436.2c0.1,0.1,0.2,0.2,0.2,0.2c0.1,0.1,0.3,0.3,0.4,0.4C497.1,436.6,496.8,436.4,496.6,436.2z
					 M498.2,437.7c0.1,0.1,0.1,0.2,0.2,0.3c0.1,0.1,0.3,0.3,0.4,0.4C498.6,438.1,498.4,437.9,498.2,437.7z"/>
				<path class="st0" d="M512,468.7c0-0.5-0.1-1.1-0.1-1.6c0-0.5-0.1-1.1-0.2-1.6c0-0.5-0.1-1-0.2-1.5c0-0.1,0-0.2,0-0.3
					c-0.2-1.5-0.6-3.1-0.9-4.6c-0.2-0.9-0.5-1.7-0.8-2.6c-0.1-0.4-0.3-0.7-0.4-1.1c-0.1-0.2-0.1-0.4-0.2-0.6c0-0.1-0.1-0.3-0.1-0.4
					l-0.2-0.5c-0.2-0.6-0.5-1.1-0.7-1.7c0,0,0,0,0-0.1c-0.2-0.4-0.3-0.7-0.5-1.1v0c-0.2-0.4-0.4-0.7-0.5-1.1c-0.2-0.3-0.4-0.7-0.6-1
					c-0.2-0.3-0.4-0.7-0.6-1c-0.2-0.4-0.4-0.7-0.6-1c-0.2-0.3-0.4-0.6-0.6-0.9c0,0,0,0,0,0c0,0,0,0,0-0.1c-0.1-0.1-0.2-0.3-0.3-0.5
					c-0.5-0.7-1-1.5-1.5-2.2c0,0,0,0-0.1-0.1c-0.1-0.1-0.2-0.2-0.3-0.3c0,0,0,0,0,0c-0.2-0.3-0.4-0.5-0.6-0.8
					c-1.1-1.5-2.4-2.8-3.7-4.2c-0.5-0.5-1-1-1.5-1.5c-0.3-0.3-0.5-0.5-0.8-0.7c0.2,0.2,0.4,0.3,0.6,0.5
					c-7.9-7.4-18.4-12.8-30.5-15.2l-3.7-0.7l-5.4-1.1l-19.3-3.8c-9.1-1.8-15.7-8.3-15.7-15.6v-11.1c0.9-0.8,1.9-1.5,2.8-2.3
					c0.8-0.7,1.5-1.4,2.3-2.1c0.2-0.2,0.3-0.4,0.5-0.5c0.3-0.3,0.6-0.6,0.9-1c0.2-0.1,0.3-0.3,0.4-0.4l0.9-1
					c0.4-0.4,0.8-0.9,1.2-1.4c0.4-0.5,0.8-0.9,1.1-1.4c0,0,0.1-0.1,0.1-0.1c0.2-0.3,0.5-0.6,0.7-0.9c3.4-4.4,6.3-9.2,8.5-14.4
					c3.4-7.8,5.2-16.5,5.2-25.5v-41.3c1.6-0.8,4.5-1.7,8.7-4.6c1.5-1,3.2-2.3,5-3.9c1.9-1.7,2.2-3.4,2-4.9l0-0.2
					c0-0.2-0.1-0.3-0.1-0.5c-0.4-1.7-0.9-3.3-1.4-5c-1.7-5.5-3.6-10.8-5.8-15.7c-5.5-12.4-12.6-22.8-21.1-31.1c-2.7-2.6-5.4-5-8.1-7
					c-3.3-2.5-6.5-4.7-9.7-6.5c-0.2-0.1-0.3-0.2-0.5-0.3c-0.4-0.2-0.8-0.5-1.3-0.7c-0.4-0.2-0.8-0.5-1.3-0.7c-0.9-0.5-1.9-1-2.8-1.4
					c-1.4-0.7-2.8-1.3-4.2-1.8c-0.3-0.1-0.7-0.3-1-0.4c-0.6-0.2-1.2-0.5-1.8-0.7c-0.4-0.1-0.8-0.3-1.2-0.4h0
					c-0.4-0.1-0.9-0.3-1.3-0.4c-0.4-0.1-0.9-0.3-1.3-0.4c-3-0.9-5.9-1.5-8.5-1.8c-0.4-0.1-0.8-0.1-1.1-0.2c-0.2,0-0.4,0-0.6-0.1
					c-0.2,0-0.4,0-0.6-0.1c-0.6-0.1-1.1-0.1-1.7-0.2c-0.8-0.1-1.6-0.1-2.3-0.2c-0.2,0-0.9,0-2.1,0c-0.2,0-0.4,0-0.6,0s-0.5,0-0.7,0
					c-0.2,0-0.4,0-0.6,0c-0.1,0-0.1,0-0.2,0c-0.4,0-0.8,0-1.3,0.1c-0.8,0-1.7,0.1-2.6,0.2c-0.4,0-0.8,0.1-1.1,0.1
					c-6.2,0.8-14.9,2.5-24.3,6.8c-1.5,0.7-3.1,1.5-4.7,2.3c-4,2.1-8,4.7-11.9,7.9c-0.5,0.4-1.1,0.9-1.6,1.3
					c-2.9,2.5-5.6,5.2-8.2,8.1c-3.5,4-6.7,8.4-9.6,13.3c0,0,0,0,0,0c0,0,0,0,0,0.1c0,0,0,0.1-0.1,0.1c0,0,0,0,0,0
					c-4.7,7.5-8,15.8-9.8,24.4c-0.3,1.7-0.6,3.3-0.9,5c-0.5,3.6-0.7,7.1-0.7,10.7c0,2.6,0.1,5.2,0.4,7.8c0.2,2.2,1.4,4.1,3.2,5.4
					c0.5,0.3,1,0.6,1.5,0.8c0.2,0.1,0.3,0.1,0.5,0.2c0.4,0.1,0.8,0.2,1.3,0.3c0.4,0.1,0.7,0.1,1.1,0.1c0.3,0,0.6,0,0.9-0.1
					c0.2,0,0.3,0,0.5-0.1c0.1,0,0.3-0.1,0.4-0.1c0.5-0.1,0.9-0.2,1.4-0.4c0.2-0.1,0.5-0.1,0.7-0.2c0.2-0.1,0.5-0.1,0.7-0.2v36.1
					c0,21.7,10.6,40.9,26.9,52.7v9.4c0,7.2-6.6,13.8-15.7,15.6l-19.3,3.8c0,0-0.1,0-0.1,0l-5.4,1l-3.7,0.7
					c-15.3,3-28.1,10.9-36.2,21.5c-3,3.9-5.4,8.2-7,12.7c0,0.1-0.1,0.2-0.1,0.3c-0.3,0.7-0.5,1.4-0.7,2.1c-0.1,0.5-0.3,1-0.4,1.6
					c-0.1,0.4-0.2,0.9-0.3,1.4c0,0.1,0,0.2,0,0.3c-0.1,0.5-0.2,1-0.3,1.4c0,0,0,0.1,0,0.1c-0.1,0.5-0.2,0.9-0.2,1.4
					c0,0.1,0,0.2,0,0.3c-0.1,0.5-0.1,1-0.2,1.5c-0.1,0.5-0.1,1.1-0.2,1.6c0,0.5-0.1,1.1-0.1,1.6c0,0.5,0,1.1,0,1.6v30.5
					c0,4.2,3.4,7.6,7.6,7.6h243.5c4.2,0,7.6-3.4,7.6-7.6v-30.5C512,469.8,512,469.3,512,468.7z M342.8,237.8c3.9-3.3,8-6,12-8
					c0,0,0,0,0,0c0.3-0.2,0.6-0.3,0.9-0.5c0.5-0.2,0.9-0.4,1.4-0.7c0.1-0.1,0.3-0.1,0.4-0.2c0.3-0.1,0.7-0.3,1-0.4
					c0.4-0.2,0.9-0.4,1.3-0.5c0,0,0,0,0,0c0.1,0,0.1,0,0.1-0.1c0.4-0.2,0.9-0.3,1.3-0.5c0,0,0.1,0,0.1,0c0.3-0.1,0.6-0.2,1-0.3
					c0.5-0.2,1.1-0.4,1.6-0.6c0.5-0.2,0.9-0.3,1.3-0.4c0.9-0.3,1.7-0.5,2.6-0.7c0.3-0.1,0.7-0.2,1-0.3c0.9-0.2,1.8-0.4,2.6-0.6
					c0.3-0.1,0.7-0.1,1-0.2c1-0.2,2-0.4,2.9-0.5c0.2,0,0.4-0.1,0.6-0.1c0.3,0,0.5-0.1,0.8-0.1c0.3,0,0.6-0.1,0.8-0.1
					c0.2,0,0.5-0.1,0.7-0.1c0.1,0,0.3,0,0.4,0c0.1,0,0.3,0,0.4,0c0.2,0,0.3,0,0.5,0c0.2,0,0.4,0,0.6-0.1c0.4,0,0.8,0,1.1-0.1
					c0.2,0,0.4,0,0.6,0c0.1,0,0.2,0,0.4,0c0.2,0,0.4,0,0.5,0c0,0,0,0,0,0c0,0,0,0,0.1,0h1.1c0.4,0,0.9,0,1.4,0.1
					c0.4,0,0.9,0.1,1.3,0.1c0,0,0,0,0,0h0c0.9,0.1,1.8,0.2,2.6,0.4c0.2,0,0.4,0.1,0.7,0.1c0.7,0.1,1.3,0.2,1.9,0.4
					c0.1,0,0.2,0,0.3,0.1c0.4,0.1,0.7,0.1,1.1,0.2c0.4,0.1,0.7,0.2,1.1,0.3c0.4,0.1,0.8,0.2,1.2,0.3c0.3,0.1,0.7,0.2,1,0.3
					c0.4,0.1,0.7,0.2,1.1,0.3c0.1,0,0.2,0.1,0.3,0.1c1.3,0.4,2.6,0.9,3.8,1.4c0.1,0,0.1,0,0.2,0.1c0,0,0,0,0,0
					c1.4,0.6,2.7,1.2,4.1,1.9c6,3.1,11.8,7.4,17.5,12.8c3.3,3.2,6.4,6.9,9.3,11c3.1,4.5,5.9,9.5,8.3,14.9c1.6,3.7,3.1,7.5,4.5,11.6
					c-0.2,0.1-0.4,0.3-0.7,0.4c-0.2,0.1-0.3,0.2-0.5,0.3c-0.3,0.2-0.7,0.4-1,0.6c-0.2,0.1-0.4,0.3-0.6,0.4c-1.1,0.7-2.5,1.5-4.5,2.5
					c0,0,0,0,0,0c0,0,0,0-0.1,0c-1.3,0.6-2.9,1.3-4.8,2.1c0,0,0,0-0.1,0c-0.1,0-0.1,0.1-0.2,0.1c0,0,0,0,0,0c0,0,0,0-0.1,0
					c-1.7,0.8-3.7,1.6-5.8,2.2c0,0,0,0,0,0c0,0,0,0,0,0c0,0,0,0-0.1,0c-1.2,0.3-2.4,0.7-3.7,1c-1.3,0.3-2.6,0.6-4,0.8
					c-0.7,0.1-1.3,0.2-1.9,0.3c-1.1,0.2-2.1,0.4-3.2,0.5c-0.3,0-0.7,0.1-1,0.1c-0.6,0.1-1.3,0.2-1.9,0.2c-0.7,0.1-1.3,0.1-1.9,0.2
					c-0.4,0-0.7,0.1-1.1,0.1c-0.2,0-0.4,0-0.5,0c-0.3,0-0.7,0-1,0c-0.3,0-0.5,0-0.8,0c-0.3,0-0.5,0-0.7,0h-0.1c-0.6,0-1.1,0-1.7,0
					c-0.4,0-0.9,0-1.3,0c-0.4,0-0.8,0-1.2-0.1c-0.2,0-0.4,0-0.6,0c-0.1,0-0.2,0-0.2,0c-0.6,0-1.1-0.1-1.6-0.1
					c-0.6,0-1.1-0.1-1.7-0.2c-0.6,0-1.1-0.1-1.7-0.2c0,0-0.1,0-0.1,0c-0.4,0-0.8-0.1-1.1-0.1c-0.2,0-0.3,0-0.5-0.1
					c-0.5-0.1-1.1-0.2-1.6-0.2c-0.6-0.1-1.3-0.2-1.9-0.3c-0.1,0-0.3-0.1-0.5-0.1c-0.4-0.1-0.8-0.1-1.2-0.2c-0.3,0-0.6-0.1-0.9-0.2
					c-0.2,0-0.3-0.1-0.4-0.1c-0.3,0-0.5-0.1-0.8-0.2c-0.8-0.2-1.6-0.4-2.4-0.6c-0.4-0.1-0.9-0.2-1.3-0.3c0,0-0.1,0-0.1,0
					c-0.5-0.1-0.9-0.3-1.3-0.4c-2.2-0.6-4.3-1.4-6.4-2.2c-0.6-0.2-1.3-0.5-1.9-0.8c-0.7-0.3-1.4-0.6-2-0.9c-0.2-0.1-0.3-0.1-0.5-0.2
					c-0.2-0.1-0.3-0.2-0.5-0.2c-0.7-0.3-1.3-0.6-2-0.9c-0.2-0.1-0.5-0.2-0.7-0.4c-0.3-0.1-0.6-0.3-0.9-0.5c-0.2-0.1-0.3-0.2-0.5-0.2
					c-0.6-0.3-1.3-0.6-1.9-1c-0.3-0.2-0.7-0.4-1-0.5c-2.3-1.2-4.5-2.6-6.6-4.1c-0.6-0.4-1.1-0.8-1.7-1.2c0,0-0.1,0-0.1,0
					c0,0-0.1,0-0.1-0.1c-2.7-2-5.2-4.2-7.5-6.5c-0.5-0.5-0.9-1-1.4-1.5l-12.9-13.9l-1.5-1.6C334.7,245.8,338.6,241.4,342.8,237.8z
					 M322.1,283.3c-0.9,0.2-1.6,0.6-2.4,1.1c-0.2,0.1-0.4,0.2-0.7,0.3c0,0,0,0,0,0c0.1-1.4,0.2-2.8,0.4-4.2c0.2-1.7,0.5-3.4,0.8-5.1
					c0.7-3.3,1.6-6.5,2.8-9.6c0,0,0,0,0,0c0.4,0.5,0.9,1,1.3,1.5c0.2,0.2,0.3,0.4,0.5,0.5c2.6,3,5.4,5.9,8.3,8.5
					c-3.7,2.9-6.8,4.7-8.3,5.5c-0.1,0.1-0.3,0.1-0.4,0.2C323.7,282.5,322.9,282.9,322.1,283.3z M331.5,337.7v-42.3c0,0,0.1,0,0.1,0
					c0.6-0.3,1.3-0.7,2.2-1.3c2.1-1.2,4.9-3,8.1-5.5c1-0.8,2-1.6,3-2.4c0,0,0,0,0,0c0.9,0.7,1.9,1.3,2.8,1.9
					c0.2,0.1,0.4,0.3,0.5,0.4c0.5,0.3,1,0.6,1.4,0.9c0.1,0.1,0.3,0.2,0.4,0.3c0.1,0,0.1,0.1,0.1,0.1c0,0,0,0,0.1,0
					c0.2,0.1,0.5,0.3,0.7,0.4c0.2,0.1,0.4,0.2,0.5,0.3c0.4,0.3,0.9,0.5,1.3,0.8c0.1,0.1,0.2,0.1,0.3,0.2c0.6,0.4,1.2,0.7,1.8,1.1
					c1.1,0.6,2.2,1.2,3.3,1.8c0.1,0.1,0.3,0.1,0.4,0.2c0,0,0,0,0,0c1.3,0.7,2.5,1.3,3.8,1.8h0c1.3,0.6,2.6,1.2,3.8,1.7
					c0.6,0.3,1.3,0.5,1.9,0.8c0,0,0.1,0,0.1,0c0.8,0.3,1.6,0.6,2.5,0.9c1.5,0.5,3,1,4.5,1.5c0.8,0.3,1.6,0.5,2.3,0.7
					c0.2,0.1,0.5,0.1,0.7,0.2c0.3,0.1,0.5,0.1,0.8,0.2c1.1,0.3,2.2,0.6,3.3,0.9c0,0,0.1,0,0.1,0c0.5,0.1,1,0.2,1.5,0.3
					s1,0.2,1.5,0.3c1,0.2,2,0.4,3,0.5c0.5,0.1,1,0.2,1.5,0.2c0.5,0.1,1,0.2,1.5,0.2c0.5,0.1,1,0.1,1.5,0.2c1,0.1,2,0.2,3,0.3
					c0.4,0,0.9,0.1,1.3,0.1c1.6,0.1,3.1,0.2,4.7,0.3c0.4,0,0.9,0,1.3,0c0.6,0,1.1,0,1.7,0c1.7,0,3.9-0.1,6.5-0.3
					c0.3,0,0.5,0,0.8-0.1c0.5,0,1.1-0.1,1.6-0.2c0.3,0,0.6-0.1,0.8-0.1c0.4,0,0.8-0.1,1.2-0.1c0.5-0.1,1-0.1,1.4-0.2
					c1-0.1,2-0.3,3-0.5c0.5-0.1,1-0.2,1.5-0.3c1.2-0.2,2.4-0.5,3.6-0.7c0.1,0,0.2,0,0.3-0.1c0.6-0.1,1.1-0.3,1.7-0.4
					c0.6-0.2,1.3-0.3,1.9-0.5c0.6-0.2,1.2-0.4,1.9-0.5v35.6c0,23.8-16.7,43.8-39,48.8c0,0,0,0,0,0c-0.1,0-0.1,0-0.2,0
					c-0.7,0.2-1.5,0.3-2.2,0.4c-2.3,0.4-4.7,0.6-7.1,0.7c-0.3,0-0.7,0-1,0c-0.2,0-0.4,0-0.6,0c-0.4,0-0.9,0-1.3,0
					c-1.3,0-2.6-0.1-3.8-0.2c-0.6-0.1-1.2-0.1-1.8-0.2c-0.6-0.1-1.1-0.2-1.7-0.3c-0.8-0.1-1.6-0.3-2.4-0.5c-0.4-0.1-0.7-0.2-1.1-0.3
					c-0.1,0-0.3-0.1-0.4-0.1c-0.4-0.1-0.9-0.2-1.3-0.4c-1-0.3-1.9-0.6-2.9-0.9c-0.4-0.1-0.8-0.3-1.2-0.4c-0.6-0.2-1.1-0.4-1.7-0.7
					c-1.6-0.7-3.2-1.5-4.8-2.4c-0.5-0.3-1-0.6-1.5-0.9c-0.3-0.2-0.7-0.4-1-0.6c-0.4-0.3-0.8-0.5-1.2-0.8c-0.3-0.2-0.6-0.4-0.9-0.6
					c-0.3-0.2-0.7-0.5-1-0.7C339.5,368.7,331.5,354.1,331.5,337.7z M407.5,405.7c0.5,2.3,1.3,4.5,2.3,6.6c0.9,1.7,1.9,3.4,3.1,5
					c-1.3,0.9-2.7,1.7-4.1,2.4c-0.4,0.2-0.8,0.4-1.2,0.6c-7.7,3.8-16.2,5.8-24.9,5.8c-8.7,0-17.2-2-24.9-5.8
					c-0.4-0.2-0.8-0.4-1.2-0.6c-1.4-0.7-2.8-1.5-4.2-2.4c0.2-0.3,0.5-0.6,0.7-1c0.9-1.3,1.7-2.6,2.4-4c0.5-1,1-2.1,1.4-3.2
					c1-2.9,1.6-6,1.6-9.2v-1.2c1.7,0.6,3.4,1.2,5.2,1.7c3.6,1,7.3,1.8,11,2.1c0.4,0,0.8,0.1,1.1,0.1c1,0.1,2,0.2,2.9,0.2
					c0.4,0,0.8,0,1.3,0c0.5,0,1,0,1.5,0c0.4,0,0.7,0,1.1,0c1,0,1.9-0.1,2.9-0.1c0.5,0,1-0.1,1.5-0.1c0.4,0,0.8-0.1,1.1-0.1
					c0.4,0,0.8-0.1,1.3-0.1c0.8-0.1,1.7-0.2,2.5-0.4c0.2,0,0.4-0.1,0.5-0.1c0.4-0.1,0.8-0.1,1.2-0.2h0c0.4-0.1,0.9-0.2,1.3-0.3
					c1.1-0.2,2.2-0.5,3.2-0.8c0.5-0.1,1-0.3,1.5-0.4c0.7-0.2,1.4-0.4,2.1-0.6c1.8-0.6,3.5-1.2,5.1-1.9v2.1
					C406.9,401.9,407.1,403.8,407.5,405.7z M496.9,493.3h-31v-9c0-3.9-3-7.2-6.8-7.5c-0.3,0-0.5,0-0.8,0c-0.3,0-0.5,0-0.7,0
					c-3.8,0.4-6.8,3.6-6.8,7.5v9H314.6v-9c0-3.9-3-7.2-6.8-7.5c-0.3,0-0.5,0-0.8,0c-0.2,0-0.5,0-0.7,0c-3.8,0.4-6.8,3.6-6.8,7.5v9
					h-31v-23c0-0.8,0-1.6,0.1-2.4c0-0.3,0.1-0.6,0.1-0.9c0-0.4,0.1-0.7,0.1-1.1c0-0.3,0.1-0.6,0.1-0.9c0-0.1,0-0.1,0-0.2
					c1.2-6.4,4.6-12.4,9.6-17.2c2.8-2.7,6.1-5.1,9.8-7.1c0,0,0,0,0,0c4.1-2.2,8.7-3.8,13.7-4.8l9.1-1.8l19.3-3.8
					c3.4-0.7,6.6-1.8,9.6-3.2c1,0.7,1.9,1.4,2.9,2.1c11.7,7.8,25.4,12,39.6,12c14.2,0,28-4.2,39.6-12.1c1-0.7,2-1.4,2.9-2.1
					c2.9,1.4,6.1,2.5,9.6,3.2l19.3,3.8l9.1,1.8c5,1,9.6,2.6,13.7,4.8c0,0,0,0,0,0c0.2,0.1,0.3,0.2,0.5,0.3c3.7,2,6.9,4.4,9.6,7.1
					c4.9,4.9,8.2,10.7,9.4,16.9c0,0.1,0,0.1,0,0.2c0.1,0.3,0.1,0.6,0.1,0.9c0.1,0.4,0.1,0.7,0.2,1.1c0,0.3,0.1,0.6,0.1,0.9
					c0.1,0.8,0.1,1.6,0.1,2.4V493.3z"/>
			</g>
		</g>
	</g>
	<g>
		<g>
			<circle class="st0" cx="358.7" cy="319.1" r="6.4"/>
		</g>
	</g>
	<g>
		<g>
			<circle class="st0" cx="402.2" cy="319.1" r="6.4"/>
		</g>
	</g>
	<g>
		<g>
			<path class="st0" d="M351.6,162.1c20-17.8,31.2-43,31-69.9C382.3,41.2,340.7,0,289.8,0c-0.2,0-0.4,0-0.6,0
				c-25,0.2-48.4,10.1-65.8,28c-8.5,8.8-15.1,18.9-19.6,29.9h-40.5c-4.2,0-7.6,3.4-7.6,7.6c0,4.2,3.4,7.6,7.6,7.6h35.9
				c-1.1,4.9-1.7,10-2,15.1h-36.8c-4.2,0-7.6,3.4-7.6,7.6c0,4.2,3.4,7.6,7.6,7.6h37.2c0.6,5.1,1.6,10.2,3,15.1h-37.3
				c-4.2,0-7.6,3.4-7.6,7.6s3.4,7.6,7.6,7.6h43.1c4.4,9,10.3,17.4,17.6,24.7c1.9,1.9,3.9,3.7,5.9,5.4c-9.4,4.3-19.6,6.7-30,6.9
				c-6.7,0.2-13.3-0.5-19.7-2c-2.5-0.6-5.1,0.2-7,2c-10.6,10.3-23.5,14.2-27.8,15.5c-1,0.3-2.1,0.6-3.1,0.9
				c4.4-7.4,7.6-16.1,9.6-26.1c0.5-2.8-0.5-5.6-2.7-7.4c-18.6-15-29.2-37.3-29-61.1c0.3-42.6,35.1-77.1,77.7-77.1c0.2,0,0.4,0,0.5,0
				c4.6,0,9.1,0.5,13.6,1.3c4.1,0.8,8-2,8.8-6.1c0.8-4.1-2-8-6.1-8.8C209.4,0.6,204,0,198.5,0c-0.2,0-0.4,0-0.6,0
				c-50.9,0-92.5,41.2-92.8,92.2c-0.2,26.9,11.1,52.1,31,69.9c-1.8,7.1-5,15.7-10.7,22.7c-3,3.7-3.5,8.7-1.2,12.8
				c2,3.7,5.9,5.9,10,5.9c0.5,0,1,0,1.4-0.1c4.8-0.6,9.6-1.6,14.3-3c4.8-1.4,18.5-5.6,31-16.4c6.4,1.2,13,1.7,19.5,1.5
				c15.3-0.4,30.2-4.6,43.5-12.2c13.2,7.6,28.1,11.8,43.5,12.2c6.6,0.2,13.1-0.3,19.5-1.5c12.5,10.8,26.2,14.9,31,16.4
				c4.6,1.4,9.4,2.4,14.3,3c0.5,0.1,1,0.1,1.4,0.1c4.1,0,8-2.2,10-5.9c2.3-4.1,1.8-9.2-1.2-12.8
				C356.7,177.8,353.4,169.2,351.6,162.1z M342.3,186c-4.3-1.3-17.3-5.2-27.8-15.5c-1.4-1.4-3.3-2.1-5.3-2.1c-0.6,0-1.1,0.1-1.7,0.2
				c-6.4,1.5-13,2.2-19.7,2c-14-0.4-27.5-4.5-39.2-11.9c-0.4-0.3-0.8-0.5-1.2-0.8c-4.5-3-8.8-6.4-12.7-10.3
				c-7.1-7.1-12.6-15.4-16.4-24.3c-0.1-0.1-0.1-0.3-0.2-0.4c-3.8-8.9-5.8-18.6-6-28.5c-0.4-20.9,7.5-40.7,22.1-55.7
				c14.6-15,34.2-23.3,55.1-23.5c0.2,0,0.4,0,0.5,0c42.6,0,77.4,34.5,77.7,77.1c0.2,23.9-10.4,46.1-29,61.1
				c-2.2,1.8-3.2,4.6-2.7,7.4c2,10,5.2,18.7,9.6,26.1C344.4,186.6,343.3,186.3,342.3,186z"/>
		</g>
	</g>
	<g>
		<g>
			<path class="st0" d="M334.3,56.6h-85.6c-4.2,0-7.6,3.4-7.6,7.6c0,4.2,3.4,7.6,7.6,7.6h85.6c4.2,0,7.6-3.4,7.6-7.6
				S338.5,56.6,334.3,56.6z"/>
		</g>
	</g>
	<g>
		<g>
			<path class="st0" d="M334.3,86.8h-85.6c-4.2,0-7.6,3.4-7.6,7.6c0,4.2,3.4,7.6,7.6,7.6h85.6c4.2,0,7.6-3.4,7.6-7.6
				S338.5,86.8,334.3,86.8z"/>
		</g>
	</g>
	<g>
		<g>
			<path class="st0" d="M292.9,117h-44.2c-4.2,0-7.6,3.4-7.6,7.6c0,4.2,3.4,7.6,7.6,7.6h44.2c4.2,0,7.6-3.4,7.6-7.6
				S297.1,117,292.9,117z"/>
		</g>
	</g>
	<path class="st1" d="M496.9,470.4v23h-31v-9c0-3.9-3-7.2-6.8-7.5c-0.3,0-0.5,0-0.8,0c-0.3,0-0.5,0-0.7,0c-3.8,0.4-6.8,3.6-6.8,7.5
		v9H314.6v-9c0-3.9-3-7.2-6.8-7.5c-0.3,0-0.5,0-0.8,0c-0.2,0-0.5,0-0.7,0c-3.8,0.4-6.8,3.6-6.8,7.5v9h-31v-23c0-0.8,0-1.6,0.1-2.4
		c0-0.3,0.1-0.6,0.1-0.9c0-0.4,0.1-0.7,0.1-1.1c0-0.3,0.1-0.6,0.1-0.9c0-0.1,0-0.1,0-0.2c1.9-10.1,9.1-18.8,19.4-24.3c0,0,0,0,0,0
		c4.1-2.2,8.7-3.8,13.7-4.8l9.1-1.8l19.3-3.8c3.4-0.7,6.6-1.8,9.6-3.2c12.3,9.1,27.2,14.1,42.6,14.1c15.4,0,30.3-5,42.6-14.1
		c2.9,1.4,6.1,2.5,9.6,3.2l19.3,3.8l9.1,1.8c5,1,9.6,2.6,13.7,4.8c0,0,0,0,0,0c0.2,0.1,0.3,0.2,0.5,0.3c10.3,5.6,17.1,14.3,18.9,24
		c0,0.1,0,0.1,0,0.2c0.1,0.3,0.1,0.6,0.1,0.9c0.1,0.4,0.1,0.7,0.2,1.1c0,0.3,0.1,0.6,0.1,0.9C496.8,468.8,496.9,469.6,496.9,470.4z"
		/>
	<path class="st1" d="M68.3,225c-0.5,0.4-1.1,0.9-1.6,1.3c-6.7,5.7-12.7,13-17.7,21.4c0,0,0,0,0,0c0,0,0,0,0,0.1c0,0,0,0.1,0,0.1
		c0,0,0,0,0,0c-4.7,7.5-8,15.8-9.8,24.4c-1.6,7.7-2,15.7-1.1,23.5c0.2,2.2,1.4,4.1,3.2,5.4c1.3,0.9,2.8,1.4,4.3,1.4
		c0.6,0,1.2-0.1,1.8-0.2c0.9-0.2,1.9-0.5,2.8-0.8v9.6c-20.2-4.1-35-21.8-35-43.1c0-24.3,19.8-44.1,44.1-44.1
		C62.3,224,65.3,224.3,68.3,225z"/>
	<path class="st1" d="M333.1,276.4c-4.1,3.1-7.4,5-8.6,5.7c-0.8,0.4-1.6,0.8-2.4,1.2c-0.9,0.2-1.6,0.6-2.4,1.1
		c-0.2,0.1-0.5,0.2-0.7,0.3c0.1-1.4,0.2-2.8,0.4-4.2c0.2-1.7,0.5-3.4,0.8-5.1c0.7-3.3,1.6-6.5,2.8-9.6c0.4,0.5,0.9,1,1.3,1.5
		C327.1,270.5,330.1,273.6,333.1,276.4z"/>
	<path class="st1" d="M210.8,470.4v23H22.1v-23c0-16.6,11.3-30.8,27.4-34.6l2.1-0.5c7.5,12.1,18.3,22.1,31.1,28.4
		c0.6,0.3,1.2,0.5,1.8,0.6c8.8,4.1,20.8,6.9,31.2,7.2c0,0-0.1,0-0.1,0c0.2,0,0.7,0,0.7,0c26.7,0,51-13.8,64.8-36.3l2.1,0.5
		C199.5,439.6,210.8,453.8,210.8,470.4z"/>
	<path class="st1" d="M66.8,276.4c-4.1,3.1-7.4,5-8.6,5.7c-0.8,0.4-1.6,0.8-2.4,1.2c-0.9,0.2-1.6,0.6-2.4,1.1
		c-0.2,0.1-0.5,0.2-0.7,0.3c0.2-3.1,0.6-6.3,1.2-9.3c0.7-3.3,1.6-6.5,2.8-9.6C60,269.6,63.3,273.1,66.8,276.4z"/>
	<path class="st1" d="M445.5,278.9c-0.2,0.1-0.4,0.3-0.7,0.4c-0.2,0.1-0.3,0.2-0.5,0.3c-0.3,0.2-0.7,0.4-1,0.6
		c-0.2,0.1-0.4,0.3-0.6,0.4c-1.1,0.7-2.5,1.5-4.5,2.5c0,0,0,0,0,0c0,0,0,0-0.1,0c-1.3,0.6-2.9,1.3-4.8,2.1c0,0,0,0-0.1,0
		c-0.1,0-0.1,0.1-0.2,0.1c0,0,0,0,0,0c0,0,0,0-0.1,0c-1.7,0.8-3.7,1.6-5.8,2.2c0,0,0,0,0,0c0,0,0,0,0,0c0,0,0,0-0.1,0
		c-1.2,0.3-2.4,0.7-3.7,1c-1.3,0.3-2.6,0.6-4,0.8c-0.7,0.1-1.3,0.2-1.9,0.3c-1.1,0.2-2.1,0.4-3.2,0.5c-0.3,0-0.7,0.1-1,0.1
		c-0.6,0.1-1.3,0.2-1.9,0.2c-0.7,0.1-1.3,0.1-1.9,0.2c-0.4,0-0.7,0.1-1.1,0.1c-0.2,0-0.4,0-0.5,0c-0.3,0-0.7,0-1,0
		c-0.3,0-0.5,0-0.8,0c-0.3,0-0.5,0-0.7,0h-0.1c-0.6,0-1.1,0-1.7,0c-0.4,0-0.9,0-1.3,0c-0.4,0-0.8,0-1.2-0.1c-0.2,0-0.4,0-0.6,0
		c-0.1,0-0.2,0-0.2,0c-0.6,0-1.1-0.1-1.6-0.1c-0.6,0-1.1-0.1-1.7-0.2c-0.6,0-1.1-0.1-1.7-0.2c0,0-0.1,0-0.1,0
		c-0.4,0-0.8-0.1-1.1-0.1c-0.2,0-0.3,0-0.5-0.1c-0.5-0.1-1.1-0.2-1.6-0.2c-0.6-0.1-1.3-0.2-1.9-0.3c-0.1,0-0.3-0.1-0.5-0.1
		c-0.4-0.1-0.8-0.1-1.2-0.2c-0.3,0-0.6-0.1-0.9-0.2c-0.2,0-0.3-0.1-0.4-0.1c-0.3,0-0.5-0.1-0.8-0.2c-0.8-0.2-1.6-0.4-2.4-0.6
		c-0.4-0.1-0.9-0.2-1.3-0.3c0,0-0.1,0-0.1,0c-0.5-0.1-0.9-0.3-1.3-0.4c-2.2-0.6-4.3-1.4-6.4-2.2c-0.6-0.2-1.3-0.5-1.9-0.8
		c-0.7-0.3-1.4-0.6-2-0.9c-0.2-0.1-0.3-0.1-0.5-0.2c-0.2-0.1-0.3-0.2-0.5-0.2c-0.7-0.3-1.3-0.6-2-0.9c-0.2-0.1-0.5-0.2-0.7-0.4
		c-0.3-0.1-0.6-0.3-0.9-0.5c-0.2-0.1-0.3-0.2-0.5-0.2c-0.6-0.3-1.3-0.6-1.9-1c-0.3-0.2-0.7-0.4-1-0.5c-2.3-1.2-4.5-2.6-6.6-4.1
		c-0.6-0.4-1.1-0.8-1.7-1.2c0,0-0.1,0-0.1,0c0,0-0.1,0-0.1-0.1c-2.7-2-5.2-4.2-7.5-6.5c-0.5-0.5-0.9-1-1.4-1.5l-12.9-13.9l-1.5-1.6
		c3.5-5.1,7.4-9.4,11.6-13.1c3.9-3.3,8-6,12-8c0,0,0,0,0,0c0.3-0.2,0.6-0.3,0.9-0.5c0.5-0.2,0.9-0.4,1.4-0.7
		c0.1-0.1,0.3-0.1,0.4-0.2c0.3-0.1,0.7-0.3,1-0.4c0.4-0.2,0.9-0.4,1.3-0.5c0,0,0,0,0,0c0.1,0,0.1,0,0.1-0.1c0.4-0.2,0.9-0.3,1.3-0.5
		c0,0,0.1,0,0.1,0c0.3-0.1,0.6-0.2,1-0.3c0.5-0.2,1.1-0.4,1.6-0.6c0.5-0.2,0.9-0.3,1.3-0.4c0.9-0.3,1.7-0.5,2.6-0.7
		c0.3-0.1,0.7-0.2,1-0.3c0.9-0.2,1.8-0.4,2.6-0.6c0.3-0.1,0.7-0.1,1-0.2c1-0.2,2-0.4,2.9-0.5c0.2,0,0.4-0.1,0.6-0.1
		c0.3,0,0.5-0.1,0.8-0.1c0.3,0,0.6-0.1,0.8-0.1c0.2,0,0.5-0.1,0.7-0.1c0.1,0,0.3,0,0.4,0c0.1,0,0.3,0,0.4,0c0.2,0,0.3,0,0.5,0
		c0.2,0,0.4,0,0.6-0.1c0.4,0,0.8,0,1.1-0.1c0.2,0,0.4,0,0.6,0c0.1,0,0.2,0,0.4,0c0.2,0,0.4,0,0.5,0c0,0,0,0,0,0c0,0,0,0,0.1,0h1.1
		c0.4,0,0.9,0,1.4,0.1c0.4,0,0.9,0.1,1.3,0.1c0,0,0,0,0,0h0c0.9,0.1,1.8,0.2,2.6,0.4c0.2,0,0.4,0.1,0.7,0.1c0.7,0.1,1.3,0.2,1.9,0.4
		c0.1,0,0.2,0,0.3,0.1c0.4,0.1,0.7,0.1,1.1,0.2c0.4,0.1,0.7,0.2,1.1,0.3c0.4,0.1,0.8,0.2,1.2,0.3c0.3,0.1,0.7,0.2,1,0.3
		c0.4,0.1,0.7,0.2,1.1,0.3c0.1,0,0.2,0.1,0.3,0.1c1.3,0.4,2.6,0.9,3.8,1.4c0.1,0,0.1,0,0.2,0.1c0,0,0,0,0,0c1.4,0.6,2.7,1.2,4.1,1.9
		c6,3.1,11.8,7.4,17.5,12.8c3.3,3.2,6.4,6.9,9.3,11c3.1,4.5,5.9,9.5,8.3,14.9C442.7,271,444.2,274.9,445.5,278.9z"/>
</g>
</svg>
