{
	"ICONS": {
		"arrow-left": {
			"data": "<svg id=\"Слой_1\" xmlns=\"http://www.w3.org/2000/svg\" viewBox=\"0 0 56.4 56.4\"><style>.st0{fill:#02458a}</style><path class=\"st0\" d=\"M28.2 56.4c15.5 0 28.2-12.6 28.2-28.2S43.8 0 28.2 0 0 12.6 0 28.2c0 15.5 12.6 28.2 28.2 28.2zm0-52.5c13.4 0 24.2 10.9 24.2 24.2S41.5 52.4 28.2 52.4 3.9 41.5 3.9 28.2 14.8 3.9 28.2 3.9z\"/><path class=\"st0\" d=\"M18 29.4c-.4-.4-.6-.8-.6-1.4s.2-1 .6-1.4l12.8-12.9c.8-.8 2.1-.8 2.8 0 .8.8.8 2.1 0 2.8L22.2 28l11.5 11.5c.8.8.8 2.1 0 2.8-.4.4-.9.6-1.4.6-.5 0-1-.2-1.4-.6L18 29.4z\"/></svg>",
			"info": {}
		},
		"arrow-right": {
			"data": "<svg id=\"Слой_1\" xmlns=\"http://www.w3.org/2000/svg\" viewBox=\"0 0 56.4 56.4\"><style>.st0{fill:#02458a}</style><path class=\"st0\" d=\"M28.2 56.4c15.5 0 28.2-12.7 28.2-28.2S43.8 0 28.2 0 0 12.6 0 28.2s12.7 28.2 28.2 28.2zm0-52.5c13.4 0 24.2 10.9 24.2 24.2S41.6 52.4 28.2 52.4 4 41.5 4 28.2 14.9 3.9 28.2 3.9z\"/><path class=\"st0\" d=\"M38.4 29.4c.4-.4.6-.8.6-1.4s-.2-1-.6-1.4L25.6 13.8c-.8-.8-2.1-.8-2.8 0-.8.8-.8 2.1 0 2.8L34.2 28 22.7 39.5c-.8.8-.8 2.1 0 2.8.4.4.9.6 1.4.6.5 0 1-.2 1.4-.6l12.9-12.9z\"/></svg>",
			"info": {}
		},
		"close": {
			"data": "<svg xmlns=\"http://www.w3.org/2000/svg\" width=\"12\" height=\"12\"><path d=\"M12 1.209L10.791 0 6 4.791 1.209 0 0 1.209 4.791 6 0 10.791 1.209 12 6 7.209 10.791 12 12 10.791 7.209 6z\"/></svg>",
			"info": {
				"width": "12",
				"height": "12"
			}
		},
		"facebook": {
			"data": "<svg fill=\"#02458a\" xmlns=\"http://www.w3.org/2000/svg\" viewBox=\"0 0 42 77\"><defs><clipPath id=\"a\"><path fill=\"none\" d=\"M0 .1h42V77H0z\"/></clipPath></defs><g clip-path=\"url(#a)\"><path d=\"M40 0H30C18.84 0 11.59 7.43 11.59 18.92v8.73h-10A1.57 1.57 0 0 0 0 29.22v12.64a1.57 1.57 0 0 0 1.57 1.57h10v31.9a1.58 1.58 0 0 0 1.57 1.57h13.1a1.57 1.57 0 0 0 1.57-1.57v-31.9h11.72a1.57 1.57 0 0 0 1.57-1.57V29.22a1.59 1.59 0 0 0-.46-1.11 1.57 1.57 0 0 0-1.11-.46H27.81v-7.4c0-3.55.85-5.36 5.48-5.36H40a1.56 1.56 0 0 0 1.56-1.57V1.59A1.57 1.57 0 0 0 40 0zm0 0\"/></g></svg>",
			"info": {}
		},
		"instagram": {
			"data": "<svg xmlns=\"http://www.w3.org/2000/svg\" viewBox=\"0 0 135.2 135.3\" fill=\"#02458a\"><path d=\"M97.9 0H37.3C16.7 0 0 16.7 0 37.3v60.6c0 20.6 16.7 37.3 37.3 37.3h60.6c20.6 0 37.3-16.7 37.3-37.3V37.3C135.2 16.7 118.5 0 97.9 0zm25.3 97.9c0 14-11.4 25.3-25.3 25.3H37.3c-14 0-25.3-11.4-25.3-25.3V37.3C12 23.4 23.4 12 37.3 12h60.6c14 0 25.3 11.4 25.3 25.3v60.6zm0 0\"/><path d=\"M67.6 32.8c-19.2 0-34.9 15.6-34.9 34.8 0 19.2 15.6 34.9 34.9 34.9 19.2 0 34.9-15.6 34.9-34.9 0-19.2-15.7-34.8-34.9-34.8zm0 57.7c-12.6 0-22.9-10.2-22.9-22.8C44.8 55 55 44.8 67.6 44.8S90.5 55 90.5 67.6c0 12.6-10.3 22.9-22.9 22.9zm36.3-67.9c-2.3 0-4.6.9-6.2 2.6-1.6 1.6-2.6 3.9-2.6 6.2 0 2.3.9 4.6 2.6 6.2 1.6 1.6 3.9 2.6 6.2 2.6 2.3 0 4.6-.9 6.2-2.6 1.6-1.6 2.6-3.9 2.6-6.2 0-2.3-.9-4.6-2.6-6.2-1.6-1.7-3.8-2.6-6.2-2.6zm0 0\"/></svg>",
			"info": {}
		},
		"phone": {
			"data": "<svg xmlns=\"http://www.w3.org/2000/svg\" viewBox=\"0 0 51.9 51.9\"><path d=\"M51.5 40.4c-1.9-3.6-8.9-7.7-8.9-7.7-1.6-.9-3.5-1-4.4.6 0 0-2.3 2.7-2.9 3.1-2.6 1.8-5.1 1.7-7.6-.8L22 29.9l-5.7-5.7c-2.5-2.5-2.5-4.9-.7-7.6.4-.6 3.1-2.9 3.1-2.9 1.6-.9 1.5-2.8.6-4.4 0 0-4.1-7-7.7-8.9-1.6-.8-3.4-.5-4.7.8L4.4 3.7c-8 8-4.1 17.1 4 25.2l7.4 7.4 7.4 7.4c8 8 17.1 12 25.2 4l2.5-2.5c1.1-1.4 1.4-3.3.6-4.8z\" fill=\"#02458a\"/></svg>",
			"info": {}
		},
		"vk": {
			"data": "<svg xmlns=\"http://www.w3.org/2000/svg\" viewBox=\"0 0 348.1 192.7\" fill=\"#02458a\"><path d=\"M348.1 7.1v.5c-.2.4-.3.8-.5 1.2l-3.3 9.6c-3.8 10.3-7.9 20.5-12.8 30.4-3.5 7-7.7 13.6-13.1 19.4-3.4 3.7-6.7 7.5-9.9 11.3-3.6 4.3-7.1 8.7-10 13.5-2 3.3-3.7 6.8-4.8 10.6-1.5 5-1 9.8 1.8 14.3.9 1.4 1.8 2.8 2.8 4.1 2.5 3.3 5.5 6.2 8.6 9 2.8 2.6 5.7 5.1 8.6 7.6 5.2 4.4 9.9 9.2 14.8 13.9 3.4 3.2 6.6 6.6 9.5 10.2 2.3 2.9 4.3 5.9 5.7 9.3 1.1 2.8 1.7 5.7 1.5 8.7-.1 1.5-.4 2.9-.9 4.2-1.2 3-3.5 4.8-6.5 5.9-2.3.9-4.8 1.3-7.2 1.4-3 .1-6 .2-9 .2-4 0-7.9-.3-11.9-.3-4.9 0-9.8.2-14.7.4-.3 0-.6.1-.9.1h-11.8c-.3-.1-.7-.1-1-.2-2.3-.2-4.7-.4-7-.7-6.6-1-12.5-3.5-17.9-7.4-3.6-2.6-6.6-5.8-9.5-9.2-4.3-5.2-8.6-10.4-12.9-15.5-.9-1.1-1.8-2.1-2.8-3.1-2-2.2-4.2-4.1-6.8-5.6-2.8-1.6-5.8-2.2-9-1.7-3 .5-5.5 1.9-7.3 4.4-1 1.4-1.7 3-2.3 4.6-1 2.9-1.5 5.9-1.9 8.8-.6 4-1 8.1-1.6 12.1-.4 3.1-1.1 6.1-2.1 9-.2.6-.5.9-1.1.9-6 .9-12.1 1.6-18.2 1.9-7.1.4-14.1.3-21.2-.3-5.1-.4-10.2-1.1-15.2-2.2-11.5-2.3-22.4-6.3-32.7-12-10.7-5.9-20.2-13.4-28.8-21.9-7.6-7.5-14.3-15.7-20.6-24.3-7-9.6-13.3-19.6-19.5-29.8-6-9.8-11.6-19.8-16.6-30.1C21.7 57.1 15.7 43.7 10 30.2 6.8 22.6 3.6 14.8.4 7 .2 6.7.1 6.4 0 6c21.9-.1 43.7-.2 65.5-.2.3.5.5.9.7 1.2 7.7 13.9 15.4 27.9 23.1 41.8 3.7 6.7 7.6 13.1 12.1 19.3 3.3 4.6 6.6 9.2 9.9 13.7 1.3 1.8 2.6 3.5 4 5.2 1.3 1.5 2.7 3 4.2 4.2 1.2 1 2.6 1.8 4.1 2.3 2.8.9 5.3.3 7.3-1.9 1-1.1 1.7-2.3 2.4-3.6 1.1-2.2 1.9-4.5 2.5-6.8 1.8-6.8 2.6-13.8 2.8-20.9.1-3.9 0-7.8-.1-11.7-.1-4.2-.7-8.5-1.5-12.6-.6-3-1.3-5.9-2.5-8.7-1.1-2.6-2.8-4.8-5.1-6.5-1.7-1.3-3.6-2.3-5.6-3-2.4-.9-4.9-1.7-7.3-2.5-.2-.1-.5-.2-.7-.3.4-1.9 1.4-3.3 2.7-4.5 1.5-1.3 3.1-2.3 4.9-3.2 3-1.5 6.1-2.5 9.4-3.4 9.1-2.4 18.4-3.4 27.7-3.7 5-.2 9.9-.1 14.9.3 4.4.3 8.8.9 13.1 1.8 2.9.7 5.8 1.5 8.5 2.9 1.8.9 3.3 2.1 4.5 3.7 1.9 2.5 3 5.3 3.8 8.3.9 3.9 1.1 7.9 1.1 11.8-.1 5.7-.8 11.3-1.4 16.9l-1.8 15.6c-.5 5-.7 9.9-.2 14.9.3 3.1.9 6.1 2.1 9 1.4 3.3 3.4 6 6.3 8.1.5.4.8.4 1.4.1 1.6-1 3.2-2 4.8-3.1 4.7-3.3 8.7-7.3 12.5-11.6 5.9-6.6 11-13.7 15.6-21.2 10-15.8 18.2-32.6 25.3-49.8.1-.3.3-.6.4-1h3.6c7.9 0 15.8.1 23.8.2 9.2.1 18.4.1 27.6.2 6.7 0 13.5.1 20.2.1.5-.2 1-.2 1.5-.3z\"/></svg>",
			"info": {}
		},
		"youtube": {
			"data": "<svg xmlns=\"http://www.w3.org/2000/svg\" viewBox=\"-74 234.4 461 326.2\" fill=\"#02458a\"><path d=\"M291.3 234.4H21.7c-52.9 0-95.7 42.9-95.7 95.7v134.7c0 52.9 42.9 95.7 95.7 95.7h269.5c52.9 0 95.7-42.9 95.7-95.7V330.1c.1-52.8-42.8-95.7-95.6-95.7zm-64.8 169.7l-126.1 60.1c-3.4 1.6-7.2-.8-7.2-4.6v-124c0-3.8 4-6.2 7.3-4.5L226.6 395c3.8 1.9 3.7 7.2-.1 9.1z\"/></svg>",
			"info": {}
		}
	},
	"LINKS": {
		"home": "./",
		"ui": "ui.html",
		"firstScreen": "#first-screen",
		"why": "#why",
		"advantages": "#advantages",
		"method": "#method",
		"package": "#package",
		"tracker": "#tracker",
		"perspectives": "#perspectives",
		"economics": "#economic",
		"reviews": "#reviews",
		"formOrder": "#order",
		"youtube": "https://youtube.com",
		"instagram": "https://instagram.com",
		"vk": "https://vk.com",
		"facebook": "https://facebook.com"
	},
	"PAGES": [
		{
			"name": "Главная страница",
			"href": "index.html"
		},
		{
			"name": "UI",
			"href": "ui.html"
		}
	],
	"TITLE": {
		"home": "Unior | Франшиза детской футбольной школы «Юниор»",
		"ui": "Unior | UI Page"
	}
}