<?xml version="1.0" encoding="utf-8"?>
<!-- Generator: Adobe Illustrator 22.1.0, SVG Export Plug-In . SVG Version: 6.00 Build 0)  -->
<svg version="1.1" id="Слой_1" xmlns="http://www.w3.org/2000/svg" xmlns:xlink="http://www.w3.org/1999/xlink" x="0px" y="0px"
	 viewBox="0 0 27.7 48.8" style="enable-background:new 0 0 27.7 48.8;" xml:space="preserve">
<path d="M22.1,47.8c0.6,0.6,1.4,1,2.3,1c0.8,0,1.7-0.3,2.3-1c1.3-1.3,1.3-3.4,0-4.6L7.9,24.4L26.7,5.6C28,4.3,28,2.2,26.7,1
	c-1.3-1.3-3.4-1.3-4.6,0L1,22.1c-0.6,0.6-1,1.4-1,2.3s0.3,1.7,1,2.3L22.1,47.8z"/>
</svg>
