<?xml version="1.0" encoding="utf-8"?>
<!-- Generator: Adobe Illustrator 22.1.0, SVG Export Plug-In . SVG Version: 6.00 Build 0)  -->
<svg version="1.1" id="Слой_1" xmlns="http://www.w3.org/2000/svg" xmlns:xlink="http://www.w3.org/1999/xlink" x="0px" y="0px"
	 viewBox="0 0 26.4 26.4" style="enable-background:new 0 0 26.4 26.4;" xml:space="preserve">
<path d="M13.2,26.4C5.9,26.4,0,20.5,0,13.2S5.9,0,13.2,0s13.2,5.9,13.2,13.2S20.5,26.4,13.2,26.4 M13.2,0.8
	C6.4,0.8,0.8,6.4,0.8,13.2s5.6,12.4,12.4,12.4S25.6,20,25.6,13.2C25.6,6.4,20,0.8,13.2,0.8"/>
<path d="M13.2,26.4c-2.7,0-5.4-0.8-7.6-2.4c-0.1-0.1-0.2-0.2-0.2-0.4c0-0.1,0.1-0.3,0.3-0.3C9,22,9.5,21,9.5,19.1
	c0-0.5-0.1-0.7-0.3-1c-0.3-0.4-0.6-0.9-0.9-2.4c0-0.2-0.1-0.2-0.3-0.3c-0.5-0.2-0.9-0.6-1-2.1c0-0.7,0.3-1.2,0.5-1.4
	c0-0.3-0.1-0.7-0.2-1.2C6.9,8.6,6.9,5.9,10,4.6c2.7-1.1,4.9-0.5,5.6,0.2c0.5,0,1.7,0.1,2.6,1.2c1.3,1.6,0.9,5.1,0.8,6
	c0.2,0.2,0.5,0.6,0.5,1.3c-0.1,1.6-0.6,1.9-1,2.1c-0.2,0.1-0.2,0.1-0.3,0.3c-0.3,1.4-0.6,2-0.9,2.4c-0.2,0.3-0.3,0.5-0.3,1
	c0,1.9,0.5,2.9,3.9,4.1c0.1,0.1,0.2,0.2,0.3,0.3c0,0.1,0,0.3-0.2,0.4C18.6,25.6,15.9,26.4,13.2,26.4 M6.7,23.7
	c2,1.2,4.2,1.9,6.5,1.9s4.6-0.6,6.5-1.9c-2.8-1.1-3.7-2.3-3.7-4.6c0-0.8,0.2-1.1,0.5-1.4c0.2-0.4,0.5-0.8,0.8-2
	c0.1-0.6,0.5-0.8,0.7-0.9c0.2-0.1,0.5-0.2,0.6-1.4c0-0.6-0.3-0.8-0.3-0.8c-0.1-0.1-0.2-0.3-0.2-0.4c0.2-1.1,0.5-4.4-0.5-5.6
	c-0.7-0.8-1.9-0.9-2.1-0.9h-0.1c-0.1,0-0.3-0.1-0.3-0.2c-0.2-0.4-2.1-1.1-4.7-0.1s-2.6,3.3-2.3,5.3c0.1,0.8,0.2,1.4,0.2,1.4
	c0,0.2-0.1,0.4-0.2,0.4c0,0-0.3,0.2-0.3,0.8c0.1,1.2,0.3,1.3,0.6,1.4C8.6,14.9,9,15,9.1,15.6c0.2,1.2,0.5,1.7,0.8,2
	c0.2,0.3,0.5,0.7,0.5,1.4C10.3,21.4,9.4,22.6,6.7,23.7"/>
</svg>
