{
	"arrow-down": {
		"data": "<svg xmlns=\"http://www.w3.org/2000/svg\" viewBox=\"0 0 48.8 27.7\"><path d=\"M47.8 5.6c.6-.6 1-1.4 1-2.3 0-.8-.3-1.7-1-2.3-1.3-1.3-3.4-1.3-4.6 0L24.4 19.8 5.6 1C4.3-.3 2.2-.3 1 1-.3 2.3-.3 4.4 1 5.6l21.1 21.1c.6.6 1.4 1 2.3 1s1.7-.3 2.3-1L47.8 5.6z\"/></svg>",
		"info": {}
	},
	"arrow-left": {
		"data": "<svg xmlns=\"http://www.w3.org/2000/svg\" viewBox=\"0 0 27.7 48.8\"><path d=\"M22.1 47.8c.6.6 1.4 1 2.3 1 .8 0 1.7-.3 2.3-1 1.3-1.3 1.3-3.4 0-4.6L7.9 24.4 26.7 5.6C28 4.3 28 2.2 26.7 1c-1.3-1.3-3.4-1.3-4.6 0L1 22.1c-.6.6-1 1.4-1 2.3s.3 1.7 1 2.3l21.1 21.1z\"/></svg>",
		"info": {}
	},
	"arrow-right": {
		"data": "<svg xmlns=\"http://www.w3.org/2000/svg\" viewBox=\"0 0 27.7 48.8\"><path d=\"M5.6 1C5 .4 4.2 0 3.3 0 2.5 0 1.6.3 1 1-.3 2.3-.3 4.4 1 5.6l18.8 18.8L1 43.2c-1.3 1.3-1.3 3.4 0 4.6 1.3 1.3 3.4 1.3 4.6 0l21.1-21.1c.6-.6 1-1.4 1-2.3s-.3-1.7-1-2.3L5.6 1z\"/></svg>",
		"info": {}
	},
	"arrow-up": {
		"data": "<svg xmlns=\"http://www.w3.org/2000/svg\" viewBox=\"0 0 48.8 27.7\"><path d=\"M1 22.1c-.6.6-1 1.4-1 2.3 0 .8.3 1.7 1 2.3 1.3 1.3 3.4 1.3 4.6 0L24.4 7.9l18.8 18.8c1.3 1.3 3.4 1.3 4.6 0 1.3-1.3 1.3-3.4 0-4.6L26.7 1c-.6-.6-1.4-1-2.3-1s-1.7.3-2.3 1L1 22.1z\"/></svg>",
		"info": {}
	},
	"facebook": {
		"data": "<svg xmlns=\"http://www.w3.org/2000/svg\" viewBox=\"0 0 15.2 32.6\"><path d=\"M10.1 32.6V16.3h4.5l.6-5.6h-5.1V7.9c0-1.5.1-2.3 2.2-2.3h2.8V0h-4.5C5.3 0 3.4 2.7 3.4 7.3v3.4H0v5.6h3.4v16.3h6.7z\"/></svg>",
		"info": {}
	},
	"instagram": {
		"data": "<svg id=\"Слой_1\" xmlns=\"http://www.w3.org/2000/svg\" xmlns:xlink=\"http://www.w3.org/1999/xlink\" viewBox=\"0 0 135.3 135.3\"><style>.st0{clip-path:url(#SVGID_2_)}</style><defs><path id=\"SVGID_1_\" d=\"M0 0h135.3v135.3H0z\"/></defs><clipPath id=\"SVGID_2_\"><use xlink:href=\"#SVGID_1_\" overflow=\"visible\"/></clipPath><path class=\"st0\" d=\"M97.9 0H37.3C16.7 0 0 16.7 0 37.3v60.6c0 20.6 16.7 37.3 37.3 37.3h60.6c20.6 0 37.3-16.7 37.3-37.3V37.3C135.3 16.7 118.5 0 97.9 0m25.4 97.9c0 14-11.4 25.3-25.3 25.3H37.3c-14 0-25.3-11.4-25.3-25.3V37.3C12 23.4 23.4 12 37.3 12h60.6c14 0 25.3 11.4 25.3 25.3v60.6z\"/><path class=\"st0\" d=\"M67.6 32.8c-19.2 0-34.9 15.6-34.9 34.8 0 19.2 15.6 34.9 34.9 34.9 19.2 0 34.9-15.6 34.9-34.9 0-19.2-15.7-34.8-34.9-34.8m0 57.7c-12.6 0-22.9-10.2-22.9-22.8C44.8 55 55 44.8 67.6 44.8S90.5 55 90.5 67.6c0 12.6-10.3 22.9-22.9 22.9m36.3-67.9c-2.3 0-4.6.9-6.2 2.6-1.6 1.6-2.6 3.9-2.6 6.2 0 2.3.9 4.6 2.6 6.2 1.6 1.6 3.9 2.6 6.2 2.6 2.3 0 4.6-.9 6.2-2.6 1.6-1.6 2.6-3.9 2.6-6.2 0-2.3-.9-4.6-2.6-6.2-1.6-1.7-3.8-2.6-6.2-2.6\"/></svg>",
		"info": {}
	},
	"point": {
		"data": "<svg xmlns=\"http://www.w3.org/2000/svg\" viewBox=\"0 0 360 512\"><path d=\"M180 0C80.7 0 0 80.7 0 180c0 33.5 9.3 66.3 26.9 94.7L169.8 505c2.7 4.4 7.6 7.1 12.7 7.1h.1c5.2 0 10.1-2.8 12.8-7.3l139.2-232.5c16.6-27.8 25.4-59.7 25.4-92.2C360 80.7 279.3 0 180 0m128.9 256.8L182.3 468.2 52.4 258.8c-14.6-23.6-22.6-50.9-22.6-78.8C29.8 97.3 97.3 29.8 180 29.8S330.1 97.3 330.1 180c0 27.1-7.4 53.7-21.2 76.8\"/><path d=\"M180 90c-49.6 0-90 40.4-90 90 0 49.3 39.7 90 90 90 50.9 0 90-41.2 90-90 0-49.6-40.4-90-90-90m0 150.2c-33.3 0-60.2-27-60.2-60.2 0-33.1 27.1-60.2 60.2-60.2s60.1 27.1 60.1 60.2c0 32.7-26.3 60.2-60.1 60.2\"/></svg>",
		"info": {}
	},
	"user": {
		"data": "<svg xmlns=\"http://www.w3.org/2000/svg\" viewBox=\"0 0 26.4 26.4\"><path d=\"M13.2 26.4C5.9 26.4 0 20.5 0 13.2S5.9 0 13.2 0s13.2 5.9 13.2 13.2-5.9 13.2-13.2 13.2m0-25.6C6.4.8.8 6.4.8 13.2s5.6 12.4 12.4 12.4S25.6 20 25.6 13.2C25.6 6.4 20 .8 13.2.8\"/><path d=\"M13.2 26.4c-2.7 0-5.4-.8-7.6-2.4-.1-.1-.2-.2-.2-.4 0-.1.1-.3.3-.3C9 22 9.5 21 9.5 19.1c0-.5-.1-.7-.3-1-.3-.4-.6-.9-.9-2.4 0-.2-.1-.2-.3-.3-.5-.2-.9-.6-1-2.1 0-.7.3-1.2.5-1.4 0-.3-.1-.7-.2-1.2-.4-2.1-.4-4.8 2.7-6.1 2.7-1.1 4.9-.5 5.6.2.5 0 1.7.1 2.6 1.2 1.3 1.6.9 5.1.8 6 .2.2.5.6.5 1.3-.1 1.6-.6 1.9-1 2.1-.2.1-.2.1-.3.3-.3 1.4-.6 2-.9 2.4-.2.3-.3.5-.3 1 0 1.9.5 2.9 3.9 4.1l.3.3c0 .1 0 .3-.2.4-2.4 1.7-5.1 2.5-7.8 2.5m-6.5-2.7c2 1.2 4.2 1.9 6.5 1.9s4.6-.6 6.5-1.9c-2.8-1.1-3.7-2.3-3.7-4.6 0-.8.2-1.1.5-1.4.2-.4.5-.8.8-2 .1-.6.5-.8.7-.9.2-.1.5-.2.6-1.4 0-.6-.3-.8-.3-.8-.1-.1-.2-.3-.2-.4.2-1.1.5-4.4-.5-5.6-.7-.8-1.9-.9-2.1-.9h-.1c-.1 0-.3-.1-.3-.2-.2-.4-2.1-1.1-4.7-.1s-2.6 3.3-2.3 5.3c.1.8.2 1.4.2 1.4 0 .2-.1.4-.2.4 0 0-.3.2-.3.8.1 1.2.3 1.3.6 1.4.2.2.6.3.7.9.2 1.2.5 1.7.8 2 .2.3.5.7.5 1.4-.1 2.4-1 3.6-3.7 4.7\"/></svg>",
		"info": {}
	},
	"vk": {
		"data": "<svg xmlns=\"http://www.w3.org/2000/svg\" viewBox=\"0 0 32 18\"><path d=\"M17.6 17.8s.6-.1.9-.4c.3-.3.3-.8.3-.8s0-2.5 1.2-2.9c1.2-.4 2.7 2.4 4.3 3.5 1.2.8 2.1.6 2.1.6l4.3-.1s2.2-.1 1.2-1.9c-.1-.1-.6-1.3-3.2-3.6-2.7-2.4-2.3-2 .9-6.3 2-2.6 2.8-4.1 2.5-4.8-.2-.6-1.7-.5-1.7-.5h-4.8s-.4 0-.6.1c-.3.2-.4.5-.4.5s-.8 2-1.8 3.7c-2.1 3.6-3 3.8-3.3 3.5-.8-.5-.6-2.1-.6-3.2 0-3.5.5-4.9-1-5.3-.8.2-1.2.1-2.5.1-1.7 0-3.2 0-4 .4-.5.3-1 .8-.7.9.3 0 1 .2 1.4.7.5.7.5 2.1.5 2.1s.3 4.1-.7 4.6c-.6.3-1.5-.4-3.4-3.6-1-1.7-1.7-3.5-1.7-3.5s-.2-.3-.4-.5C6 .9 5.6.8 5.6.8H1s-.7 0-.9.3c-.2.3 0 .8 0 .8s3.6 8.2 7.6 12.4c3.7 3.8 7.9 3.5 7.9 3.5h2z\"/></svg>",
		"info": {}
	},
	"youtube": {
		"data": "<svg xmlns=\"http://www.w3.org/2000/svg\" viewBox=\"0 0 461 326.2\"><path d=\"M365.3 0H95.7C42.9 0 0 42.9 0 95.7v134.7c0 52.9 42.9 95.7 95.7 95.7h269.5c52.9 0 95.7-42.9 95.7-95.7V95.7C461 42.9 418.1 0 365.3 0m-64.8 169.7l-126.1 60.1c-3.4 1.6-7.2-.8-7.2-4.6v-124c0-3.8 4-6.2 7.3-4.5l126.1 63.9c3.8 1.9 3.7 7.3-.1 9.1\"/></svg>",
		"info": {}
	}
}