<?xml version="1.0" encoding="utf-8"?>
<!-- Generator: Adobe Illustrator 22.0.1, SVG Export Plug-In . SVG Version: 6.00 Build 0)  -->
<svg version="1.1" id="Слой_1" xmlns="http://www.w3.org/2000/svg" xmlns:xlink="http://www.w3.org/1999/xlink" x="0px" y="0px"
	 viewBox="0 0 278.2 172" style="enable-background:new 0 0 278.2 172;" xml:space="preserve">
<style type="text/css">
	.st0{fill:#FFFFFF;}
	.st1{fill:#E0002F;}
	.st2{fill:#D8B57C;}
</style>
<polygon class="st0" points="0,95.6 139.1,172 278.2,95.6 278.2,95.6 139.1,19.2 "/>
<path class="st1" d="M26.1,95.6l113.2-62.3l113.5,62.3l-113.5,62.3L26.1,95.6z M139.4,23.8L8.7,95.6l130.7,71.8l130.6-71.8
	L139.4,23.8z"/>
<path class="st1" d="M146.4,111.5c0.3-0.5,0.7-1.3,0.9-1.7c0.3-0.1,1.3-0.6,2.9-1.6c1.8-1.2,3.1-2.4,3.5-2.8
	C151.9,108,149.4,110.1,146.4,111.5 M124.5,104.8c0.4,0,0.9,0,1.3-0.1c0.5-0.1,1.1-0.2,1.3-0.3l0,0c0.1,0.2,1.2,1.7,2.7,2.8
	c1.6,1.1,3.5,1.9,3.7,2l0,0c0.1,0.6,0.4,1.6,0.5,1.8c0.1,0.4,0.3,0.8,0.5,1.2C130.3,111.1,126.8,108.4,124.5,104.8z M139.4,78.1
	c2.6,0,5.1,0.6,7.3,1.6c0.1,0.1,0.2,0.1,0.3,0.2c0.5,0.4,1,0.9,1.5,1.4c0.3,0.3,0.5,0.5,0.7,0.9l-3.2,3.4c-1.7-0.3-3.4-0.4-5.1-0.5
	c-1.1,0-2.1,0-3,0.1c-0.1,0-0.2,0-0.2,0l-4.4-3.8c0.8-1.2,1.8-2.1,3-2.9C137.1,78.2,138.2,78.1,139.4,78.1L139.4,78.1z M149.3,82.3
	c0.4,0,0.7,0.2,1,0.4c0.7,0.4,1.3,0.7,1.9,1.1c2.6,2.8,4.2,6.5,4.5,10.5c-0.6,1-1.4,1.8-2.2,2.6l-5.8-3.6c0-0.1-0.1-0.3-0.1-0.4
	c0-0.2-0.1-0.4-0.1-0.5c-0.7-2.5-1.4-4.7-2.5-6.8L149.3,82.3C149.3,82.3,149.3,82.3,149.3,82.3z M141.3,106.2l0.6-8.1
	c0.4-0.2,1.3-0.8,1.4-0.9c1.2-0.7,2.4-1.6,3.6-2.4c0.2-0.1,1.2-0.8,1.5-1.1c0.1-0.1,0.2-0.1,0.3-0.2l5.7,3.6c0.1,0.9,0.1,2,0,3
	c-0.1,1.1-0.2,2.2-0.3,3.3c-0.1,0.6-0.2,1.1-0.3,1.6l0,0c0,0-1.4,1.5-3.6,2.9c-1.5,1-2.5,1.4-2.8,1.6c-1.2-0.6-2.5-1.2-3.7-1.9
	C143.4,107.4,141.7,106.5,141.3,106.2z M123.4,91.7c0.1-0.4,0.5-1.8,0.9-3.2c0.7-1.9,1.5-3.6,1.7-3.9c0.5-0.4,1-0.7,1.5-1
	c1.1-0.7,2.1-1.1,3.3-1.5c0.7-0.3,1.4-0.6,2.1-0.7l4.4,3.8c-0.3,0.5-1.3,3-2.4,6.5c-0.1,0.3-0.2,0.7-0.3,0.9l-7.1,3.2
	C126.2,94.7,123.9,92.2,123.4,91.7z M125.8,84.5c-0.2,0.4-1,2.1-1.7,3.9c-0.5,1.5-0.9,3-1,3.3l0,0c-0.3,0.3-0.8,0.9-1.1,1.5
	C122.5,90,123.8,87,125.8,84.5C125.8,84.5,125.8,84.5,125.8,84.5z M133.7,109.1c0,0-2-0.8-3.7-2c-1.6-1.2-2.7-2.8-2.7-2.8l0-0.1
	c-0.1-1.3-0.2-3.1-0.1-4.4c0.1-1.2,0.2-2.3,0.4-3.6l7-3.2c1.1,0.9,2.3,1.7,3.5,2.6c1.2,0.9,2.3,1.8,3.5,2.6l-0.6,8
	C138.7,107.3,134.4,108.9,133.7,109.1z M152.6,82.4c-3.5-3.5-8.2-5.5-13.2-5.5h-0.1c-10.3,0-18.6,8.4-18.7,18.6
	c0,10.3,8.3,18.7,18.6,18.7h0.1c10.3,0,18.6-8.4,18.7-18.6C158,90.6,156.1,85.9,152.6,82.4z"/>
<path class="st1" d="M203.7,77.9l-40.9,22.5c-2.2,10.9-11.9,19.1-23.5,19.1c-13.2,0-24-10.7-24-24c0-13.2,10.7-24,24-24
	c8.9,0,16.6,4.8,20.8,12h4.6V64l6.9-3.8l-32.2-17.6L43.1,95.6l32.1,17.6l21.6-11.8c1.3,7.7,5.2,14.5,11.6,19.7c2.4,1.9,5,3.6,7.9,5
	l-8.8,4.9l31.9,17.6l96.5-52.9L203.7,77.9z M163.4,117.3L163.4,117.3c-7,6.9-17,10.9-27.4,10.9c-10.1,0-19.5-3.1-26.4-8.8
	c-7.4-6-11.3-14.3-11.3-23.8c0-9.5,3.9-17.8,11.3-23.8c6.9-5.7,16.3-8.8,26.4-8.8c7.7,0,15.4,2.2,21.7,6.3l1.1,0.7l0.8-1.9l3-1.6v15
	h-1.3c-4.8-7.5-13-12-21.9-12c-14.4,0-26.1,11.7-26.1,26.1c0,14.4,11.7,26.1,26.1,26.1c9.1,0,17.5-4.8,22.3-12.5h1.9V117.3z"/>
<polygon class="st2" points="127.6,0 124.8,5.7 118.5,6.6 123.1,11.1 122,17.4 127.6,14.3 133.3,17.4 132.2,11.1 136.7,6.6 
	130.4,5.7 "/>
<polygon class="st2" points="104.9,0 102.1,5.7 95.8,6.6 100.4,11.1 99.3,17.4 104.9,14.3 110.6,17.4 109.5,11.1 114.1,6.6 
	107.7,5.7 "/>
<polygon class="st2" points="150.2,0 147.4,5.7 141,6.6 145.6,11.1 144.5,17.4 150.2,14.3 155.8,17.4 154.7,11.1 159.3,6.6 153,5.7 
	"/>
<polygon class="st2" points="172.9,0 170,5.7 163.7,6.6 168.3,11.1 167.2,17.4 172.9,14.3 178.5,17.4 177.4,11.1 182,6.6 175.7,5.7 
	"/>
</svg>
