<?xml version="1.0" encoding="utf-8"?>
<!-- Generator: Adobe Illustrator 22.1.0, SVG Export Plug-In . SVG Version: 6.00 Build 0)  -->
<svg version="1.1" id="Слой_1" xmlns="http://www.w3.org/2000/svg" xmlns:xlink="http://www.w3.org/1999/xlink" x="0px" y="0px"
	 viewBox="0 0 27.7 48.8" style="enable-background:new 0 0 27.7 48.8;" xml:space="preserve">
<style type="text/css">
	.st0{fill:#E0002F;}
</style>
<path class="st0" d="M5.6,1C5,0.4,4.2,0,3.3,0C2.5,0,1.6,0.3,1,1c-1.3,1.3-1.3,3.4,0,4.6l18.8,18.8L1,43.2c-1.3,1.3-1.3,3.4,0,4.6
	c1.3,1.3,3.4,1.3,4.6,0l21.1-21.1c0.6-0.6,1-1.4,1-2.3s-0.3-1.7-1-2.3L5.6,1z"/>
</svg>
