[
  {
    "num": "0",
    "name": "Главная страница",
    "href": "index.html",
    "title": "Школа Спартак | Главная страница"
  },
  {
    "num": "1",
    "name": "UI",
    "href": "ui.html",
    "title": "Школа Спартак | UI страница"
  }
]
