<?xml version="1.0" encoding="utf-8"?>
<!-- Generator: Adobe Illustrator 21.0.0, SVG Export Plug-In . SVG Version: 6.00 Build 0)  -->
<svg version="1.1" id="Слой_1" xmlns="http://www.w3.org/2000/svg" xmlns:xlink="http://www.w3.org/1999/xlink" x="0px" y="0px"
	 viewBox="0 0 164.5 186.9" style="enable-background:new 0 0 164.5 186.9;" xml:space="preserve">
<style type="text/css">
	.st0{fill:#022169;}
</style>
<path class="st0" d="M48.9,151l-0.3-0.2l-0.1-0.1c-0.8-0.4-1.6-0.8-2.4-1c-0.5-0.9-1.2-1.7-2-2.4c-1.8-1.6-4.1-2.5-6.5-2.5
	c-1.9,0-3.8,0.6-5.4,1.7c-1.6,1.1-7,4.7-7,4.7l-1.3,0.8c-6.3,4.2-9.9,11.5-9.4,19.1l0.3,5.3c0.2,3.2,1.8,6.2,4.3,8.1
	c2,1.5,4.4,2.4,6.9,2.4c0.8,0,1.5-0.1,2.2-0.2l5.1-1c7.4-1.5,13.5-6.8,16-14L50,170c0,0,2.1-6,2.7-7.7
	C54.1,158.1,52.6,153.5,48.9,151z M24.7,177.4c-0.3-0.2-0.8-0.8-0.9-1.6l-0.3-5.2c-0.3-4.4,1.8-8.6,5.5-11l1.3-0.9
	c0,0,5.4-3.7,7-4.7c0.3-0.2,0.6-0.1,0.8,0.1c0,0,0,0.1,0.1,0.1c0.2,0.2,0.3,0.6,0.1,0.8c-1.9,2.9-3.4,5.4-4.3,7.4
	c-1.1,2.3-1.4,3.8-0.9,4.3c1.1,0.8,5-2.5,10-7.9c0.2-0.2,0.6-0.3,0.9-0.1c0.3,0.2,0.4,0.5,0.3,0.8c-0.6,1.8-2.7,7.8-2.7,7.8
	l-0.6,1.6c-1.4,4.1-5,7.2-9.3,8.1l-5.1,1c-0.1,0-0.2,0-0.3,0C25.4,177.9,24.9,177.6,24.7,177.4z"/>
<path class="st0" d="M123.7,44.1l-22.5,11.5c-2.5,1.3-2.8,4.7-0.5,6.4l7.5,5.6l10.7,7.9c1.9,1.4,4.4,0.8,5.5-1
	c0.2-0.4,0.4-0.8,0.5-1.3l4.3-25C129.8,45.1,126.5,42.7,123.7,44.1z M117.5,62.9l-0.1,0.4l-0.3-0.2l-4.4-3.3l5.8-3l-0.3,1.9
	l-0.6,3.5L117.5,62.9z M123.7,44.1l-22.5,11.5c-2.5,1.3-2.8,4.7-0.5,6.4l7.5,5.6l10.7,7.9c1.9,1.4,4.4,0.8,5.5-1
	c0.2-0.4,0.4-0.8,0.5-1.3l4.3-25C129.8,45.1,126.5,42.7,123.7,44.1z M117.5,62.9l-0.1,0.4l-0.3-0.2l-4.4-3.3l5.8-3l-0.3,1.9
	l-0.6,3.5L117.5,62.9z M123.7,44.1l-22.5,11.5c-2.5,1.3-2.8,4.7-0.5,6.4l7.5,5.6l10.7,7.9c1.9,1.4,4.4,0.8,5.5-1
	c0.2-0.4,0.4-0.8,0.5-1.3l4.3-25C129.8,45.1,126.5,42.7,123.7,44.1z M117.5,62.9l-0.1,0.4l-0.3-0.2l-4.4-3.3l5.8-3l-0.3,1.9
	l-0.6,3.5L117.5,62.9z M123.7,44.1l-22.5,11.5c-2.5,1.3-2.8,4.7-0.5,6.4l7.5,5.6l10.7,7.9c1.9,1.4,4.4,0.8,5.5-1
	c0.2-0.4,0.4-0.8,0.5-1.3l4.3-25C129.8,45.1,126.5,42.7,123.7,44.1z M117.5,62.9l-0.1,0.4l-0.3-0.2l-4.4-3.3l5.8-3l-0.3,1.9
	l-0.6,3.5L117.5,62.9z M123.7,44.1l-22.5,11.5c-2.5,1.3-2.8,4.7-0.5,6.4l7.5,5.6l10.7,7.9c1.9,1.4,4.4,0.8,5.5-1
	c0.2-0.4,0.4-0.8,0.5-1.3l4.3-25C129.8,45.1,126.5,42.7,123.7,44.1z M117.5,62.9l-0.1,0.4l-0.3-0.2l-4.4-3.3l5.8-3l-0.3,1.9
	l-0.6,3.5L117.5,62.9z M123.7,44.1l-22.5,11.5c-2.5,1.3-2.8,4.7-0.5,6.4l7.5,5.6l10.7,7.9c1.9,1.4,4.4,0.8,5.5-1
	c0.2-0.4,0.4-0.8,0.5-1.3l4.3-25C129.8,45.1,126.5,42.7,123.7,44.1z M117.5,62.9l-0.1,0.4l-0.3-0.2l-4.4-3.3l5.8-3l-0.3,1.9
	l-0.6,3.5L117.5,62.9z M164.1,11.2l-0.1-1.8c-0.2-2.9-1.7-5.6-4.1-7.3c-1.8-1.3-3.9-2-6.1-2c-0.6,0-1.3,0.1-1.9,0.2l-3.5,0.7
	c-30.8,6-57.3,24.8-74.6,52.8l-6.7,10.9c-44.7,2.8-65.1,43.3-66,45.1c-1.6,3.3-1.4,7.2,0.5,10.3c1.8,2.8,4.7,4.6,8,4.8
	c0.2,0,0.4,0,0.6,0c0.3,0,0.6,0,1-0.1l22.3-2.1c0,0.6,0,1.3,0,1.9c0.2,2,0.8,4,1.7,5.8c0.5,1,1.2,1.9,1.9,2.8
	c1.1,1.2,2.2,2.4,3.3,3.6c4,4.1,8.5,7.9,13.5,11.4c2.9,2,5.2,3.5,8.2,5.1c0,0,1.9,1.1,2.9,1.5c3.3,1.4,4.4,1.6,6.7,1.6
	c2.1,0,4.2-0.4,6.1-1.3l0.4,2.3l3.9,21.2c0.5,2.6,1.9,4.8,3.9,6.3c1.7,1.3,3.9,2.1,6.2,2.1c2.6,0,5.2-1,7.1-2.7
	c1.2-1.1,23.3-21.3,26.8-52.1c0.8-6.9,0.6-14.3-0.9-22.2c-0.1-0.3-0.1-0.6-0.2-0.9l6-6.1l0,0l1.1-1.1
	C155.2,78.6,166.8,45.6,164.1,11.2z M151.6,50.5c-2,7.3-4.8,14.4-8.3,21.1c-0.7,1.3-1.4,2.6-2.1,3.8c-0.3,0.5-0.6,1-0.9,1.4
	c-0.3,0.5-0.6,0.9-0.9,1.4c-0.3,0.4-0.6,0.9-0.8,1.3c-0.9,1.4-1.9,2.8-2.9,4.2c-0.3,0.5-0.6,0.9-1,1.4c-2.7,3.6-5.6,7-8.8,10.2
	l-10.7,10.8c11.5,41.5-21.8,71.3-21.8,71.3c-0.9,0.8-2.1,0.6-2.4-0.6l-4.4-24l-2.8-15.2l-7.7,7.8c-1.9,1.9-4.7,2.3-7.1,1.2
	c-0.3-0.1-0.5-0.3-0.8-0.4c0,0,0,0,0,0c-3-1.6-6.1-3.4-9.1-5.5c-1.5-1-2.9-2.1-4.3-3.2c-0.7-0.5-1.3-1.1-2-1.6
	c-0.3-0.3-0.7-0.6-1-0.9c-0.9-0.8-1.9-1.7-2.8-2.5c-1.8-1.7-3.5-3.5-5-5.3c-0.6-0.6-1-1.4-1.2-2.2c0-0.1-0.1-0.2-0.1-0.3
	c0-0.1-0.1-0.3-0.1-0.4c0-0.1-0.1-0.3-0.1-0.4c0,0,0-0.1,0-0.1c0,0,0,0,0-0.1c0-0.2,0-0.3,0-0.5c0-1.1,0.3-2.2,0.9-3.2l4.9-7.9
	l-13,1.2L17,115l-6.7,0.6c-1.1,0.1-1.7-1.1-1.2-2.1c0,0,19.8-40.3,63-40.2l9.3-15c15.5-25.1,39.7-43,68.6-48.6l3.4-0.7
	c0.5-0.1,0.8,0.1,1,0.2c0.1,0.1,0.4,0.4,0.5,0.8l0.1,1.8C156.2,25,155,38.1,151.6,50.5z M123.7,44.1l-22.5,11.5
	c-2.5,1.3-2.8,4.7-0.5,6.4l7.5,5.6l10.7,7.9c1.9,1.4,4.4,0.8,5.5-1c0.2-0.4,0.4-0.8,0.5-1.3l4.3-25
	C129.8,45.1,126.5,42.7,123.7,44.1z M117.5,62.9l-0.1,0.4l-0.3-0.2l-4.4-3.3l5.8-3l-0.3,1.9l-0.6,3.5L117.5,62.9z M123.7,44.1
	l-22.5,11.5c-2.5,1.3-2.8,4.7-0.5,6.4l7.5,5.6l10.7,7.9c1.9,1.4,4.4,0.8,5.5-1c0.2-0.4,0.4-0.8,0.5-1.3l4.3-25
	C129.8,45.1,126.5,42.7,123.7,44.1z M117.5,62.9l-0.1,0.4l-0.3-0.2l-4.4-3.3l5.8-3l-0.3,1.9l-0.6,3.5L117.5,62.9z M123.7,44.1
	l-22.5,11.5c-2.5,1.3-2.8,4.7-0.5,6.4l7.5,5.6l10.7,7.9c1.9,1.4,4.4,0.8,5.5-1c0.2-0.4,0.4-0.8,0.5-1.3l4.3-25
	C129.8,45.1,126.5,42.7,123.7,44.1z M117.5,62.9l-0.1,0.4l-0.3-0.2l-4.4-3.3l5.8-3l-0.3,1.9l-0.6,3.5L117.5,62.9z M123.7,44.1
	l-22.5,11.5c-2.5,1.3-2.8,4.7-0.5,6.4l7.5,5.6l10.7,7.9c1.9,1.4,4.4,0.8,5.5-1c0.2-0.4,0.4-0.8,0.5-1.3l4.3-25
	C129.8,45.1,126.5,42.7,123.7,44.1z M117.5,62.9l-0.1,0.4l-0.3-0.2l-4.4-3.3l5.8-3l-0.3,1.9l-0.6,3.5L117.5,62.9z M123.7,44.1
	l-22.5,11.5c-2.5,1.3-2.8,4.7-0.5,6.4l7.5,5.6l10.7,7.9c1.9,1.4,4.4,0.8,5.5-1c0.2-0.4,0.4-0.8,0.5-1.3l4.3-25
	C129.8,45.1,126.5,42.7,123.7,44.1z M117.5,62.9l-0.1,0.4l-0.3-0.2l-4.4-3.3l5.8-3l-0.3,1.9l-0.6,3.5L117.5,62.9z M123.7,44.1
	l-22.5,11.5c-2.5,1.3-2.8,4.7-0.5,6.4l7.5,5.6l10.7,7.9c1.9,1.4,4.4,0.8,5.5-1c0.2-0.4,0.4-0.8,0.5-1.3l4.3-25
	C129.8,45.1,126.5,42.7,123.7,44.1z M117.5,62.9l-0.1,0.4l-0.3-0.2l-4.4-3.3l5.8-3l-0.3,1.9l-0.6,3.5L117.5,62.9z M123.7,44.1
	l-22.5,11.5c-2.5,1.3-2.8,4.7-0.5,6.4l7.5,5.6l10.7,7.9c1.9,1.4,4.4,0.8,5.5-1c0.2-0.4,0.4-0.8,0.5-1.3l4.3-25
	C129.8,45.1,126.5,42.7,123.7,44.1z M117.5,62.9l-0.1,0.4l-0.3-0.2l-4.4-3.3l5.8-3l-0.3,1.9l-0.6,3.5L117.5,62.9z"/>
</svg>
