<svg version="1.1" id="Layer_1" xmlns="http://www.w3.org/2000/svg" xmlns:xlink="http://www.w3.org/1999/xlink" x="0px" y="0px"
	 viewBox="-74 234.4 461 326.2" fill="#02458a">
<style type="text/css">
	.st0{fill:#02458a;}
</style>
<path class="st0" d="M291.3,234.4H21.7c-52.9,0-95.7,42.9-95.7,95.7v134.7c0,52.9,42.9,95.7,95.7,95.7h269.5
	c52.9,0,95.7-42.9,95.7-95.7V330.1C387,277.3,344.1,234.4,291.3,234.4z M226.5,404.1l-126.1,60.1c-3.4,1.6-7.2-0.8-7.2-4.6v-124
	c0-3.8,4-6.2,7.3-4.5L226.6,395C230.4,396.9,230.3,402.2,226.5,404.1z"/>
</svg>
