<?xml version="1.0" encoding="utf-8"?>
<!-- Generator: Adobe Illustrator 21.0.0, SVG Export Plug-In . SVG Version: 6.00 Build 0)  -->
<svg version="1.1" id="Слой_1" xmlns="http://www.w3.org/2000/svg" xmlns:xlink="http://www.w3.org/1999/xlink" x="0px" y="0px"
	 viewBox="0 0 204.5 189.3" style="enable-background:new 0 0 204.5 189.3;" xml:space="preserve">
<style type="text/css">
	.st0{fill:#022169;}
	.st1{fill:#010202;}
</style>
<g>
	<g>
		<g>
			<g>
				<g>
					<polygon class="st0" points="204.5,39.6 195.7,42.4 193,51.2 190.5,42.4 181.4,39.6 190.5,37.2 193,28.1 195.7,37.2 					"/>
				</g>
			</g>
		</g>
	</g>
</g>
<g>
	<g>
		<g>
			<g>
				<g>
					<polygon class="st0" points="167.3,31.5 158.6,34.3 155.8,43 153.4,34.3 144.3,31.5 153.4,29.1 155.8,20 158.6,29.1 					"/>
				</g>
			</g>
		</g>
	</g>
</g>
<g>
	<g>
		<g>
			<g>
				<g>
					<polygon class="st0" points="189.5,11.5 180.7,14.3 178,23 175.5,14.3 166.4,11.5 175.5,9.1 178,0 180.7,9.1 					"/>
				</g>
			</g>
		</g>
	</g>
</g>
<g>
	<g>
		<g>
			<g>
				<g>
					<path class="st0" d="M153.2,70.7C153.2,70.9,153.2,70.9,153.2,70.7L153.2,70.7z"/>
				</g>
			</g>
			<g>
				<g>
					<path class="st0" d="M175,81.4c2.3-9.1,4.5-17.8,7.1-28.1c0.8-2.4-0.3-4.8-2.6-5.7l-16-4.2c-1.3-0.4-2.2-0.1-3,0.2l-0.4,0.1
						l-0.1,0c-1,0.5-1.7,1.6-2.2,2.4l-0.1,0.2v0.3c-0.1,0.8-1.7,6.6-2.4,9.5l-0.1,0.3c-1,3.9-1.7,6.7-2.3,8.8l-12-33.9l-0.3-0.1
						l0.2-0.1L131,3.2c-0.4-1.1-1.3-2-2.3-2.5c-1.1-0.6-2.4-0.6-3.4-0.2L2.9,43.1c-1.1,0.4-2,1.3-2.5,2.3c-0.5,1.1-0.6,2.3-0.2,3.4
						L46,180.5c0.5,1.8,2.2,3.2,4.1,3.2c0.3,0,1,0,1.6-0.5l78.4-27.4c-2,8-3.4,13.3-4.3,16.9l-0.1,0.4c-2,7.7-2.1,8-1.3,9.7
						c0.6,1.2,2,1.9,2.4,2.2l16.3,4.3c0.3,0.1,0.6,0.1,0.9,0.1c0.8,0,1.6-0.2,2.4-0.6c1.1-0.6,1.8-1.6,2-2.6l10.1-40l15.3-5.4
						c1.1-0.4,2-1.3,2.5-2.3c0.5-1.1,0.6-2.4,0.2-3.4l-8.7-25.3c2.5-9.6,4.5-17.8,6.5-25.8L175,81.4z M52.8,173.2l-42.7-123
						l114.1-39.8L149,81.5l-1.9,7.6c-0.1,0-0.1,0-0.2,0c0,0,0,0,0,0c-0.6-0.1-1.2,0-1.9,0.2l-11.5,3.8c-0.9,0.3-1.7,0.9-2.1,1.7
						c-0.4,0.7-0.4,1.7,0,2.8l3.9,10.7c0.5,1.4,2,2.3,3.3,2.3c0.4,0,0.8-0.1,1.1-0.2l2.3-0.8l-4,15.7l-9.4-27.1l0,0l-4.4-12.5
						c-0.4-1.1-1.3-2-2.3-2.5c-1.1-0.5-2.4-0.6-3.4-0.2l-58.8,20.4c-1.1,0.4-2,1.3-2.5,2.3c-0.3,0.6-0.5,1.3-0.5,1.9
						c0,0.5,0.1,1,0.3,1.5l16.6,47.3c0.4,1.1,1.3,2,2.3,2.4c1.1,0.5,2.3,0.6,3.4,0.2l55.2-19.2l-1.4,5.4L52.8,173.2z M140.1,102.8
						l-1.4-4.1l5-1.7l0.5,1.5l0.9,2.6l-3.6,1.3L140.1,102.8z M109,123.2l-16.8,5.9c-3,1-5.5,3.2-6.8,6.1c-0.5,1.1-0.8,2.2-1,3.3
						c-0.3,1.9,0,3.8,0.6,5.5l1,3.3l-5.8,2l-13.5-38.8l50.3-17.6l13.5,38.8l-5.7,2l-1-3.3C121.9,124.4,115,121.2,109,123.2z
						 M116.8,136.6l-22.3,7.9l-1-3.3c-0.6-1.6,0.1-3.1,1.7-3.7c8-2.7,12.4-4.3,14.7-5.1l0.4-0.1c2.3-0.9,2.4-0.9,2.8-0.9
						c1.2,0,2.4,0.8,2.7,1.9L116.8,136.6z M161.6,135.5l2.5-10.1l2.9,8.1L161.6,135.5z M167.8,75.3c-0.3,1.2-0.6,2.3-0.9,3.5
						c-10.4,40.1-16.1,62.9-22.2,87l-3.5,13.7l-7.4-1.9l7-27.5l3.9-15.1c0.1-0.3,0.2-0.7,0.3-1.1l7.1-27.7l1.1-4.5l7.4-29l7.4,1.9
						L167.8,75.3z M169.9,65.7l-7.4-1.9l2.8-10.7l7.4,1.9L169.9,65.7z"/>
				</g>
			</g>
		</g>
		<g>
			<g>
				<g>
					<path class="st1" d="M153.2,70.7C153.2,70.9,153.2,70.9,153.2,70.7L153.2,70.7z M153.2,70.7C153.2,70.9,153.2,70.9,153.2,70.7
						L153.2,70.7z M153.2,70.7C153.2,70.9,153.2,70.9,153.2,70.7L153.2,70.7z"/>
				</g>
			</g>
		</g>
		<g>
			<g>
				<g>
					<path class="st0" d="M153.2,70.7L153.2,70.7C153.2,70.9,153.2,70.9,153.2,70.7z"/>
				</g>
			</g>
		</g>
	</g>
</g>
<g>
	<g>
		<g>
			<g>
				<g>
					<g>
						<g>
							<path class="st0" d="M119.1,74.8l-12.6-36.1l-0.2-0.7l-3.5-10l-0.2-0.5c-0.3-0.8-1-1.5-1.8-1.9c-0.9-0.4-1.8-0.5-2.6-0.1
								L90.8,28L39.3,45.8c-1.8,0.7-2.7,2.6-2.1,4.5l14.7,42l1.8,5.2v0c0.6,1.4,2,2.3,3.4,2.3c0.4,0,0.8-0.1,1.1-0.2l0.3-0.1
								c0.5-0.2,9.5-3.3,20.7-7.1c12.9-4.5,28.8-9.9,37.8-13.1c0.9-0.3,1.6-0.9,2-1.7c0,0,0,0,0,0C119.5,76.8,119.5,75.8,119.1,74.8
								z M73.2,87l-1.3-4.3c-0.8-2.1,0.2-4.1,2.4-4.9c8.5-2.9,12.8-4.4,15.1-5.3c2.4-0.9,2.6-0.9,3.1-0.9c1.6,0,3.2,1.1,3.7,2.6
								l1.3,4.3L73.2,87z M104.6,75.1l-1-3.3c-1-3-3.2-5.5-6.1-6.8c-2.9-1.4-6-1.5-8.9-0.3l-16.8,5.9c-3,1-5.5,3.2-6.8,6.1
								c-0.5,1.2-0.9,2.4-1,3.6c-0.2,1.8,0,3.6,0.7,5.2l1,3.3l-5.8,2L46.4,51.9l50.3-17.6l13.5,38.8L104.6,75.1z"/>
						</g>
					</g>
				</g>
			</g>
		</g>
	</g>
</g>
<g>
	<g>
		<g>
			<g>
				<path class="st0" d="M128,30.2l-3.8-10.5c-0.1-0.9-0.6-1.6-1.4-2c-0.8-0.5-1.9-0.5-2.8-0.1l-11.6,3.9c-0.8,0.3-1.5,1-1.9,1.8
					c-0.4,0.9-0.4,1.8-0.1,2.6l3.6,10.6l0,0c0.3,0.8,1,1.5,1.8,1.9c0.5,0.2,1,0.3,1.5,0.3c0.4,0,0.8-0.1,1.1-0.2l11.5-3.8
					c0.9-0.3,1.7-0.9,2.1-1.7C128.3,32.2,128.3,31.2,128,30.2z M115.4,30.9l-1.4-4.1l5-1.7l0.5,1.5l0.9,2.6l-3.6,1.3L115.4,30.9z"/>
			</g>
		</g>
	</g>
</g>
<g>
	<g>
		<g>
			<g>
				<path class="st0" d="M136.6,54.1l-3.8-10.6c-0.3-0.9-0.9-1.6-1.7-2.1c-0.7-0.3-1.7-0.4-2.8,0l-11.5,3.9c-1.8,0.7-2.7,2.8-2,4.5
					l3.8,10.6c0.3,0.8,1,1.5,1.8,1.9c0.5,0.2,1,0.3,1.5,0.3c0.4,0,0.8-0.1,1.1-0.2l11.5-3.8C136.3,57.9,137.2,55.8,136.6,54.1z
					 M123.7,54.8l-1.4-4.1l5-1.8l0.5,1.5l0.9,2.6l-3.6,1.3L123.7,54.8z"/>
			</g>
		</g>
	</g>
</g>
<g>
	<g>
		<g>
			<g>
				<path class="st0" d="M145.1,78.3c-1.4-3.7-2.2-6.2-2.8-8.1c-1-3.1-1.3-4-2.8-4.6c-0.7-0.3-1.7-0.4-2.7,0l-11.5,3.8
					c-0.9,0.3-1.7,0.9-2.1,1.7c-0.4,0.7-0.4,1.7,0,2.8l3.9,10.7c0.6,1.4,2,2.3,3.3,2.3c0.4,0,0.8-0.1,1.1-0.2l11.5-3.9
					c0.8-0.3,1.5-1,1.9-1.9C145.4,80.1,145.5,79.2,145.1,78.3z M132,79l-1.4-4.1l5-1.7l0.5,1.5l0.9,2.6l-3.6,1.3L132,79z"/>
			</g>
		</g>
	</g>
</g>
<g>
	<g>
		<g>
			<g>
				<g>
					<path class="st0" d="M37.6,65.3L34.1,55c-0.3-0.8-1-1.5-1.8-1.9c-0.9-0.4-1.8-0.5-2.6-0.1l-10.9,3.8c-0.9,0.3-1.7,0.9-2.1,1.7
						c-0.4,0.7-0.4,1.7,0,2.8l3.6,10.4c0.5,1.4,2,2.3,3.3,2.3c0.4,0,0.8-0.1,1.1-0.2l10.9-3.8c0.9-0.3,1.6-0.9,2-1.8
						C37.9,67.2,38,66.2,37.6,65.3z M25.6,66.1l-1.4-3.8l4.7-1.5l0.5,1.3l1,2.5l-3.5,1.1L25.6,66.1z"/>
				</g>
			</g>
		</g>
	</g>
</g>
<g>
	<g>
		<g>
			<g>
				<path class="st0" d="M45.9,88.7l-3.5-10.3c-0.3-0.9-0.9-1.7-1.7-2.1c-0.7-0.4-1.7-0.4-2.8,0l-10.9,3.9c-0.8,0.3-1.5,1-1.9,1.8
					c-0.4,0.9-0.5,1.8-0.1,2.6l3.6,10.4c0.3,0.8,1,1.5,1.8,1.9c0.5,0.2,1,0.4,1.5,0.4c0.4,0,0.8-0.1,1.1-0.2l11-3.8
					c0.8-0.3,1.5-1,1.9-1.8C46.2,90.4,46.2,89.5,45.9,88.7z M33.6,89.1l-1.4-3.8l4.6-1.5l0.5,1.3l0.9,2.5l-3.4,1.1L33.6,89.1z"/>
			</g>
		</g>
	</g>
</g>
<g>
	<g>
		<g>
			<g>
				<g>
					<g>
						<path class="st0" d="M53.9,112l-3.5-10.3c-0.3-0.9-0.9-1.7-1.7-2.1c-0.7-0.4-1.7-0.4-2.8,0l-10.9,3.8c-0.8,0.3-1.5,1-1.9,1.8
							c-0.4,0.9-0.5,1.8-0.1,2.6l3.6,10.4c0.3,0.8,1,1.5,1.8,1.9c0.5,0.2,1,0.4,1.5,0.4c0.4,0,0.8-0.1,1.1-0.2l10.9-3.9
							c0.8-0.3,1.5-1,1.9-1.8C54.1,113.8,54.2,112.8,53.9,112z M41.9,112.4l-1.4-3.8l4.6-1.5l0.5,1.3l1,2.5l-3.5,1.1L41.9,112.4z"/>
					</g>
				</g>
			</g>
		</g>
	</g>
</g>
<g>
	<g>
		<g>
			<g>
				<g>
					<path class="st0" d="M62.1,135.3L58.6,125c-0.3-0.8-1-1.5-1.8-1.9c-0.9-0.4-1.8-0.5-2.6-0.1l-11.2,3.8
						c-0.9,0.3-1.7,0.9-2.1,1.7c-0.4,0.7-0.4,1.7,0,2.8l3.5,10.4c0.6,1.4,2,2.3,3.3,2.3c0.4,0,0.8-0.1,1.1-0.2l11-3.9
						C61.9,138.8,62.8,137,62.1,135.3z M49.8,135.8l-1.4-3.8l4.7-1.5l0.5,1.3l0.9,2.5l-3.5,1.1L49.8,135.8z"/>
				</g>
			</g>
		</g>
	</g>
</g>
<g>
	<g>
		<g>
			<g>
				<g>
					<path class="st0" d="M70.1,158.7l-3.5-10.3c-0.3-0.9-0.9-1.7-1.7-2.1c-0.7-0.4-1.7-0.4-2.8,0l-10.9,3.8
						c-1.8,0.7-2.7,2.8-2.1,4.5l3.5,10.4c0.3,0.8,1,1.5,1.8,1.9c0.5,0.2,1,0.3,1.5,0.3c0.4,0,0.8-0.1,1.1-0.2l10.9-3.9
						C69.8,162.4,70.8,160.3,70.1,158.7z M58.1,159.1l-1.4-3.8l4.7-1.5l0.5,1.3l1,2.5l-3.5,1.1L58.1,159.1z"/>
				</g>
			</g>
		</g>
	</g>
</g>
<g>
	<g>
		<g>
			<g>
				<path class="st0" d="M106.3,110.5L106.3,110.5c-1.5-4.1-5.1-6.8-9.4-7c-4.3-0.2-8.3,2.1-10.2,5.9c-1.6,3.2-1.5,7,0.5,10.1
					c1.9,3.1,5.3,5,9.1,5c3.4,0,6.7-1.7,8.7-4.5C106.9,117.2,107.4,113.8,106.3,110.5z M96.3,110.9c0.8,0,2.3,0.3,2.9,2.2
					c0.2,0.4,0.2,0.8,0.2,1.2c0,0.6-0.2,1.2-0.6,1.7c-0.8,1-2.2,1.5-3.4,1.3c-1.1-0.2-1.9-0.9-2.3-2.1c-0.3-0.9-0.3-1.8,0.1-2.5
					c0.4-0.7,1-1.2,1.8-1.5C95.5,110.9,95.9,110.9,96.3,110.9z"/>
			</g>
		</g>
	</g>
</g>
<g>
	<g>
		<g>
			<g>
				<path class="st0" d="M86.2,52.5L86.2,52.5c-1.5-4.1-5.1-6.8-9.4-7c-4.3-0.2-8.3,2.1-10.2,5.9c-1.6,3.2-1.4,7,0.5,10.1
					c2,3.1,5.3,5,9.1,5c3.4,0,6.7-1.7,8.7-4.5C86.8,59.2,87.3,55.8,86.2,52.5z M76.3,52.9c0.8,0,2.3,0.3,2.9,2.2
					c0.1,0.4,0.2,0.8,0.2,1.2c0,0.6-0.2,1.2-0.6,1.7c-0.8,1-2.2,1.5-3.4,1.3c-1.1-0.2-1.9-0.9-2.3-2.1c-0.3-0.9-0.3-1.8,0.1-2.5
					c0.4-0.7,1-1.2,1.8-1.5C75.4,53,75.8,52.9,76.3,52.9z"/>
			</g>
		</g>
	</g>
</g>
</svg>
