<?xml version="1.0" encoding="utf-8"?>
<!-- Generator: Adobe Illustrator 21.0.0, SVG Export Plug-In . SVG Version: 6.00 Build 0)  -->
<svg version="1.1" id="Слой_1" xmlns="http://www.w3.org/2000/svg" xmlns:xlink="http://www.w3.org/1999/xlink" x="0px" y="0px"
	 viewBox="0 0 114.7 147.4" style="enable-background:new 0 0 114.7 147.4;" xml:space="preserve">
<style type="text/css">
	.st0{fill:#022169;}
</style>
<g>
	<g>
		<path class="st0" d="M111.1,0H3.6C1.6,0,0,1.6,0,3.6l0,130c0,7.6,6.1,13.8,13.6,13.8h97.5c2,0,3.6-1.6,3.6-3.6s-1.6-3.6-3.6-3.6
			H13.6c-3.5,0-6.4-2.9-6.4-6.4c0-3.5,2.9-6.4,6.4-6.4h97.5c2,0,3.6-1.6,3.6-3.7V3.6C114.7,1.6,113.1,0,111.1,0z M24.7,7.2h15.7
			v19.3l-5.4-4.9c-1.4-1.2-3.4-1.2-4.8,0l-2,1.8l-3.5,3.1V7.2z M107.5,120.2H13.6c-2.3,0-4.5,0.6-6.4,1.6V7.2h10.3v27.3
			c0,1.5,0.9,2.8,2.3,3.3c1.4,0.6,2.9,0.2,3.9-0.9l8.8-7.9l9,8.1c1.1,0.9,2.5,1.2,3.8,0.6c1.3-0.6,2.2-1.8,2.2-3.3V7.2h60V120.2z"/>
	</g>
	<g>
		<path class="st0" d="M74.7,51.8c0,2-1.6,3.6-3.6,3.6H23.6c-2,0-3.6-1.6-3.6-3.6c0-2,1.6-3.6,3.6-3.6h47.5
			C73.1,48.3,74.7,49.9,74.7,51.8z"/>
	</g>
	<g>
		<path class="st0" d="M94.7,69.3c0,2-1.6,3.6-3.6,3.6H23.6c-2,0-3.6-1.6-3.6-3.6c0-2,1.6-3.6,3.6-3.6h67.5
			C93.1,65.8,94.7,67.4,94.7,69.3z"/>
	</g>
	<g>
		<path class="st0" d="M94.7,86.8c0,2-1.6,3.6-3.6,3.6H23.6c-2,0-3.6-1.6-3.6-3.6c0-2,1.6-3.6,3.6-3.6h67.5
			C93.1,83.3,94.7,84.9,94.7,86.8z"/>
	</g>
	<g>
		<path class="st0" d="M94.7,104.3c0,2-1.6,3.6-3.6,3.6H23.6c-2,0-3.6-1.6-3.6-3.6c0-2,1.6-3.6,3.6-3.6h67.5
			C93.1,100.8,94.7,102.4,94.7,104.3z"/>
	</g>
</g>
</svg>
