<?xml version="1.0" encoding="utf-8"?>
<!-- Generator: Adobe Illustrator 22.0.1, SVG Export Plug-In . SVG Version: 6.00 Build 0)  -->
<svg version="1.1" id="Слой_1" xmlns="http://www.w3.org/2000/svg" xmlns:xlink="http://www.w3.org/1999/xlink" x="0px" y="0px"
	 viewBox="0 0 496 496" style="enable-background:new 0 0 496 496;" xml:space="preserve">
<style type="text/css">
	.st0{fill:#F0A5A9;}
	.st1{fill:#F5F7FA;}
	.st2{fill:#FF958A;}
	.st3{fill:#55433E;}
</style>
<g>
	<path class="st0" d="M488,248c0,132.5-107.5,240-240,240S8,380.5,8,248S115.5,8,248,8S488,115.5,488,248z"/>
	<path class="st1" d="M248,448v40c-10.9,0-21.5-0.7-32-2.2V448H248z"/>
	<path class="st2" d="M224,361.8c2.5-1.2,5.2-1.8,8-1.8c5.1,0,10,2,13.7,5.7L296,416H168l50.3-50.3C220,364,221.9,362.7,224,361.8z"
		/>
	<path class="st0" d="M296,416v67.2c-15.5,3.1-31.5,4.8-48,4.8v-40h-32v37.8c-16.9-2.2-33.2-6.2-48.7-11.8V474l0.7-2v-56H296z"/>
	<path class="st2" d="M192,344H64l50.3-50.3c3.7-3.7,8.6-5.7,13.7-5.7s10,2,13.7,5.7L192,344z"/>
	<path class="st1" d="M64,344h128v48l-24,24v56l-0.7,2c-41.1-14.6-77-40.2-104.2-73.1l1-0.9V344z"/>
	<path class="st2" d="M372.4,296.9L384,320H272v-32h86.1C364.2,288,369.7,291.4,372.4,296.9z"/>
	<path class="st1" d="M272,320h128v112l0.9,1c-29.8,24.6-65.6,42.2-104.9,50.2V416l-24-24V320z"/>
	<path class="st1" d="M272,320v72l-26.3-26.3c-3.7-3.7-8.6-5.7-13.7-5.7c-2.8,0-5.5,0.6-8,1.8V256h48V320z"/>
	<path class="st2" d="M248,96v112h128V96H248z M88,256V48h320v208H88z M216,128V80h-96v48H216z"/>
	<path class="st1" d="M120,80h96v48h-96V80z"/>
	<path class="st1" d="M248,96h128v112H248V96z"/>
	<g>
		<path class="st3" d="M240,216h144V88H240V216z M256,104h112v96H256V104z"/>
		<path class="st3" d="M304,144h16v16h-16V144z"/>
		<path class="st3" d="M336,144h16v16h-16V144z"/>
		<path class="st3" d="M272,144h16v16h-16V144z"/>
		<path class="st3" d="M112,136h112V72H112V136z M128,88h80v32h-80V88z"/>
		<path class="st3" d="M112,152h112v16H112V152z"/>
		<path class="st3" d="M112,216h112v16H112V216z"/>
		<path class="st3" d="M176,184h48v16h-48V184z"/>
		<path class="st3" d="M112,184h48v16h-48V184z"/>
		<path class="st3" d="M296,344h16v16h-16V344z"/>
		<path class="st3" d="M328,344h16v16h-16V344z"/>
		<path class="st3" d="M360,344h16v16h-16V344z"/>
		<path class="st3" d="M88,368h16v16H88V368z"/>
		<path class="st3" d="M120,368h16v16h-16V368z"/>
		<path class="st3" d="M152,368h16v16h-16V368z"/>
		<path class="st3" d="M296,376h16v16h-16V376z"/>
		<path class="st3" d="M328,376h16v16h-16V376z"/>
		<path class="st3" d="M360,376h16v16h-16V376z"/>
		<path class="st3" d="M328,408h16v16h-16V408z"/>
		<path class="st3" d="M360,408h16v16h-16V408z"/>
		<path class="st3" d="M416.6,66.1l-0.6,0.7V40h-80V16h16V0h-48v16h16v24h-64V16h16V0h-48v16h16v24h-64V16h16V0h-48v16h16v24H80
			v25.7C29.1,112.6,0,178.8,0,248c0,136.8,111.3,248,248,248s248-111.2,248-248C496,179.2,467.1,112.9,416.6,66.1z M96,56h304v192
			H96V56z M392,429.7c-25.5,20.3-55.4,35.3-88,43.4v-60.4l-24-24V328h112V429.7z M240,479.8c-5.4-0.2-10.7-0.5-16-1V456h16V479.8z
			 M208,440v36.5c-10.9-1.9-21.6-4.6-32-8V424h112v52.5c-10.4,1.8-21.1,3-32,3.3V440H208z M224,371.3c4.3-4.3,11.7-4.3,16,0
			l36.7,36.7h-89.4L224,371.3z M280,312v-16h78.1c3,0,5.8,1.7,7.2,4.4l5.8,11.6H280z M264,372.7L251.3,360
			c-5.2-5.2-12.2-7.7-19.3-7.7V264h32V372.7z M80,88.1V264h136v93.3c-1.2,0.8-2.3,1.7-3.3,2.7L200,372.7v-32L147.3,288
			c-10.3-10.3-28.3-10.3-38.6,0L56,340.7v37.4C30.8,341,16,296.2,16,248C16,188.3,39.2,131.1,80,88.1z M172.7,336H83.3l36.7-36.7
			c4.3-4.3,11.7-4.3,16,0L172.7,336z M72,398.9V352h112v36.7l-24,24v49.9C125.8,448.5,95.7,426.5,72,398.9z M408,415.8V312h-19.1
			l-9.4-18.7c-4.1-8.2-12.3-13.3-21.5-13.3H280v-16h136V88.1c40.8,42.9,64,100.4,64,159.9C480,313.9,452.3,373.5,408,415.8z"/>
	</g>
</g>
</svg>
