<?xml version="1.0" encoding="utf-8"?>
<!-- Generator: Adobe Illustrator 22.0.1, SVG Export Plug-In . SVG Version: 6.00 Build 0)  -->
<svg version="1.1" id="Слой_1" xmlns="http://www.w3.org/2000/svg" xmlns:xlink="http://www.w3.org/1999/xlink" x="0px" y="0px"
	 viewBox="0 0 159.8 92.3" style="enable-background:new 0 0 159.8 92.3;" xml:space="preserve">
<style type="text/css">
	.st0{fill:#F7C1C5;}
</style>
<path class="st0" d="M159.8,10.6v52.8c0,5.9-4.8,10.6-10.6,10.6H92.3L79.9,92.3L67.5,74H10.6C4.8,74,0,69.2,0,63.4V10.6
	C0,4.8,4.8,0,10.6,0h138.5C155,0,159.8,4.8,159.8,10.6z"/>
</svg>
