<?xml version="1.0" encoding="utf-8"?>
<!-- Generator: Adobe Illustrator 22.0.1, SVG Export Plug-In . SVG Version: 6.00 Build 0)  -->
<svg version="1.1" id="Слой_1" xmlns="http://www.w3.org/2000/svg" xmlns:xlink="http://www.w3.org/1999/xlink" x="0px" y="0px"
	 viewBox="0 0 496 496" style="enable-background:new 0 0 496 496;" xml:space="preserve">
<style type="text/css">
	.st0{fill:#F0A5A9;}
	.st1{fill:#FFFFFF;}
	.st2{fill:#F5F7FA;}
	.st3{fill:#FF958A;}
	.st4{fill:#55433E;}
</style>
<g>
	<path class="st0" d="M488,248c0,132.5-107.5,240-240,240S8,380.5,8,248S115.5,8,248,8S488,115.5,488,248z"/>
	<path class="st1" d="M352,80h32v112h-32V80z"/>
	<path class="st2" d="M184,416h-56c-13.3,0-24-10.7-24-24v-40h288v40c0,13.3-10.7,24-24,24h-56v40H184V416z"/>
	<path class="st2" d="M136,328h104v-72h21.4l3-15.4c6.3-1.6,12.2-4.1,17.6-7.3l13.1,8.7l0.9-0.9V256h64v-32h-46.9l0.9-0.9l-8.7-13.1
		c3.2-5.4,5.7-11.3,7.3-17.6l2-0.4H384c4.4,0,8,3.6,8,8v152H104V200c0-4.4,3.6-8,8-8h69.4l2,0.4c1.6,6.3,4.1,12.2,7.3,17.6
		l-8.7,13.1l0.9,0.9H136V328z M360,320v-32h-64v32H360z"/>
	<path class="st3" d="M296,288h64v32h-64V288z"/>
	<path class="st3" d="M360,224v32h-64v-14.9l17.1-17.1H360z"/>
	<path class="st3" d="M240,328H136V224h46.9l18,18l13.1-8.7c5.4,3.2,11.3,5.7,17.6,7.3l3,15.4h5.4V328z M168,304l40-24l-40-24V304z"
		/>
	<path class="st2" d="M208,280l-40,24v-48L208,280z"/>
	<path class="st2" d="M182.9,224l-0.9-0.9l8.7-13.1c-3.2-5.4-5.7-11.3-7.3-17.6l-2-0.4l-13.4-2.6v-26.7l15.4-3
		c1.6-6.3,4.1-12.2,7.3-17.6l-8.7-13.1l18.9-18.9l13.1,8.7c0.6-0.4,1.4-0.8,2-1c4.8-2.7,10.1-4.8,15.6-6.2l3-15.4h26.7l3,15.4
		c5.5,1.4,10.8,3.5,15.6,6.2c0.6,0.2,1.4,0.6,2,1l13.1-8.7l18.9,18.9l-8.7,13.1c3.2,5.4,5.7,11.3,7.3,17.6l15.4,3v26.7l-13.4,2.6
		l-2,0.4c-1.6,6.3-4.1,12.2-7.3,17.6l8.7,13.1L295.1,242l-13.1-8.7c-5.4,3.2-11.3,5.7-17.6,7.3l-3,15.4h-26.7l-3-15.4
		c-6.3-1.6-12.2-4.1-17.6-7.3l-13.1,8.7L182.9,224z M280,176c0-17.7-14.3-32-32-32s-32,14.3-32,32s14.3,32,32,32S280,193.7,280,176z
		"/>
	<path class="st1" d="M312,16.6v110.2L295.1,110l-13.1,8.7c-0.6-0.4-1.4-0.8-2-1V8h32V16.6z"/>
	<path class="st1" d="M200.9,110L184,126.9V8h32v109.7c-0.6,0.2-1.4,0.6-2,1L200.9,110z"/>
	<path class="st1" d="M112,80h32v112h-32V80z"/>
	<g>
		<path class="st4" d="M248,136c-22.1,0-40,17.9-40,40s17.9,40,40,40s40-17.9,40-40S270.1,136,248,136z M248,200
			c-13.2,0-24-10.8-24-24s10.8-24,24-24s24,10.8,24,24S261.2,200,248,200z"/>
		<path class="st4" d="M352,376h16v16h-16V376z"/>
		<path class="st4" d="M320,376h16v16h-16V376z"/>
		<path class="st4" d="M288,376h16v16h-16V376z"/>
		<path class="st4" d="M160,241.9v76.3l63.6-38.1L160,241.9z M176,270.1l16.4,9.9l-16.4,9.9V270.1z"/>
		<path class="st4" d="M288,328h80v-48h-80V328z M304,296h48v16h-48V296z"/>
		<path class="st4" d="M320,10.8V0h-48v1.3c-15.9-1.5-32.1-1.5-48,0V0h-48v10.8C72.1,42.3,0,138.9,0,248c0,136.7,111.3,248,248,248
			s248-111.3,248-248C496,138.9,423.9,42.3,320,10.8z M256,408v16h48v24H192v-24h48v-16H128c-8.8,0-16-7.2-16-16v-32h272v32
			c0,8.8-7.2,16-16,16H256z M136,184h-16V88h16V184z M376,184h-16V88h16V184z M384,200v144H112V200h65.4c1.1,3.3,2.4,6.5,4,9.6
			l-4.2,6.4H128v120h120v-72h19.9l3.4-17.1c3.5-1.2,7-2.6,10.3-4.3l6.4,4.2V264h80v-48h-49.2l-4.2-6.4c1.6-3.1,2.9-6.3,4-9.6H384z
			 M179.6,232l20.3,20.3l14.5-9.7c3.3,1.7,6.8,3.1,10.3,4.3l3.4,17.1h3.9v56h-88v-88H179.6z M316.4,232H352v16h-48v-3.6L316.4,232z
			 M320,182.8l-6.1,1.2H312v0.4l-6,1.2l-1.2,4.9c-1.4,5.5-3.5,10.7-6.4,15.5l-2.6,4.3l7.9,11.9l-9.6,9.6l-11.9-7.9l-4.3,2.6
			c-4.8,2.9-10,5-15.5,6.4l-4.9,1.2l-2.8,14h-13.5l-2.8-14l-4.9-1.2c-5.5-1.4-10.7-3.5-15.5-6.4l-4.3-2.6l-11.9,7.9l-9.6-9.6
			l7.9-11.9l-2.6-4.3c-2.9-4.8-5-10-6.4-15.5l-1.2-4.9l-6-1.2V184h-1.9l-6.1-1.2v-13.5l14-2.8l1.2-4.9c1.4-5.5,3.5-10.7,6.4-15.5
			l2.6-4.3l-7.9-11.9l9.6-9.6l11.9,7.9l4.3-2.6c4.8-2.9,10-5,15.5-6.4l4.9-1.2l2.8-14h13.5l2.8,14l4.9,1.2
			c5.5,1.4,10.7,3.5,15.5,6.4l4.3,2.6l11.9-7.9l9.6,9.6l-7.9,11.9l2.6,4.3c2.9,4.8,5,10,6.4,15.5l1.2,4.9l14,2.8V182.8z M304,16
			v91.6l-7.8-7.8l-8.2,5.4V16H304z M272,17.4v88.1c-0.2-0.1-0.4-0.2-0.7-0.3L267.9,88h-39.8l-3.4,17.1c-0.2,0.1-0.4,0.2-0.7,0.3
			V17.4C239.9,15.7,256.1,15.7,272,17.4z M208,16v89.2l-8.2-5.4l-7.8,7.8V16H208z M16,248C16,147.5,81.3,58.5,176,27.6v95.9
			l-4.3,4.3l9.7,14.5c-1.7,3.3-3.1,6.8-4.3,10.3l-17.1,3.4V184h-8V72h-48v114.2c-4.8,2.8-8,7.9-8,13.8v192c0,17.6,14.4,32,32,32h48
			v24h-45.4C62.1,407.6,16,333.1,16,248z M163.5,464h169c-26.2,10.3-54.7,16-84.5,16S189.7,474.3,163.5,464z M365.4,448H320v-24h48
			c17.6,0,32-14.4,32-32V200c0-5.9-3.2-11-8-13.8V72h-48v112h-8v-27.9l-17.1-3.4c-1.2-3.5-2.6-7-4.3-10.3l9.7-14.5l-4.3-4.3V27.6
			C414.7,58.5,480,147.5,480,248C480,333.1,433.9,407.6,365.4,448z"/>
	</g>
</g>
</svg>
