<?xml version="1.0" encoding="utf-8"?>
<!-- Generator: Adobe Illustrator 22.0.1, SVG Export Plug-In . SVG Version: 6.00 Build 0)  -->
<svg version="1.1" id="Capa_1" xmlns="http://www.w3.org/2000/svg" xmlns:xlink="http://www.w3.org/1999/xlink" x="0px" y="0px"
	 viewBox="0 0 512 509" style="enable-background:new 0 0 512 509;" xml:space="preserve">
<style type="text/css">
	.st0{fill:#55433E;}
</style>
<g>
	<g>
		<g>
			<g>
				<circle class="st0" cx="10.1" cy="499" r="10.1"/>
			</g>
		</g>
	</g>
	<g>
		<g>
			<g>
				<circle class="st0" cx="267" cy="243.8" r="10"/>
			</g>
		</g>
	</g>
	<g>
		<g>
			<g>
				<path class="st0" d="M398.5,116.5c-8.1-8.1-18.8-12.5-30.2-12.5s-22.1,4.4-30.2,12.5c-16.7,16.7-16.7,43.8,0,60.4
					c8.3,8.3,19.3,12.5,30.2,12.5c10.9,0,21.9-4.2,30.2-12.5C415.1,160.3,415.1,133.2,398.5,116.5z M384.3,162.8
					c-8.8,8.8-23.2,8.8-32,0c-8.8-8.8-8.8-23.2,0-32c4.3-4.3,10-6.6,16-6.6s11.7,2.4,16,6.6C393.1,139.6,393.1,153.9,384.3,162.8z"
					/>
			</g>
		</g>
	</g>
	<g>
		<g>
			<g>
				<path class="st0" d="M125.4,410c-5-2.5-11-0.5-13.5,4.5l-12,24c-5.2,10.4-15.7,17.4-27.3,18.2l-13.9,1c-2.4,0.2-3.9-1-4.6-1.7
					s-1.9-2.3-1.7-4.6l1-13.9c0.8-11.6,7.8-22.1,18.2-27.3l24-12c5-2.5,7-8.5,4.5-13.5c-2.5-5-8.5-7-13.5-4.5l-24,12
					c-16.8,8.4-28,25.2-29.3,43.9l-1,13.9c-0.5,7.5,2.2,14.9,7.6,20.2c4.9,4.9,11.5,7.6,18.4,7.6c0.6,0,1.2,0,1.8-0.1l13.9-1
					c18.7-1.3,35.5-12.5,43.9-29.3l12-24C132.4,418.5,130.4,412.4,125.4,410z"/>
			</g>
		</g>
	</g>
	<g>
		<g>
			<g>
				<path class="st0" d="M505.1,6.7C500.4,2,493.9-0.4,487.3,0l-9.3,0.6c-83.8,5.4-162.3,45.8-215.2,111l-22,27.1l-57.6-1.7
					c-0.1,0-0.2,0-0.3,0c-45.7,0-88.6,17.8-120.9,50.1l-59,59c-2.8,2.8-3.7,7-2.3,10.7c1.4,3.7,4.9,6.2,8.9,6.4l124.8,6.4l-5.1,6.3
					c-2.6,3.2-3,7.6-1,11.1c2,3.6,4,7.1,6.1,10.6l-29.6,35.1c-2.5,3-3.1,7.2-1.4,10.8c6.5,13.7,15.1,25.9,25.5,36.5
					c10.7,10.8,23.3,19.6,37.2,26.3c1.4,0.6,2.8,1,4.3,1c2.3,0,4.5-0.8,6.3-2.2c6.4-5.2,13.7-11.3,20.8-17.2
					c5.1-4.2,10.3-8.6,15.1-12.5c2.9,1.7,5.8,3.4,8.8,5c1.5,0.8,3.2,1.2,4.8,1.2c2.2,0,4.4-0.7,6.2-2.1l6.8-5.3l6.4,125.4
					c0.2,4,2.7,7.4,6.4,8.9c1.2,0.5,2.4,0.7,3.6,0.7c2.6,0,5.2-1,7.1-2.9l59-59c32.3-32.3,50.1-75.2,50.1-120.9v-55l23.3-18.1
					C464.9,199,507.4,117.4,511.7,29.3l0.2-4.9C512.3,17.8,509.8,11.3,505.1,6.7z M33.1,244.3l43-43c28.5-28.5,66.3-44.2,106.6-44.2
					l42.1,1.2l-74.7,92L33.1,244.3z M184.8,372.4c-5.2,4.4-10.6,8.9-15.6,13c-9.6-5.2-18.4-11.7-26-19.4
					c-7.4-7.4-13.7-15.9-18.7-25.3l21.7-25.7c6.6,8.8,13.7,17.1,21.5,24.9c0,0,0,0,0,0c0,0,0,0,0,0c0,0,0,0,0,0
					c8.6,8.6,17.8,16.6,27.6,23.8C191.8,366.5,188.3,369.5,184.8,372.4z M351.9,326.2c0,40.3-15.7,78.2-44.2,106.7l-43,43l-6-116.8
					l93.2-72.3L351.9,326.2L351.9,326.2z M491.7,28.3c-4,82.3-43.7,158.5-108.8,209L225.5,359.5c-13.1-7.6-25.2-16.6-36.4-26.8
					l53.1-53.1c3.9-3.9,3.9-10.3,0-14.2c-3.9-3.9-10.3-3.9-14.2,0l-53,53c-9.8-10.8-18.4-22.5-25.7-35.1l129.1-158.9
					C327.7,63.4,401,25.7,479.2,20.7l9.3-0.6c1.2-0.1,2,0.5,2.4,0.9c0.4,0.4,1,1.2,0.9,2.4L491.7,28.3z"/>
			</g>
		</g>
	</g>
</g>
</svg>
