<svg
  xmlns="http://www.w3.org/2000/svg"
  width="10px" height="26px" viewBox="0 0 10 26">

  <path d="M 9.957031 17.09375 C 9.957031 19.121094 8.644531 20.941406 6.6875 21.640625 L 5.792969 21.945312 L 5.792969 25.285156 C 5.792969 25.488281 5.707031 25.691406 5.542969 25.835938 C 5.457031 25.917969 5.25 26.039062 4.957031 26 C 4.605469 25.960938 4.355469 25.609375 4.355469 25.222656 L 4.355469 21.945312 L 3.4375 21.640625 C 2.269531 21.25 1.167969 20.472656 0.230469 19.386719 C 0.0820312 19.222656 0.0195312 19.019531 0.0625 18.8125 C 0.0820312 18.628906 0.167969 18.425781 0.417969 18.28125 C 0.519531 18.21875 0.625 18.199219 0.75 18.199219 C 0.980469 18.199219 1.207031 18.300781 1.375 18.488281 C 2.480469 19.757812 3.792969 20.472656 5.082031 20.472656 C 6.0625 20.472656 7 20.0625 7.644531 19.347656 C 8.292969 18.628906 8.605469 17.667969 8.5 16.707031 C 8.292969 15.007812 6.8125 13.714844 5.042969 13.714844 C 2.355469 13.695312 0.167969 11.546875 0.167969 8.90625 C 0.167969 6.878906 1.480469 5.058594 3.4375 4.359375 L 4.332031 4.054688 L 4.332031 0.777344 C 4.332031 0.390625 4.605469 0.0625 4.9375 0 C 5.25 -0.0390625 5.457031 0.101562 5.542969 0.183594 C 5.707031 0.328125 5.792969 0.511719 5.792969 0.714844 L 5.792969 4.054688 L 6.730469 4.359375 C 7.625 4.648438 8.480469 5.179688 9.269531 5.9375 C 9.4375 6.082031 9.5 6.285156 9.5 6.511719 C 9.5 6.632812 9.4375 6.859375 9.1875 7.042969 C 8.917969 7.246094 8.5 7.1875 8.207031 6.917969 C 7.230469 6.019531 6.144531 5.527344 5.082031 5.527344 C 4.105469 5.527344 3.167969 5.9375 2.519531 6.652344 C 1.855469 7.371094 1.542969 8.332031 1.644531 9.292969 C 1.832031 10.992188 3.3125 12.285156 5.082031 12.285156 C 7.769531 12.304688 9.957031 14.453125 9.957031 17.09375 Z M 9.957031 17.09375 "/>
</svg>
