<?xml version="1.0" encoding="utf-8"?>
<!-- Generator: Adobe Illustrator 22.1.0, SVG Export Plug-In . SVG Version: 6.00 Build 0)  -->
<svg version="1.1" id="Layer_1" xmlns="http://www.w3.org/2000/svg" xmlns:xlink="http://www.w3.org/1999/xlink" x="0px" y="0px"
	 viewBox="0 0 78.7 81.2" style="enable-background:new 0 0 78.7 81.2;" xml:space="preserve">
<style type="text/css">
	.st0{fill-rule:evenodd;clip-rule:evenodd;fill:#FEFEFE;}
	.st1{fill:#EC174A;}
	.st2{fill:#004577;}
	.st3{fill:#FFFFFF;}
</style>
<g>
	<path class="st0" d="M9.3,6.9c8.3-1.1,16.7-2,25-3.1c8.4-1,16.7-2.2,25-3.7c6.3-1.1,13.7,3.2,15.4,10.3c2.2,9.4,3.3,19,3.7,28.6
		c0.4,9.6,0.1,19.3-0.8,28.9c-0.7,7.2-7,13.1-13.5,13.1c-8.6,0-17.2,0-25.8,0.1c-8.6,0-17.2,0.1-25.8,0.1c-6.5,0-10.7-5.1-10.1-11.4
		c0.8-8.4,1-16.8,0.5-25.2c-0.5-8.4-1.6-16.7-3-24.9C-0.9,13.6,3.1,7.8,9.3,6.9L9.3,6.9z"/>
	<path class="st1" d="M55.7,76.3c1.3-11.7,2.2-23.5,1.7-35.2c-0.5-11.7-2.7-23.3-5.5-34.7c2.9-0.4,5.8-0.9,8.7-1.3
		c4.2-0.5,8.8,2.6,9.8,7.2c1.9,9,3.1,18.2,3.5,27.4c0.4,9.2,0,18.4-0.7,27.7c-0.4,4.7-4.3,8.6-8.6,8.9
		C61.6,76.2,58.7,76.2,55.7,76.3L55.7,76.3z"/>
	<path class="st2" d="M10.8,11.3c2.9-0.3,5.8-0.7,8.7-1c2.3,10.8,4.2,21.8,4.8,32.9c0.5,11.1-0.3,22.3-1.5,33.4
		c-3,0-5.9,0.1-8.9,0.1c-4.2-0.2-7.1-3.6-6.6-7.8c0.6-8.2,0.9-16.4,0.5-24.6C7.3,36.1,6.2,28,4.9,20C4.1,15.9,6.7,12.1,10.8,11.3
		L10.8,11.3z"/>
	<path class="st3" d="M22.8,76.6c1.2-11.1,2.1-22.3,1.5-33.4c-0.6-11.1-2.5-22.1-4.8-32.9C25,9.7,30.4,9.1,35.8,8.5
		c5.4-0.6,10.8-1.3,16.2-2.1c2.8,11.4,4.9,23,5.5,34.7c0.5,11.7-0.4,23.5-1.7,35.2c-5.5,0.1-11,0.1-16.4,0.2
		C33.8,76.5,28.3,76.5,22.8,76.6L22.8,76.6z"/>
</g>
</svg>
