<?xml version="1.0" encoding="utf-8"?>
<!-- Generator: Adobe Illustrator 22.1.0, SVG Export Plug-In . SVG Version: 6.00 Build 0)  -->
<svg version="1.1" id="Layer_1" xmlns="http://www.w3.org/2000/svg" xmlns:xlink="http://www.w3.org/1999/xlink" x="0px" y="0px"
	 viewBox="0 0 78.7 81.2" style="enable-background:new 0 0 78.7 81.2;" xml:space="preserve">
<style type="text/css">
	.st0{fill-rule:evenodd;clip-rule:evenodd;fill:#FEFEFE;}
	.st1{fill:#D53546;}
	.st2{fill:#00807A;}
	.st3{fill:#FFFFFF;}
</style>
<g>
	<path class="st0" d="M9.3,6.9c8.3-1.1,16.7-2,25.1-3.1c8.3-1,16.7-2.2,25-3.7c6.3-1.1,13.7,3.2,15.3,10.3c2.2,9.4,3.3,19,3.7,28.6
		c0.4,9.6,0,19.3-0.8,28.9c-0.7,7.2-7,13.1-13.4,13.1c-8.6,0-17.2,0-25.8,0.1c-8.6,0-17.2,0.1-25.7,0.1C6.3,81.2,2,76.2,2.7,69.9
		c0.8-8.4,1-16.8,0.5-25.2c-0.5-8.4-1.6-16.7-3-24.9C-0.9,13.6,3.1,7.8,9.3,6.9L9.3,6.9z"/>
	<path class="st1" d="M60.5,5.1C52.3,6.3,44,7.5,35.8,8.5c-8.3,1-16.5,1.9-24.8,2.9C6.8,12,4.1,15.8,4.9,20c1.3,8,2.5,16.1,2.9,24.3
		c0.5,8.2,0.1,16.4-0.5,24.6c-0.5,4.3,2.5,7.7,6.8,7.8c8.4-0.1,16.8-0.1,25.2-0.2c8.4-0.1,16.8-0.2,25.2-0.3
		c4.3-0.2,8.3-4.1,8.7-8.9c0.7-9.2,1.1-18.5,0.7-27.7c-0.4-9.2-1.6-18.3-3.5-27.4C69.5,7.5,64.7,4.4,60.5,5.1L60.5,5.1z"/>
	<path class="st2" d="M69.1,58.1c0.2-6,0.3-12.1,0.1-18.1c-0.3-6-0.9-12-1.7-17.9c-9.4,1.2-18.8,2.2-28.2,3
		C29.8,26,20.4,26.8,11,27.7c0.7,5.4,1.3,10.8,1.6,16.3c0.3,5.4,0.3,10.9,0.1,16.4c9.4-0.3,18.8-0.7,28.2-1
		C50.3,59,59.7,58.6,69.1,58.1L69.1,58.1z"/>
	<path class="st3" d="M38.5,42.3c0.2,5.5,3.5,10.1,7.8,10.9c-0.6,0.1-1.2,0.2-1.8,0.3c-5.2,0.3-9.4-4.6-9.6-10.9
		c-0.4-6.2,3.3-11.6,8.5-12c0.6-0.1,1.2,0,1.8,0.1C41,31.9,38.2,36.8,38.5,42.3L38.5,42.3z"/>
</g>
</svg>
