<?xml version="1.0" encoding="utf-8"?>
<!-- Generator: Adobe Illustrator 22.1.0, SVG Export Plug-In . SVG Version: 6.00 Build 0)  -->
<svg version="1.1" id="Layer_1" xmlns="http://www.w3.org/2000/svg" xmlns:xlink="http://www.w3.org/1999/xlink" x="0px" y="0px"
	 viewBox="0 0 12 22" style="enable-background:new 0 0 12 22;" xml:space="preserve">
<path d="M10.1,21.5l-9.8-9.9C0.1,11.4,0,11.1,0,10.9s0.1-0.5,0.3-0.7l9.8-9.9c0.4-0.4,1.1-0.4,1.5,0c0.3,0,0.4,0.3,0.4,0.5
	c0,0.3-0.1,0.6-0.3,0.8l-9.1,9.2l9.1,9.2c0.4,0.4,0.4,1.1,0,1.5C11.2,21.9,10.5,21.9,10.1,21.5z"/>
</svg>
