<svg width="118" height="93" viewBox="0 0 118 93" version="1.1" xmlns="http://www.w3.org/2000/svg" xmlns:xlink="http://www.w3.org/1999/xlink">
<title>Group</title>
<desc>Created using Figma</desc>
<g id="Canvas" transform="translate(-1599 -16710)">
<g id="Group">
<g id="Vector">
<use xlink:href="#path0_fill" transform="translate(1604.96 16750.6)" fill="#4A4A4A"/>
</g>
<g id="Vector">
<use xlink:href="#path1_fill" transform="translate(1599 16761)" fill="#4A4A4A"/>
</g>
<g id="Vector">
<use xlink:href="#path2_fill" transform="translate(1604.96 16710)" fill="#4A4A4A"/>
</g>
<g id="Vector">
<use xlink:href="#path3_fill" transform="translate(1653.77 16731.8)" fill="#4A4A4A"/>
</g>
<g id="Vector">
<use xlink:href="#path4_fill" transform="translate(1633.36 16719.2)" fill="#4A4A4A"/>
</g>
<g id="Vector">
<use xlink:href="#path5_fill" transform="translate(1671.97 16719.2)" fill="#4A4A4A"/>
</g>
<g id="Vector">
<use xlink:href="#path6_fill" transform="translate(1685.21 16765.9)" fill="#4A4A4A"/>
</g>
<g id="Vector">
<use xlink:href="#path7_fill" transform="translate(1685.21 16775.1)" fill="#4A4A4A"/>
</g>
<g id="Vector">
<use xlink:href="#path8_fill" transform="translate(1626.74 16774)" fill="#4A4A4A"/>
</g>
</g>
</g>
<defs>
<path id="path0_fill" d="M 3.92627 0.656824C 3.49638 0.228462 2.89455 8.71505e-07 2.29271 8.71505e-07C 1.69087 8.71505e-07 1.08904 0.257019 0.659154 0.656824C 0.229271 1.08519 -2.1865e-07 1.68489 -2.1865e-07 2.2846C -2.1865e-07 2.88431 0.25793 3.48401 0.659154 3.91237C 1.08904 4.34074 1.66221 4.5692 2.29271 4.5692C 2.89455 4.5692 3.49638 4.31218 3.92627 3.91237C 4.35615 3.48401 4.58542 2.88431 4.58542 2.2846C 4.58542 1.68489 4.32749 1.08519 3.92627 0.656824Z"/>
<path id="path1_fill" d="M 10.5465 29.2429L 10.5465 2.2846C 10.5465 1.02807 9.51475 -8.71505e-07 8.25376 -8.71505e-07C 6.99277 -8.71505e-07 5.96105 1.02807 5.96105 2.2846L 5.96105 29.2429C 2.63662 29.4142 0 32.1557 0 35.4969L 0 38.8382C 0 40.0947 1.03172 41.1228 2.29271 41.1228L 14.2721 41.1228C 15.5331 41.1228 16.5648 40.0947 16.5648 38.8382L 16.5648 35.4969C 16.5648 32.1272 13.8996 29.3857 10.5465 29.2429ZM 4.58542 36.5536L 4.58542 35.4969C 4.58542 34.5831 5.33055 33.8121 6.2763 33.8121L 10.3172 33.8121C 11.2343 33.8121 12.0081 34.5546 12.0081 35.4969L 12.0081 36.5536L 4.58542 36.5536Z"/>
<path id="path2_fill" d="M 105.465 80.2751L 105.465 2.2846C 105.465 1.02807 104.433 0 103.172 0L 2.29271 0C 1.03172 0 -2.1865e-07 1.02807 -2.1865e-07 2.2846L -2.1865e-07 32.4127C -2.1865e-07 33.6693 1.03172 34.6973 2.29271 34.6973C 3.5537 34.6973 4.58542 33.6693 4.58542 32.4127L 4.58542 4.5692L 49.0353 4.5692L 29.576 44.978C 29.4327 45.2922 29.3467 45.6349 29.3467 45.949C 29.3467 45.9775 29.3467 45.9775 29.3467 45.9775C 29.3467 57.0864 37.1706 66.3961 47.6024 68.7093C 48.9207 74.5636 45.5103 78.733 43.5615 80.5892C 42.9597 79.7896 42.3578 78.4188 42.5871 76.1342C 42.6731 75.249 42.2145 74.3637 41.4407 73.9353C 40.667 73.4784 39.6926 73.5355 38.9474 74.0781C 35.3077 76.7339 32.8144 81.5602 31.8973 87.5287L 17.4246 87.5287C 16.1636 87.5287 15.1319 88.5567 15.1319 89.8133C 15.1319 91.0698 16.1636 92.0979 17.4246 92.0979L 88.0401 92.0979C 89.3011 92.0979 90.3328 91.0698 90.3328 89.8133C 90.3328 88.5567 89.3011 87.5287 88.0401 87.5287L 72.8795 87.5287C 72.7649 87.2431 72.6216 86.9575 72.507 86.7005C 70.7874 83.3593 70.7301 79.4755 72.3064 76.0486L 73.7107 73.0215C 73.9972 72.3932 73.9972 71.6793 73.682 71.0796C 73.3954 70.4513 72.8222 70.0229 72.1631 69.8516C 71.8765 69.7945 69.3258 69.2233 66.3167 70.1086C 64.5398 70.6227 62.3904 71.7078 60.5849 73.9353C 59.7538 72.2219 58.5501 70.4799 56.9452 68.9092C 67.8356 66.9387 76.1467 57.4005 76.1467 45.9775C 76.1467 45.949 76.1467 45.949 76.1467 45.949C 76.1467 45.6349 76.0607 45.2922 75.9174 44.978L 56.4293 4.5692L 100.879 4.5692L 100.879 80.2751C 97.5262 80.4179 94.8609 83.1594 94.8609 86.5006L 94.8609 89.8418C 94.8609 91.0984 95.8926 92.1264 97.1536 92.1264L 109.133 92.1264C 110.394 92.1264 111.426 91.0984 111.426 89.8418L 111.426 86.5292C 111.426 83.1879 108.789 80.4464 105.465 80.2751ZM 57.719 80.218C 57.805 81.3031 58.6647 82.1884 59.7538 82.3027C 60.8428 82.4169 61.8745 81.7315 62.1898 80.7034C 63.5081 76.3341 66.0301 74.8206 68.0648 74.3637C 66.1734 78.5902 66.116 83.3307 67.8642 87.5858L 36.5401 87.5858C 36.97 85.1584 37.6864 83.0166 38.6895 81.2746C 39.9791 84.4445 42.4438 85.6153 42.6158 85.701C 43.3609 86.0437 44.2207 85.958 44.8798 85.5011C 44.9944 85.4154 47.5737 83.6449 49.6658 80.4464C 51.586 77.5336 52.5317 74.3922 52.5031 71.1652C 56.1714 73.9068 57.5184 77.8763 57.719 80.218ZM 52.7323 64.7398C 43.1316 64.7398 35.1931 57.5433 34.0754 48.2907L 62.4477 48.2907C 61.416 52.66 57.4611 55.9441 52.7323 55.9441C 51.4714 55.9441 50.4396 56.9722 50.4396 58.2287C 50.4396 59.4852 51.4714 60.5133 52.7323 60.5133C 59.983 60.5133 66.0014 55.2016 67.1191 48.2907L 71.3893 48.2907C 70.2716 57.5433 62.3331 64.7398 52.7323 64.7398ZM 70.1856 43.7215L 35.2791 43.7215L 52.7323 7.42494L 70.1856 43.7215ZM 99.4463 87.5858L 99.4463 86.5292C 99.4463 85.6153 100.191 84.8443 101.137 84.8443L 105.178 84.8443C 106.095 84.8443 106.869 85.5868 106.869 86.5292L 106.869 87.5858L 99.4463 87.5858Z"/>
<path id="path3_fill" d="M 5.96105 7.34641L 5.12994 6.51824C 4.78603 6.17555 4.58542 5.69008 4.58542 5.2046C 4.58542 4.71912 4.78603 4.23365 5.12994 3.89096C 6.01837 3.00568 6.01837 1.54924 5.12994 0.663961C 4.24151 -0.221321 2.77991 -0.221321 1.89149 0.663961C 0.659153 1.89193 1.7492e-06 3.49115 1.7492e-06 5.2046C 1.7492e-06 6.91805 0.659153 8.54583 1.89149 9.74524L 2.7226 10.5734C 3.46773 11.3159 3.46773 12.4868 2.7226 13.2293C 1.83417 14.1145 1.83417 15.571 2.7226 16.4562C 3.18114 16.9132 3.75431 17.1131 4.35615 17.1131C 4.92933 17.1131 5.53116 16.8846 5.98971 16.4562C 8.48303 13.9432 8.48303 9.85947 5.96105 7.34641Z"/>
<path id="path4_fill" d="M 5.96105 7.37497L 5.12994 6.5468C 4.38481 5.80431 4.38481 4.63345 5.12994 3.89096C 6.01837 3.00567 6.01837 1.54924 5.12994 0.663961C 4.24152 -0.22132 2.77991 -0.22132 1.89149 0.663961C -0.630496 3.17702 -0.630496 7.26074 1.89149 9.7738L 2.72259 10.602C 3.0665 10.9447 3.26711 11.4301 3.26711 11.9156C 3.26711 12.4296 3.0665 12.8866 2.72259 13.2293C 1.83417 14.1145 1.83417 15.571 2.72259 16.4562C 3.18113 16.9132 3.75432 17.1131 4.35615 17.1131C 4.92933 17.1131 5.53117 16.8846 5.98971 16.4562C 7.22204 15.2283 7.88119 13.6291 7.88119 11.9156C 7.85253 10.2022 7.16472 8.60294 5.96105 7.37497Z"/>
<path id="path5_fill" d="M 5.96105 7.37497L 5.12994 6.5468C 4.38481 5.80431 4.38481 4.63345 5.12994 3.89096C 6.01837 3.00567 6.01837 1.54924 5.12994 0.663961C 4.24152 -0.22132 2.77992 -0.22132 1.89149 0.663961C -0.630492 3.17702 -0.630492 7.26074 1.89149 9.7738L 2.7226 10.602C 3.0665 10.9447 3.26711 11.4301 3.26711 11.9156C 3.26711 12.4296 3.0665 12.8866 2.7226 13.2293C 1.83417 14.1145 1.83417 15.571 2.7226 16.4562C 3.18114 16.9132 3.75431 17.1131 4.35615 17.1131C 4.92932 17.1131 5.53116 16.8846 5.98971 16.4562C 7.22204 15.2283 7.8812 13.6291 7.8812 11.8871C 7.85254 10.2022 7.19338 8.60294 5.96105 7.37497Z"/>
<path id="path6_fill" d="M 3.92627 0.656821C 3.49638 0.228459 2.89454 -1.74301e-06 2.29271 -1.74301e-06C 1.69087 -1.74301e-06 1.08904 0.257016 0.659156 0.656821C 0.229273 1.08518 -3.4984e-06 1.68489 -3.4984e-06 2.2846C -3.4984e-06 2.8843 0.257932 3.48401 0.659156 3.91238C 1.08904 4.34074 1.69087 4.5692 2.29271 4.5692C 2.89454 4.5692 3.49638 4.31218 3.92627 3.91238C 4.35615 3.48401 4.58542 2.8843 4.58542 2.2846C 4.58542 1.68489 4.32749 1.08518 3.92627 0.656821Z"/>
<path id="path7_fill" d="M 2.29271 -1.74301e-06C 1.03172 -1.74301e-06 -3.4984e-06 1.02807 -3.4984e-06 2.2846L -3.4984e-06 11.3088C -3.4984e-06 12.5653 1.03172 13.5934 2.29271 13.5934C 3.5537 13.5934 4.58542 12.5653 4.58542 11.3088L 4.58542 2.2846C 4.58542 1.02807 3.5537 -1.74301e-06 2.29271 -1.74301e-06Z"/>
<path id="path8_fill" d="M 2.29271 -8.71505e-07C 1.03172 -8.71505e-07 8.746e-07 1.02807 8.746e-07 2.2846L 8.746e-07 14.4215C 8.746e-07 15.6781 1.03172 16.7061 2.29271 16.7061C 3.5537 16.7061 4.58542 15.6781 4.58542 14.4215L 4.58542 2.2846C 4.58542 0.999511 3.5537 -8.71505e-07 2.29271 -8.71505e-07Z"/>
</defs>
</svg>
