<svg width="101" height="103" viewBox="0 0 101 103" version="1.1" xmlns="http://www.w3.org/2000/svg" xmlns:xlink="http://www.w3.org/1999/xlink">
<title>Group</title>
<desc>Created using Figma</desc>
<g id="Canvas" transform="translate(1761 -7725)">
<g id="Group">
<g id="Group">
<g id="Vector">
<use xlink:href="#path0_fill" transform="translate(-1738.13 7803.07)"/>
</g>
<g id="Vector">
<use xlink:href="#path1_fill" transform="translate(-1723.51 7803.07)"/>
</g>
<g id="Vector">
<use xlink:href="#path2_fill" transform="translate(-1708.89 7803.07)"/>
</g>
<g id="Vector">
<use xlink:href="#path3_fill" transform="translate(-1694.26 7803.07)"/>
</g>
<g id="Vector">
<use xlink:href="#path4_fill" transform="translate(-1760.66 7725.73)"/>
</g>
</g>
</g>
</g>
<defs>
<path id="path0_fill" d="M 5.23938 6.48607C 5.29414 6.04831 5.89659 5.39167 6.82765 4.78975C 8.03255 3.96894 8.36116 2.38204 7.5944 1.1782C 6.77288 -0.0256535 5.18461 -0.353973 3.97971 0.412113C 1.73421 1.88956 0.419777 3.64062 0.0911685 5.61055C -0.456513 8.78434 1.56991 11.4109 3.32249 13.7092C 4.36308 15.1319 5.73229 16.883 5.56798 17.7585C 5.51321 18.1962 4.91077 18.8529 3.97971 19.4548C 2.77481 20.2756 2.4462 21.8625 3.21295 23.1211C 3.70587 23.8872 4.58216 24.3249 5.40368 24.3249C 5.89659 24.3249 6.3895 24.1608 6.82765 23.8872C 9.07314 22.4097 10.3876 20.6587 10.7162 18.6887C 11.2639 15.5149 9.23745 12.8884 7.48487 10.5901C 6.3895 9.16737 5.07507 7.41632 5.23938 6.48607Z"/>
<path id="path1_fill" d="M 5.29414 6.48607C 5.34891 6.04831 5.95136 5.39167 6.88242 4.78975C 8.08732 3.96894 8.41593 2.38204 7.64917 1.1782C 6.82765 -0.0256535 5.23937 -0.353973 3.97971 0.412113C 1.73421 1.88956 0.419778 3.64062 0.0911689 5.61055C -0.456513 8.78434 1.56991 11.4109 3.32249 13.7092C 4.36308 15.1319 5.73229 16.883 5.56798 17.7585C 5.51322 18.1962 4.91076 18.8529 3.97971 19.4548C 2.77481 20.2756 2.4462 21.8625 3.21295 23.1211C 3.70586 23.8872 4.58216 24.3249 5.40368 24.3249C 5.89659 24.3249 6.38951 24.1608 6.82765 23.8872C 9.07315 22.4097 10.3876 20.6587 10.7162 18.6887C 11.2639 15.5149 9.23745 12.8884 7.48487 10.5901C 6.44427 9.16737 5.12984 7.41632 5.29414 6.48607Z"/>
<path id="path2_fill" d="M 5.29414 6.48607C 5.34891 6.04831 5.95136 5.39167 6.88242 4.78975C 8.08732 3.96894 8.41593 2.38204 7.64917 1.1782C 6.82765 -0.0256535 5.23938 -0.353973 3.97971 0.412113C 1.73422 1.88956 0.419776 3.64062 0.0911672 5.61055C -0.456514 8.78434 1.56991 11.4109 3.32249 13.7092C 4.36308 15.1319 5.73229 16.883 5.56798 17.7585C 5.51321 18.1962 4.91077 18.8529 3.97971 19.4548C 2.77481 20.2756 2.4462 21.8625 3.21295 23.1211C 3.70587 23.8872 4.52739 24.3249 5.40368 24.3249C 5.89659 24.3249 6.3895 24.1608 6.82765 23.8872C 9.07314 22.4097 10.3876 20.6587 10.7162 18.6887C 11.2639 15.5149 9.23745 12.8884 7.48487 10.5901C 6.44427 9.16737 5.12984 7.41632 5.29414 6.48607Z"/>
<path id="path3_fill" d="M 5.29414 6.48607C 5.34891 6.04831 5.95136 5.39167 6.88242 4.78975C 8.08732 3.96894 8.41593 2.38204 7.64917 1.1782C 6.82765 -0.0256535 5.23937 -0.353973 3.97971 0.412113C 1.73421 1.88956 0.419779 3.64062 0.0911697 5.61055C -0.456512 8.78434 1.56991 11.4109 3.32249 13.7092C 4.36309 15.1319 5.73228 16.883 5.56798 17.7585C 5.51321 18.1962 4.91077 18.8529 3.97971 19.4548C 2.77481 20.2756 2.4462 21.8625 3.21295 23.1211C 3.70587 23.8872 4.58216 24.3249 5.40368 24.3249C 5.8966 24.3249 6.3895 24.1608 6.82765 23.8872C 9.07314 22.4097 10.3876 20.6587 10.7162 18.6887C 11.2639 15.5149 9.23745 12.8884 7.48486 10.5901C 6.49904 9.16737 5.1846 7.41632 5.29414 6.48607Z"/>
<path id="path4_fill" d="M 74.2108 16.9633C 73.6631 16.9633 73.1702 16.9633 72.6226 17.018C 68.2959 6.84005 57.9995 0 46.6625 0C 31.1631 0 18.5664 12.3121 18.5664 27.4696C 18.5664 27.5244 18.5664 27.5791 18.5664 27.6338C 8.21522 28.4546 0 36.991 0 47.3332C 0 58.2225 9.03674 67.0872 20.1547 67.0872L 74.2108 67.0872C 88.341 67.0872 99.7876 55.8148 99.7876 42.0253C 99.7876 28.181 88.2862 16.9633 74.2108 16.9633ZM 74.2108 60.5208L 20.1547 60.5208C 12.6514 60.5208 6.57218 54.611 6.57218 47.3332C 6.57218 40.0553 12.6514 34.1455 20.1547 34.1455C 20.5928 34.1455 21.1405 34.2003 21.743 34.255C 22.7288 34.3644 23.7694 34.0361 24.4814 33.27C 25.1933 32.5586 25.522 31.519 25.3576 30.534C 25.1933 29.4943 25.1386 28.4546 25.1386 27.4696C 25.1386 15.9784 34.8325 6.56645 46.6625 6.56645C 56.0826 6.56645 64.5716 12.6951 67.2553 21.5051C 67.7482 23.092 69.3365 24.077 70.9247 23.8034C 71.9653 23.6392 73.0607 23.5298 74.1561 23.5298C 84.6168 23.5298 93.1606 31.8473 93.1606 42.0253C 93.2154 52.2033 84.6715 60.5208 74.2108 60.5208Z"/>
</defs>
</svg>
