<svg width="117" height="75" viewBox="0 0 117 75" version="1.1" xmlns="http://www.w3.org/2000/svg" xmlns:xlink="http://www.w3.org/1999/xlink">
<title>Group</title>
<desc>Created using Figma</desc>
<g id="Canvas" transform="translate(2222 -7739)">
<g id="Group">
<g id="Group">
<g id="Vector">
<use xlink:href="#path0_fill" transform="translate(-2221.75 7739.74)"/>
</g>
<g id="Vector">
<use xlink:href="#path1_fill" transform="translate(-2194.47 7756.21)"/>
</g>
<g id="Vector">
<use xlink:href="#path2_fill" transform="translate(-2213.75 7772.75)"/>
</g>
<g id="Vector">
<use xlink:href="#path3_fill" transform="translate(-2200.34 7789.22)"/>
</g>
<g id="Vector">
<use xlink:href="#path4_fill" transform="translate(-2212.35 7805.76)"/>
</g>
</g>
</g>
</g>
<defs>
<path id="path0_fill" d="M 77.2479 4.017C 77.2479 1.80765 75.4468 0 73.2454 0L 4.00248 0C 1.80112 0 0 1.80765 0 4.017C 0 6.22634 1.80112 8.03399 4.00248 8.03399L 73.2454 8.03399C 75.5135 8.03399 77.2479 6.22634 77.2479 4.017Z"/>
<path id="path1_fill" d="M 84.7192 2.55394e-07L 4.00248 2.55394e-07C 1.80112 2.55394e-07 1.01788e-06 1.80765 1.01788e-06 4.017C 1.01788e-06 6.22634 1.80112 8.03399 4.00248 8.03399L 84.7192 8.03399C 86.9206 8.03399 88.7217 6.22634 88.7217 4.017C 88.7217 1.80765 86.9873 2.55394e-07 84.7192 2.55394e-07Z"/>
<path id="path2_fill" d="M 85.1195 8.03399C 87.3208 8.03399 89.1219 6.22634 89.1219 4.01699C 89.1219 1.80765 87.3208 -5.10787e-07 85.1195 -5.10787e-07L 4.00248 -5.10787e-07C 1.80112 -5.10787e-07 0 1.80765 0 4.01699C 0 6.22634 1.80112 8.03399 4.00248 8.03399L 85.1195 8.03399Z"/>
<path id="path3_fill" d="M 85.0527 1.02157e-06L 4.00248 1.02157e-06C 1.80112 1.02157e-06 -1.01788e-06 1.80765 -1.01788e-06 4.017C -1.01788e-06 6.22634 1.80112 8.03399 4.00248 8.03399L 85.0527 8.03399C 87.2541 8.03399 89.0552 6.22634 89.0552 4.017C 89.0552 1.80765 87.2541 1.02157e-06 85.0527 1.02157e-06Z"/>
<path id="path4_fill" d="M 57.7024 -1.02157e-06L 4.00248 -1.02157e-06C 1.80112 -1.02157e-06 2.54471e-07 1.80765 2.54471e-07 4.01699C 2.54471e-07 6.22634 1.80112 8.03399 4.00248 8.03399L 57.7692 8.03399C 59.9705 8.03399 61.7716 6.22634 61.7716 4.01699C 61.7049 1.80765 59.9038 -1.02157e-06 57.7024 -1.02157e-06Z"/>
</defs>
</svg>
