<svg width="100" height="110" viewBox="0 0 100 110" version="1.1" xmlns="http://www.w3.org/2000/svg" xmlns:xlink="http://www.w3.org/1999/xlink">
<title>Group</title>
<desc>Created using Figma</desc>
<g id="Canvas" transform="translate(-1077 -16702)">
<g id="Group">
<g id="Group">
<g id="Group">
<g id="Vector">
<use xlink:href="#path0_fill" transform="translate(1077 16702)" fill="#4A4A4A"/>
</g>
</g>
<g id="Vector">
<use xlink:href="#path1_fill" transform="translate(1119.16 16713)" fill="#4A4A4A"/>
</g>
<g id="Vector">
<use xlink:href="#path2_fill" transform="translate(1100.82 16734.9)" fill="#4A4A4A"/>
</g>
</g>
</g>
</g>
<defs>
<path id="path0_fill" d="M 98.1567 58.7665C 84.2858 49.8852 78.9266 31.8654 85.6901 16.8727L 89.6737 8.04846C 89.8743 7.56299 89.8743 7.04895 89.6737 6.56348C 89.473 6.078 89.0718 5.73531 88.5846 5.56396L 72.0771 0.0809279C 71.6472 -0.0618595 71.2173 -0.00474458 70.8161 0.1666L 70.8161 0.138043C 57.2891 5.76387 41.756 5.76387 28.2003 0.138043L 28.2003 0.1666C 27.7991 -0.00474458 27.3406 -0.0333021 26.9394 0.0809279L 10.4032 5.56396C 9.91597 5.73531 9.51475 6.078 9.31414 6.56348C 9.11353 7.04895 9.11353 7.56299 9.31414 8.04846L 13.2977 16.8727C 20.0612 31.8654 14.702 49.8852 0.831108 58.7665C 0.315248 59.1092 3.4164e-09 59.6804 3.4164e-09 60.3087L 3.4164e-09 104.173C 3.4164e-09 104.973 0.51586 105.658 1.26099 105.915L 12.2373 109.57C 12.438 109.627 12.6099 109.656 12.8105 109.656L 86.1773 109.656C 86.3779 109.656 86.5785 109.627 86.7505 109.57L 97.7555 105.915C 98.5006 105.658 99.0164 104.973 99.0164 104.173L 99.0164 60.3087C 99.0164 59.6804 98.7012 59.1092 98.1567 58.7665ZM 49.4939 8.01991C 56.0281 8.01991 62.5623 6.93472 68.7813 4.79291L 64.3679 20.9279L 49.4939 34.0929L 34.6199 20.8993L 30.2065 4.76435C 36.4254 6.93472 42.9597 8.01991 49.4939 8.01991ZM 71.5039 76.7578L 71.5039 84.0685L 58.6647 84.0685C 58.6647 83.069 57.8336 82.2408 56.8306 82.2408L 51.3281 82.2408L 51.3281 78.5854L 56.8306 78.5854C 57.8336 78.5854 58.6647 77.7573 58.6647 76.7578L 71.5039 76.7578ZM 58.6647 73.1024L 58.6647 69.447L 71.5039 69.447L 71.5039 73.1024L 58.6647 73.1024ZM 71.5039 87.7238L 71.5039 91.3792L 58.6647 91.3792L 58.6647 87.7238L 71.5039 87.7238ZM 54.9964 74.9301L 43.9914 74.9301L 43.9914 67.6194L 54.9964 67.6194L 54.9964 74.9301ZM 27.4839 84.0685L 27.4839 76.7578L 40.3231 76.7578C 40.3231 77.7573 41.1542 78.5854 42.1572 78.5854L 47.6597 78.5854L 47.6597 82.2408L 42.1572 82.2408C 41.1542 82.2408 40.3231 83.069 40.3231 84.0685L 27.4839 84.0685ZM 40.3231 87.7238L 40.3231 91.3792L 27.4839 91.3792L 27.4839 87.7238L 40.3231 87.7238ZM 27.4839 73.1024L 27.4839 69.447L 40.3231 69.447L 40.3231 73.1024L 27.4839 73.1024ZM 3.63968 61.2796C 18.399 51.2559 23.9875 31.6941 16.6222 15.3592L 13.4697 8.39115L 26.2229 4.16465L 31.2095 22.4129C 31.2955 22.7556 31.4961 23.0697 31.754 23.2982L 47.6597 37.377L 47.6597 63.964L 42.1572 63.964C 41.1542 63.964 40.3231 64.7922 40.3231 65.7917L 27.4839 65.7917L 27.4839 60.3087C 27.4839 59.3091 26.6528 58.481 25.6497 58.481L 18.313 58.481C 17.31 58.481 16.4789 59.3091 16.4789 60.3087L 16.4789 65.7917L 3.63968 65.7917L 3.63968 61.2796ZM 20.1472 78.5854L 20.1472 62.1363L 23.8155 62.1363L 23.8155 78.5854L 20.1472 78.5854ZM 23.8155 82.2408L 23.8155 98.6899L 20.1472 98.6899L 20.1472 82.2408L 23.8155 82.2408ZM 3.63968 69.447L 16.4789 69.447L 16.4789 73.1024L 3.63968 73.1024L 3.63968 69.447ZM 3.63968 76.7578L 16.4789 76.7578L 16.4789 84.0685L 3.63968 84.0685L 3.63968 76.7578ZM 3.63968 87.7238L 16.4789 87.7238L 16.4789 91.3792L 3.63968 91.3792L 3.63968 87.7238ZM 47.6597 106.001L 13.0971 106.001L 3.63968 102.859L 3.63968 95.0345L 16.4789 95.0345L 16.4789 100.518C 16.4789 101.517 17.31 102.345 18.313 102.345L 25.6497 102.345C 26.6528 102.345 27.4839 101.517 27.4839 100.518L 27.4839 95.0345L 40.3231 95.0345C 40.3231 96.0341 41.1542 96.8622 42.1572 96.8622L 47.6597 96.8622L 47.6597 106.001ZM 43.9914 93.2069L 43.9914 85.8962L 54.9964 85.8962L 54.9964 93.2069L 43.9914 93.2069ZM 95.3481 102.859L 85.8907 106.001L 51.3281 106.001L 51.3281 96.8622L 56.8306 96.8622C 57.8336 96.8622 58.6647 96.0341 58.6647 95.0345L 71.5039 95.0345L 71.5039 100.518C 71.5039 101.517 72.335 102.345 73.3381 102.345L 80.6748 102.345C 81.6778 102.345 82.5089 101.517 82.5089 100.518L 82.5089 95.0345L 95.3481 95.0345L 95.3481 102.859ZM 78.8406 82.2408L 78.8406 98.6899L 75.1723 98.6899L 75.1723 82.2408L 78.8406 82.2408ZM 75.1723 78.5854L 75.1723 62.1363L 78.8406 62.1363L 78.8406 78.5854L 75.1723 78.5854ZM 95.3481 91.3792L 82.5089 91.3792L 82.5089 87.7238L 95.3481 87.7238L 95.3481 91.3792ZM 95.3481 84.0685L 82.5089 84.0685L 82.5089 76.7578L 95.3481 76.7578L 95.3481 84.0685ZM 95.3481 73.1024L 82.5089 73.1024L 82.5089 69.447L 95.3481 69.447L 95.3481 73.1024ZM 95.3481 65.7917L 82.5089 65.7917L 82.5089 60.3087C 82.5089 59.3091 81.6778 58.481 80.6748 58.481L 73.3381 58.481C 72.335 58.481 71.5039 59.3091 71.5039 60.3087L 71.5039 65.7917L 58.6647 65.7917C 58.6647 64.7922 57.8336 63.964 56.8306 63.964L 51.3281 63.964L 51.3281 37.377L 67.2051 23.2982C 67.463 23.0697 67.6636 22.7556 67.7496 22.4129L 72.7363 4.16465L 85.4895 8.39115L 82.337 15.3592C 74.9716 31.6941 80.5601 51.2274 95.3195 61.2796L 95.3195 65.7917L 95.3481 65.7917Z"/>
<path id="path1_fill" d="M 12.8392 4.35753e-07L 1.83417 4.35753e-07C 0.831109 4.35753e-07 -1.7492e-06 0.828167 -1.7492e-06 1.82768L -1.7492e-06 12.7937C -1.7492e-06 13.7933 0.831109 14.6214 1.83417 14.6214L 12.8392 14.6214C 13.8422 14.6214 14.6734 13.7933 14.6734 12.7937L 14.6734 1.82768C 14.6734 0.828167 13.8422 4.35753e-07 12.8392 4.35753e-07ZM 11.005 10.9661L 3.66834 10.9661L 3.66834 3.65536L 11.005 3.65536L 11.005 10.9661Z"/>
<path id="path2_fill" d="M 12.831 -8.71505e-07L 1.82596 -8.71505e-07C 1.10949 -8.71505e-07 0.450333 0.428363 0.163744 1.05663C -0.122845 1.71345 -0.0368679 2.45594 0.450333 2.99853L 11.4553 15.7923C 11.7993 16.2206 12.3151 16.4205 12.8596 16.4205C 13.0602 16.4205 13.2895 16.392 13.4901 16.3063C 14.2066 16.0493 14.6938 15.3639 14.6938 14.5929L 14.6938 1.79912C 14.6651 0.828167 13.834 -8.71505e-07 12.831 -8.71505e-07ZM 10.9968 9.68099L 5.80954 3.65536L 10.9968 3.65536L 10.9968 9.68099Z"/>
</defs>
</svg>
