<?xml version="1.0" encoding="utf-8"?>
<!-- Generator: Adobe Illustrator 22.0.1, SVG Export Plug-In . SVG Version: 6.00 Build 0)  -->
<svg version="1.1" id="Слой_1" xmlns="http://www.w3.org/2000/svg" xmlns:xlink="http://www.w3.org/1999/xlink" x="0px" y="0px"
	 viewBox="0 0 80 80" style="enable-background:new 0 0 80 80;" xml:space="preserve">
<style type="text/css">
	.st0{fill:#FFFFFF;}
</style>
<path id="path0_fill" class="st0" d="M40,0C17.9,0,0,17.9,0,40s17.9,40,40,40s40-17.9,40-40S62.1,0,40,0z M31.2,18.8
	c2.3-0.1,3-0.1,8.8-0.1c5.8,0,6.5,0,8.8,0.1c2.3,0.1,3.8,0.5,5.2,1c1.4,0.5,2.6,1.3,3.8,2.5c1.2,1.2,1.9,2.4,2.5,3.8
	c0.5,1.4,0.9,2.9,1,5.2c0.1,2.3,0.1,3,0.1,8.8c0,5.8,0,6.5-0.1,8.8c-0.1,2.3-0.5,3.8-1,5.2c-0.5,1.4-1.3,2.6-2.5,3.8
	c-1.2,1.2-2.4,1.9-3.8,2.5c-1.4,0.5-2.9,0.9-5.2,1c-2.3,0.1-3,0.1-8.8,0.1c-5.8,0-6.5,0-8.8-0.1c-2.3-0.1-3.8-0.5-5.2-1
	c-1.4-0.5-2.6-1.3-3.8-2.5c-1.2-1.2-1.9-2.4-2.5-3.8c-0.5-1.4-0.9-2.9-1-5.2c-0.1-2.3-0.1-3-0.1-8.8c0-5.8,0-6.5,0.1-8.8
	c0.1-2.3,0.5-3.8,1-5.2c0.5-1.4,1.3-2.6,2.5-3.8c1.2-1.2,2.4-1.9,3.8-2.5C27.4,19.3,28.9,18.9,31.2,18.8z"/>
<path class="st0" d="M57.4,31.4c-0.1-2.1-0.4-3.2-0.7-4c-0.4-1-0.8-1.7-1.6-2.5c-0.7-0.7-1.5-1.2-2.5-1.6c-0.8-0.3-1.9-0.6-4-0.7
	c-2.2-0.1-2.9-0.1-8.6-0.1c-0.7,0-1.3,0-1.9,0v0c-4,0-4.7,0-6.7,0.1c-2.1,0.1-3.2,0.4-4,0.7c-1,0.4-1.7,0.8-2.5,1.6
	c-0.7,0.7-1.2,1.5-1.6,2.5c-0.3,0.8-0.6,1.9-0.7,4c-0.1,2.2-0.1,2.9-0.1,8.6c0,5.7,0,6.4,0.1,8.6c0.1,2.1,0.4,3.2,0.7,4
	c0.4,1,0.8,1.7,1.6,2.5c0.7,0.7,1.5,1.2,2.5,1.6c0.8,0.3,1.9,0.6,4,0.7c2.2,0.1,2.9,0.1,8.6,0.1c5.7,0,6.4,0,8.6-0.1
	c2.1-0.1,3.2-0.4,4-0.7c1-0.4,1.7-0.8,2.5-1.6c0.7-0.7,1.2-1.5,1.6-2.5c0.3-0.8,0.6-1.9,0.7-4c0.1-2.2,0.1-2.9,0.1-8.6
	C57.5,34.3,57.5,33.6,57.4,31.4z M40,51c-6.1,0-11-4.9-11-11c0-6.1,4.9-11,11-11c6,0,11,4.9,11,11C51,46.1,46,51,40,51z M51.4,31.2
	c-1.4,0-2.6-1.1-2.6-2.6c0-1.4,1.1-2.6,2.6-2.6c1.4,0,2.6,1.1,2.6,2.6S52.8,31.2,51.4,31.2z"/>
<path id="path2_fill" class="st0" d="M40,32.9c3.9,0,7.1,3.2,7.1,7.1c0,3.9-3.2,7.1-7.1,7.1c-3.9,0-7.1-3.2-7.1-7.1
	C32.9,36.1,36.1,32.9,40,32.9L40,32.9z"/>
</svg>
