<?xml version="1.0" encoding="UTF-8"?>
<svg width="60px" height="60px" viewBox="0 0 60 60" version="1.1" xmlns="http://www.w3.org/2000/svg" xmlns:xlink="http://www.w3.org/1999/xlink">
    <!-- Generator: Sketch 42 (36781) - http://www.bohemiancoding.com/sketch -->
    <title>Tinder_White</title>
    <desc>Created with Sketch.</desc>
    <defs></defs>
    <g id="Page-1" stroke="none" stroke-width="1" fill="none" fill-rule="evenodd" opacity="0.5">
        <g id="Social_icons_white" transform="translate(-160.000000, -869.000000)" fill="#FFFFFF">
            <g id="White" transform="translate(60.000000, 169.000000)">
                <g id="Tinder" transform="translate(100.000000, 700.000000)">
                    <path d="M30,60 C13.4314575,60 0,46.5685425 0,30 C0,13.4314575 13.4314575,0 30,0 C46.5685425,0 60,13.4314575 60,30 C60,46.5685425 46.5685425,60 30,60 Z M33.0467177,13.6933995 C32.4309361,13.1032754 31.9434423,12.359206 31.1737152,12 L31.0967425,12.359206 C31.9180413,14.4118114 31.7127808,16.6696774 31.6355515,18.8249132 C31.3020031,20.5183127 30.506875,22.1090819 29.5318874,23.5459058 C28.4542696,24.8800993 27.1198194,26.0346899 25.8625986,27.1892805 C24.8362958,26.2142929 24.348802,24.7774691 24.0409112,23.4176179 C23.8097365,22.7761787 24.0922264,22.0577668 23.758678,21.4419852 C20.1666184,25.5985112 16.8054769,30.4221341 16.087065,36.0411416 C15.6252288,39.1970225 17.0363951,42.4555337 19.4738641,44.456824 C20.5258244,45.585757 22.0137067,46.0732508 23.3224993,46.7916627 C26.9402165,48.382432 31.071085,48.2284866 34.81709,47.3304717 C37.819282,46.3298265 40.6929297,44.456824 42.2834424,41.6601491 C43.2073714,39.8128041 43.7718379,37.7858562 43.7205228,35.7332508 C43.7718379,33.4753847 43.6435501,31.1918612 42.8225079,29.0879406 C42.0271232,26.0090323 40.4876691,23.1866998 38.7429545,20.5439703 C37.7423093,19.2354343 36.9725823,17.7729529 35.7666766,16.6183623 C34.791689,15.7203474 34.0473629,14.5657568 33.0467177,13.6933995 Z" id="Combined-Shape"></path>
                </g>
            </g>
        </g>
    </g>
</svg>