<?xml version="1.0" encoding="UTF-8"?>
<svg width="32px" height="37px" viewBox="0 0 32 37" version="1.1" xmlns="http://www.w3.org/2000/svg" xmlns:xlink="http://www.w3.org/1999/xlink">
    <!-- Generator: Sketch 42 (36781) - http://www.bohemiancoding.com/sketch -->
    <title>Vine_Color</title>
    <desc>Created with Sketch.</desc>
    <defs></defs>
    <g id="Page-1" stroke="none" stroke-width="1" fill="none" fill-rule="evenodd">
        <g id="Social_icons_no_circle" transform="translate(-74.000000, -981.000000)" fill="#00B488">
            <g id="Color" transform="translate(71.000000, 182.000000)">
                <g id="Vine" transform="translate(3.000000, 799.000000)">
                    <path d="M15.2381576,36.7692015 C13.7904893,36.5389452 12.5714432,35.4642509 10.8952344,33.77554 C5.86668988,29.0162503 0.685703169,16.2736708 0,5.52697556 L6.09523029,5.52697556 C7.69517705,16.8110179 10.2095312,24.4872995 15.6190583,30.7050438 C18.2856909,28.1718948 20.4951607,24.6408037 22.0190092,21.8005638 C19.0476561,20.4188612 17.3714473,17.8088776 16.4572037,15.4292327 C13.638129,8.06004202 16.0762211,0.230256261 24.0762825,0 C29.9428905,0 31.9239018,4.45219876 32,8.67414125 C31.9238199,11.2072902 31.5428372,12.9728358 30.7809539,15.1222244 C29.1047451,15.5059848 27.3524381,15.0454723 26.2857523,14.2778689 C25.4476889,13.6637697 25.1428864,13.970778 25.6762293,12.2819845 C26.2857523,10.1326785 26.5142927,5.45014095 23.6191198,5.37338886 C21.6381085,5.52689303 21.1048475,7.98328994 21.1048475,9.67208344 C21.6381904,16.5806791 26.0572119,19.6511752 31.9239018,18.1159684 L31.9239018,22.5681672 C30.0191525,23.0287622 29.9428905,23.0287622 27.5809785,23.1055143 C26.2095722,26.3295146 18.7428536,37.4601353 15.1619775,36.7692015 L15.2381576,36.7692015 L15.2381576,36.7692015 Z"></path>
                </g>
            </g>
        </g>
    </g>
</svg>