<?xml version="1.0" encoding="UTF-8"?>
<svg width="60px" height="60px" viewBox="0 0 60 60" version="1.1" xmlns="http://www.w3.org/2000/svg" xmlns:xlink="http://www.w3.org/1999/xlink">
    <!-- Generator: Sketch 42 (36781) - http://www.bohemiancoding.com/sketch -->
    <title>Messenger_Black</title>
    <desc>Created with Sketch.</desc>
    <defs></defs>
    <g id="Page-1" stroke="none" stroke-width="1" fill="none" fill-rule="evenodd" opacity="0.5">
        <g id="Social_icons_black" transform="translate(-60.000000, -869.000000)" fill="#000000">
            <g id="Black" transform="translate(60.000000, 169.000000)">
                <g id="Messenger" transform="translate(0.000000, 700.000000)">
                    <path d="M0,30 C0,13.4314567 13.4314567,0 30,0 C46.5685433,0 60,13.4314567 60,30 C60,46.5685433 46.5685433,60 30,60 C13.4314567,60 0,46.5685433 0,30 Z M30,12 C20.0588571,12 12,19.4618889 12,28.6666667 C12,33.9116667 14.6174907,38.5901111 18.7080745,41.6452222 L18.7080745,48 L24.8369068,44.6363333 C26.472559,45.089 28.2053665,45.3333333 30,45.3333333 C39.9411429,45.3333333 48,37.8714444 48,28.6666667 C48,19.4618889 39.9411429,12 30,12 Z" id="Combined-Shape"></path>
                    <polygon id="Path" points="31.3157895 34 26.8038278 29.3191489 18 34 27.6842105 24 32.3062201 28.6808511 41 24"></polygon>
                </g>
            </g>
        </g>
    </g>
</svg>