<?xml version="1.0" encoding="UTF-8"?>
<svg width="32px" height="32px" viewBox="0 0 32 32" version="1.1" xmlns="http://www.w3.org/2000/svg" xmlns:xlink="http://www.w3.org/1999/xlink">
    <!-- Generator: Sketch 42 (36781) - http://www.bohemiancoding.com/sketch -->
    <title>Coub_Color</title>
    <desc>Created with Sketch.</desc>
    <defs>
        <path d="M7.60089143,29.6208 C3.03942857,26.8020343 0,21.7559771 0,16 C0,7.16345143 7.16345143,0 16,0 C24.8365486,0 32,7.16345143 32,16 C32,24.8365486 24.8365486,32 16,32 C15.5759314,32 15.1557029,31.9834971 14.7399543,31.9511086 L16.3138743,27.6268343 C16.5742857,26.9113371 17.4435886,25.9528457 18.2101714,25.1068114 C18.6490514,24.6237714 19.0273371,24.2059429 19.1717714,23.9603886 C19.8685943,22.7736914 21.9940114,19.2088914 22.0154514,19.1728 C22.4522286,18.5464457 23.1531429,17.4754971 23.5852114,16.7765029 L25.9453486,12.9421257 C26.3770514,12.2412114 26.4097371,11.3615314 26.0181257,10.9818743 C25.9493029,10.9155429 25.8686857,10.8651657 25.7787886,10.8324343 C25.3460571,10.6749486 24.7711086,10.9302857 24.3477029,11.4677714 L21.9751543,14.7761371 C21.7007543,15.1247771 21.3938514,15.4106743 21.0967771,15.6874514 C20.8496229,15.9176914 20.5945143,16.1562286 20.36608,16.4221257 L20.1237029,16.7055543 C20.0942171,16.7394971 20.05312,16.7603657 20.0084114,16.7633143 C19.9637029,16.7662629 19.9213257,16.7607086 19.88256,16.7466057 C19.7979429,16.7157943 19.6616914,16.6192 19.6986514,16.3178971 C19.7066971,16.2808229 20.1220114,14.53536 19.0205486,14.0703086 L18.9724114,14.0520229 C18.3770743,13.8353371 17.9029257,14.2076114 17.3766629,14.8336229 C17.2975086,14.9276571 17.1356114,14.9365029 17.0539657,14.9067886 C16.8925943,14.84 16.8213029,14.6969371 16.8587429,14.5305829 C17.0465143,13.6907429 16.7002514,12.9053257 16.0354514,12.6633371 L15.9842743,12.6462857 C15.4056914,12.4606171 14.7075429,12.6984 14.2888914,13.2264457 C14.2733943,13.2454857 14.25536,13.2607314 14.23408,13.2714286 C14.1509257,13.3507657 14.0081829,13.46112 13.8529143,13.4046171 C13.6866514,13.3440914 13.6471086,13.1416686 13.6321371,12.9944229 L13.6134171,12.8117943 C13.59536,12.6309486 13.5721143,12.4222629 13.5456457,12.1981257 C13.4624457,11.4656 13.3586057,10.5536229 13.3752229,9.94781714 L13.6304229,5.64258286 C13.6481371,5.01380571 13.3588343,4.47792 12.9109714,4.31490286 C12.7846171,4.26891429 12.65168,4.25456 12.5155657,4.27174857 C11.8823771,4.35318857 11.33856,5.07097143 11.2768229,5.90630857 L10.8069257,10.2590857 C10.7743543,10.6996571 10.7845714,11.3152229 10.79472,11.9102629 C10.8022629,12.3519086 10.8093943,12.7690057 10.7989486,13.10592 L10.7580114,14.4942171 C10.7433829,14.9618057 10.5941029,15.2970286 10.3135771,15.4904914 C10.1589029,15.59936 9.63837714,15.9734629 9.07545143,16.4983314 C9.01364571,16.5560914 8.95108571,16.6109714 8.88976,16.66528 C8.47424,17.03344 8.11590857,17.35152 8.08141714,18.4074057 C8.06324571,18.9033143 8.08621714,19.4074514 8.15769143,20.1479314 C8.23234286,20.9253714 8.46205714,21.4130971 8.70580571,21.92928 C9.05302857,22.6649371 9.73465143,23.7583543 9.27565714,25.0194057 C9.27197714,25.0294857 8.16523429,28.0702857 7.60089143,29.6208 L7.60089143,29.6208 Z" id="path-1"></path>
    </defs>
    <g id="Page-1" stroke="none" stroke-width="1" fill="none" fill-rule="evenodd">
        <g id="Social_icons_no_circle" transform="translate(-575.000000, -584.000000)">
            <g id="Color" transform="translate(71.000000, 182.000000)">
                <g id="Coub" transform="translate(504.000000, 402.000000)">
                    <g id="Group-6">
                        <mask id="mask-2" fill="white">
                            <use xlink:href="#path-1"></use>
                        </mask>
                        <g id="Clip-5"></g>
                        <polygon id="Fill-4" fill="#0043FF" mask="url(#mask-2)" points="-0.00182857143 32.0004571 32.0018286 32.0004571 32.0018286 -0.000457142857 -0.00182857143 -0.000457142857"></polygon>
                    </g>
                </g>
            </g>
        </g>
    </g>
</svg>