<?xml version="1.0" encoding="UTF-8"?>
<svg width="60px" height="59px" viewBox="0 0 60 59" version="1.1" xmlns="http://www.w3.org/2000/svg" xmlns:xlink="http://www.w3.org/1999/xlink">
    <!-- Generator: Sketch 42 (36781) - http://www.bohemiancoding.com/sketch -->
    <title>Github_White</title>
    <desc>Created with Sketch.</desc>
    <defs></defs>
    <g id="Page-1" stroke="none" stroke-width="1" fill="none" fill-rule="evenodd" opacity="0.5">
        <g id="Social_icons_white" transform="translate(-560.000000, -369.000000)" fill="#FFFFFF">
            <g id="White" transform="translate(60.000000, 169.000000)">
                <g id="Github" transform="translate(500.000000, 200.000000)">
                    <path d="M30.0540496,0.221187491 C13.5183471,0.221187491 0.109586777,13.6288194 0.109586777,30.1692795 C0.109586777,43.40135 8.68958678,54.6273591 20.587438,58.5874087 C22.0839669,58.864637 22.6333884,57.9377325 22.6333884,57.1467144 C22.6333884,56.4325665 22.6056198,54.0733985 22.5927273,51.5709051 C14.2621488,53.3825596 12.5042975,48.0373605 12.5042975,48.0373605 C11.1421488,44.5757267 9.17950413,43.6552693 9.17950413,43.6552693 C6.46264463,41.7965009 9.38429752,41.834688 9.38429752,41.834688 C12.3912397,42.0454608 13.9745455,44.9208982 13.9745455,44.9208982 C16.6452893,49.4993801 20.9796694,48.1757267 22.6884298,47.4104973 C22.9571901,45.4753547 23.7332231,44.1531891 24.5895868,43.4058135 C17.9385124,42.6485191 10.9467769,40.0805621 10.9467769,28.6050971 C10.9467769,25.3353905 12.1165289,22.6637829 14.0320661,20.5664692 C13.721157,19.8116545 12.6961983,16.766111 14.3221488,12.6409147 C14.3221488,12.6409147 16.8366942,11.8360105 22.5590083,15.7107591 C24.9476033,15.0471966 27.5092562,14.7144235 30.0540496,14.7030169 C32.598843,14.7144235 35.1624793,15.0471966 37.5555372,15.7107591 C43.2709091,11.8360105 45.7819835,12.6409147 45.7819835,12.6409147 C47.4119008,16.766111 46.3864463,19.8116545 46.0755372,20.5664692 C47.9955372,22.6637829 49.1573554,25.3353905 49.1573554,28.6050971 C49.1573554,40.1078385 42.1522314,42.6405841 35.4842975,43.3820085 C36.5583471,44.3113928 37.5153719,46.1339578 37.5153719,48.9280617 C37.5153719,52.9347293 37.4806612,56.1598016 37.4806612,57.1467144 C37.4806612,57.9436837 38.0196694,58.8775313 39.5375207,58.5834412 C51.4289256,54.6189282 59.9980165,43.3968866 59.9980165,30.1692795 C59.9980165,13.6288194 46.5912397,0.221187491 30.0540496,0.221187491" id="Fill-51"></path>
                    <path d="M11.4510744,43.2203334 C11.385124,43.3696101 11.1510744,43.4137485 10.9378512,43.3115856 C10.7206612,43.2138862 10.5986777,43.0110484 10.6690909,42.8617716 C10.7335537,42.7085273 10.9680992,42.6663728 11.1847934,42.7680397 C11.4024793,42.866235 11.5264463,43.0710566 11.4510744,43.2203334" id="Fill-52"></path>
                    <path d="M12.6639669,44.573247 C12.521157,44.7056619 12.2419835,44.6441659 12.052562,44.4348808 C11.8566942,44.2260917 11.82,43.9468797 11.9647934,43.8124811 C12.1120661,43.6800661 12.3828099,43.7420581 12.5791736,43.9508472 C12.7750413,44.162116 12.8132231,44.4393443 12.6639669,44.573247" id="Fill-53"></path>
                    <path d="M13.8446281,46.2981127 C13.661157,46.4255683 13.361157,46.3060477 13.1757025,46.03973 C12.9922314,45.7734123 12.9922314,45.4540295 13.1796694,45.326078 C13.3656198,45.1981265 13.661157,45.3131836 13.8490909,45.5775176 C14.0320661,45.8478027 14.0320661,46.1676815 13.8446281,46.2981127" id="Fill-54"></path>
                    <path d="M15.4621488,47.9644579 C15.2980165,48.1454746 14.9484298,48.0968728 14.692562,47.8498967 C14.4307438,47.6083758 14.3578512,47.265684 14.5224793,47.0846673 C14.688595,46.9031547 15.0401653,46.9542361 15.2980165,47.1992285 C15.5578512,47.4402535 15.6371901,47.785425 15.4621488,47.9644579" id="Fill-55"></path>
                    <path d="M17.6935537,48.9320292 C17.621157,49.166607 17.2844628,49.2732332 16.9452893,49.1735501 C16.6066116,49.0708913 16.3849587,48.7961427 16.4533884,48.5590853 C16.5238017,48.3230197 16.8619835,48.21193 17.2036364,48.3185563 C17.5418182,48.4207191 17.7639669,48.693484 17.6935537,48.9320292" id="Fill-56"></path>
                    <path d="M20.1441322,49.1115581 C20.152562,49.3585342 19.8649587,49.5633558 19.5089256,49.5673233 C19.1509091,49.5757542 18.8613223,49.375892 18.8573554,49.1328833 C18.8573554,48.8834275 19.1385124,48.6805896 19.4965289,48.6746384 C19.852562,48.6676953 20.1441322,48.8660697 20.1441322,49.1115581" id="Fill-57"></path>
                    <path d="M22.4246281,48.7232401 C22.4672727,48.9642651 22.2198347,49.2117372 21.866281,49.2772007 C21.5186777,49.3411765 21.1968595,49.1923956 21.1527273,48.9533545 C21.1095868,48.7063783 21.3614876,48.4589062 21.708595,48.3949304 C22.0626446,48.3334344 22.3795041,48.4782477 22.4246281,48.7232401" id="Fill-58"></path>
                </g>
            </g>
        </g>
    </g>
</svg>