<?xml version="1.0" encoding="UTF-8"?>
<svg width="60px" height="60px" viewBox="0 0 60 60" version="1.1" xmlns="http://www.w3.org/2000/svg" xmlns:xlink="http://www.w3.org/1999/xlink">
    <!-- Generator: Sketch 42 (36781) - http://www.bohemiancoding.com/sketch -->
    <title>Invision_White</title>
    <desc>Created with Sketch.</desc>
    <defs></defs>
    <g id="Page-1" stroke="none" stroke-width="1" fill="none" fill-rule="evenodd" opacity="0.5">
        <g id="Social_icons_white" transform="translate(-60.000000, -669.000000)" fill="#FFFFFF">
            <g id="White" transform="translate(60.000000, 169.000000)">
                <g id="Invision" transform="translate(0.000000, 500.000000)">
                    <path d="M0,30 C0,13.4314567 13.4314567,0 30,0 C46.5685433,0 60,13.4314567 60,30 C60,46.5685433 46.5685433,60 30,60 C13.4314567,60 0,46.5685433 0,30 Z M41.7136816,45.5258302 C44.5236196,45.5258302 46.7618819,43.7169975 48,39.3831035 L45.904945,38.5742227 C44.8571291,41.477774 43.9521361,42.0029314 43.238022,42.0029314 C42.5235235,42.0029314 42.14215,41.5271757 42.14215,40.5750877 C42.14215,40.1466193 42.2380701,39.6714402 42.3803162,39.0988034 L43.9046566,33.625018 C44.2856456,32.3396127 44.4284685,31.2016435 44.4284685,30.1544043 C44.4284685,26.0588688 41.9518478,23.9261377 38.9516075,23.9261377 C36.1420539,23.9261377 33.2844442,26.4696526 31.8560238,29.13696 L32.9034552,24.3680619 L24.7598635,24.3680619 L23.6168965,28.5970013 L27.4267865,28.5970013 L25.0808785,37.9679466 C23.2382142,42.0634821 19.8539094,42.1076938 19.4292854,42.0125426 C18.7318949,41.855303 18.285934,41.595031 18.285934,40.6890768 C18.285934,40.1660339 18.3810851,39.4242395 18.6192513,38.5186698 L22.1913595,24.3680619 L13.142967,24.3680619 L12,28.5970013 L15.762026,28.5970013 L13.3332693,38.4890672 C13.142967,39.2987169 13.0474314,40.1431592 13.0474314,40.8563122 C13.0474314,43.6666346 14.5713874,45.521409 17.8097938,45.521409 C20.4959393,45.521409 22.6732664,43.9048008 24.2408573,41.3293767 L23.2835792,45.1283099 L28.6172329,45.1283099 L31.6653371,32.9456966 C32.4271229,29.8499207 33.9034072,28.2865587 36.1420539,28.2865587 C37.9041761,28.2865587 38.9994714,29.3824307 38.9994714,31.1914556 C38.9994714,31.7156519 38.9516075,32.2865587 38.7613052,32.9059061 L37.1894853,38.5253977 C36.9513191,39.3350473 36.8565525,40.1452737 36.8565525,40.9064828 C36.8565525,43.5743669 38.4276034,45.5258302 41.7136816,45.5258302 Z M20.0480561,15 C18.285934,15 16.8098419,16.3809409 16.8098419,18.1899659 C16.8098419,20.0003364 18.285934,21.3814696 20.0480561,21.3814696 C21.8103705,21.3814696 23.2864626,20.0003364 23.2864626,18.1899659 C23.2864626,16.3809409 21.8103705,15 20.0480561,15 Z" id="Combined-Shape"></path>
                </g>
            </g>
        </g>
    </g>
</svg>