<?xml version="1.0" encoding="UTF-8"?>
<svg width="60px" height="60px" viewBox="0 0 60 60" version="1.1" xmlns="http://www.w3.org/2000/svg" xmlns:xlink="http://www.w3.org/1999/xlink">
    <!-- Generator: Sketch 42 (36781) - http://www.bohemiancoding.com/sketch -->
    <title>Mail.ru_Black</title>
    <desc>Created with Sketch.</desc>
    <defs></defs>
    <g id="Page-1" stroke="none" stroke-width="1" fill="none" fill-rule="evenodd" opacity="0.5">
        <g id="Social_icons_black" transform="translate(-60.000000, -1269.000000)" fill="#000000">
            <g id="Black" transform="translate(60.000000, 169.000000)">
                <g id="Mail.ru" transform="translate(0.000000, 1100.000000)">
                    <path d="M0,30 C0,13.4314567 13.4314567,0 30,0 C46.5685433,0 60,13.4314567 60,30 C60,46.5685433 46.5685433,60 30,60 C13.4314567,60 0,46.5685433 0,30 Z M29.3758984,19.9006421 C23.9395603,19.9006421 19.1565667,24.7389878 19.1565667,30.2292588 C19.1565667,35.6637046 23.9395603,40.4471712 29.3758984,40.4471712 C32.1269476,40.4471712 34.6523304,39.3486439 36.5499157,37.4652515 L36.5783014,38.480514 C36.5522811,41.5849654 40.6000846,43.6585422 43.3251135,41.5291402 C49.3405204,36.837454 49.7000728,24.7768354 43.5332755,18.3361159 C37.633777,12.1745226 27.8501661,10.9515712 20.4291931,15.3669697 C10.7288469,21.1392056 10.5339316,32.2810731 14.1914315,38.6134538 C19.6050611,47.991149 31.1935306,48.169979 35.3572424,46.3953985 C38.1130226,45.2240145 36.8872326,41.6370059 34.2341141,42.7080937 C28.9945836,44.8223566 20.1784526,42.7028897 17.0976559,35.591321 C14.2713846,29.0730139 17.1809207,22.1331788 21.7278397,18.99703 C26.0050944,16.0491732 34.0472415,15.184355 40.041359,20.4305088 C46.4726166,26.0579775 43.7423836,35.7696779 41.4601718,38.1152845 C40.875426,38.7113846 39.8208966,38.2311928 39.9150426,37.3015605 L39.9084192,23.0878851 C39.9084192,22.6876465 39.6344971,21.4230628 38.2980028,21.4230628 L38.0822714,21.424482 C37.2278612,21.424482 36.6128373,22.1133088 36.6128373,23.027802 L36.6128373,23.0202325 C34.7133597,21.116497 32.1269476,19.9006421 29.3758984,19.9006421 Z" id="Combined-Shape"></path>
                    <path d="M36.2168566,29.8356435 C36.0120063,25.8550196 33.0579992,23.4616304 29.4899144,23.4616304 L29.3555553,23.4616304 C25.2382069,23.4616304 22.9545758,26.6994947 22.9545758,30.3773376 C22.9545758,34.4961054 25.7174524,37.0971834 29.3394701,37.0971834 C33.3782847,37.0971834 36.0342418,34.1389184 36.2263185,30.6399055 L36.2168566,29.8356435 Z" id="Path"></path>
                </g>
            </g>
        </g>
    </g>
</svg>