<?xml version="1.0" encoding="utf-8"?>
<!-- Generator: Adobe Illustrator 22.1.0, SVG Export Plug-In . SVG Version: 6.00 Build 0)  -->
<svg version="1.1" id="Layer_1" xmlns="http://www.w3.org/2000/svg" xmlns:xlink="http://www.w3.org/1999/xlink" x="0px" y="0px"
	 viewBox="0 0 14 30" style="enable-background:new 0 0 14 30;" xml:space="preserve">
<style type="text/css">
	.st0{fill:#FFFFFF;}
</style>
<path class="st0" d="M13,30c-0.3,0-0.6-0.1-0.8-0.3l-12-14c-0.3-0.4-0.3-0.9,0-1.3l12-14c0.4-0.4,1-0.5,1.4-0.1s0.5,1,0.1,1.4
	L2.3,15l11.4,13.3c0.4,0.4,0.3,1-0.1,1.4C13.5,29.9,13.2,30,13,30z"/>
</svg>
