Version [6]
American Express [9]
Debit Mastercard [3]
Electron [3]
Maestro (Int) [3]
Maestro (UK Clydesdale) [3]
Maestro (UK HSBC) [3]
Maestro (UK Standard) [3]
Maestro (UK Yorkshire Bank) [3]
MAESTRO [3]
Mastercard [3]
Mastercard (Debit) [3]
ROI Visa Debit [3]
Solo (Clydesdale) [3]
Solo (HSBC) [3]
Solo (NatWest) [3]
Solo (Standard Card) [3]
Solo (Standard) [3]
Solo (Yorkshire Bank) [3]
UK Visa Debit [3]
Visa [3]
Visa Corporate Purchasing Card [3]
Visa Debit [3]
Visa (Corporate Card) [3]
Visa (Purchasing Card) [3]
Visa (Enhanced Management Information) [3]
Visa (Enhanced Management Info [3]
%AMEX [9]
%American Express [9]