<svg id="53fe70f1-f03a-42b3-a760-b3583e26b806" data-name="Capa 1" xmlns="http://www.w3.org/2000/svg" width="1637.6" height="1702" viewBox="0 0 1637.6 1702">
  <title>CMR Falabella 1979</title>
  <g>
    <path d="M649.9,297.2c-187.9,0-340.2-159.8-340.2-357s152.3-357,340.2-357c90.7,0,173.2,37.3,234.1,98.1V-457.3c-69.1-46-151.1-72.7-239-72.7C397.3-530,196.5-318.1,196.5-56.8S397.3,416.5,645,416.5c87.9,0,169.9-26.7,240-72.8V199.1C823.1,259.9,740.6,297.2,649.9,297.2Z" transform="translate(-161 595)"/>
    <polygon points="1130 990 1030 990 1030.6 791.9 986.6 990 904 989.4 875 791.9 874.9 990 754 990 754 99 875 99 942.6 627 1030 99 1130 99 1130 990"/>
    <path d="M1447.1,58.2c107.1-30.9,173.5-146.6,172.1-272.3C1617.6-354,1518.3-496,1374.3-495.6l-.2-.4H1333l.6,892H1436V269.8l.6.3c57.7,98.8,150.2,125.3,181.4,125.3l1.2-137.3C1602.7,248.3,1484.4,221.2,1447.1,58.2ZM1436-338.2c40.4,4.8,72.3,57,72.3,120.7S1476.4-101.6,1436-96.8Z" transform="translate(-161 595)"/>
    <path d="M693.2,239.4c-187.8,0-340.1-159.8-340.1-357s152.3-357,340.1-357c90.8,0,173.2,37.4,233.8,98.1V-515a426.8,426.8,0,0,0-238.6-72.7c-247.7,0-448.5,211.8-448.5,473.2S440.7,358.7,688.4,358.7c87.9,0,169.8-26.7,239.6-72.8V141.3C866.4,202.1,784,239.4,693.2,239.4Z" transform="translate(-161 595)" style="fill: #adea92"/>
    <path d="M688.4,365.9a432.4,432.4,0,0,1-177.5-37.8A454,454,0,0,1,366,225,482.6,482.6,0,0,1,268.4,72.3a506.1,506.1,0,0,1,0-373.8A481.1,481.1,0,0,1,366-454.1a452.2,452.2,0,0,1,144.9-103A430.9,430.9,0,0,1,688.4-595c86.3,0,170.4,25.6,243,73.9l2.6,2.2v159.8l-11.7-12.3c-62.1-61.9-143.5-96-229.1-96-183.6,0-332.9,157-332.9,349.8S509.6,232.2,693.2,232.2c85.6,0,167-34.1,229.1-96L935,123.9V289.8l-3.6,2.1C858.8,340.3,774.7,365.9,688.4,365.9Zm0-946.4c-243.3,0-441.3,209-441.3,466s198,466,441.3,466A421.7,421.7,0,0,0,920,282.1V158.2c-62.9,57.2-142.9,88.5-226.8,88.5-92.9,0-180.1-38-245.8-106.8S345.8-20.3,345.8-117.6,381.9-306.2,447.5-375,600.4-481.8,693.2-481.8c83.9,0,163.9,31.3,227.8,88.5V-511.2c-70.3-45.4-150.4-69.3-232.6-69.3Z" transform="translate(-161 595)"/>
    <polygon points="1173 933 1073 933 1073.6 734.9 1029.6 933 947 932.4 918 734.9 917.9 933 797 933 797 42 918 42 985.6 570 1073 42 1173 42 1173 933" style="fill: #adea92"/>
    <path d="M1196.3,345h-94.5L1086,238.5V345H951V-560h134.5l62,485.1L1227.8-560H1341V345H1226V206.3Zm45.7-14h84V-546h-86.5L1145.2,24.9,1072.3-546H965V331h107V139.5l14.3-1,28,191.5h70.4L1242,72.7Z" transform="translate(-161 595)"/>
    <path d="M1491.2.2c107.3-30.9,173.9-146.6,172.5-272.3C1662.1-412,1562.6-554,1418.1-553.6v-.4h-41l.6,892H1480V211.8h.3c57.8,99.1,150.8,125.7,182.2,125.7l1.2-137.3C1647.1,190.4,1528.6,163.2,1491.2.2ZM1479-396c40.4,4.8,72.3,57,72.3,120.7s-31.9,115.9-72.3,120.6Z" transform="translate(-161 595)" style="fill: #adea92"/>
    <path d="M1487,345H1370l-.6-906h53.2l.2.4c67.6,1.4,130.4,33.4,177.2,90.8,44.3,54.2,70.1,126.2,70.9,197.7.7,63.3-15.8,125.6-46.6,175.5S1550.2-11.3,1499.6,5.1c33.2,133.5,122.3,169.7,156.2,183.4a100.2,100.2,0,0,1,11.6,5.2l3.6,2.1V344h-9.1c-16.8.2-49-6.7-84.4-26.3a269.5,269.5,0,0,1-90.5-82.3Zm-102.4-15H1473V198.4l10.4,6.9.5.3,1.5,1,.9,1.6c50.4,86,130.5,117.6,168.7,121.2V204.3c-.9-.8-3-1.6-5.2-2.5-17.7-7.2-50.6-20.6-83.7-50.7-40.4-36.8-68.2-87.1-82.5-149.5l-1.5-6.7,6.6-1.9c99.9-28.7,168.6-137.8,167.2-265.2-1.5-132.5-97.3-274.2-237.6-274.8H1384ZM1472-146.5V-404.1l8.1,1c21.8,2.5,42,17.3,56.6,41.6s22,54.2,22,86.2-7.8,62.6-22,86.2-34.8,39.1-56.6,41.6Zm14-240.6v223.6c33-10.1,57.8-56.9,57.8-111.8S1519-377,1486-387.1Z" transform="translate(-161 595)"/>
    <ellipse cx="797.1" cy="1414.1" rx="797.1" ry="287.9"/>
    <ellipse cx="833.2" cy="1357.3" rx="797.1" ry="287.9" style="fill: #adea92"/>
    <path d="M994.2,1058.1c-213.6,0-414.6-30.1-565.9-84.7C274.6,917.9,189.9,842.9,189.9,762.3s84.7-155.6,238.4-211.1c151.3-54.7,352.3-84.8,565.9-84.8s414.7,30.1,565.9,84.8c153.8,55.5,238.5,130.5,238.5,211.1s-84.7,155.6-238.5,211.1C1408.9,1028,1207.9,1058.1,994.2,1058.1Zm0-575.8c-212.1,0-411.5,29.8-561.4,83.9-72.4,26.2-129.1,56.5-168.6,90.3S204.3,726,204.3,762.3s20.2,71.9,59.9,105.8,96.2,64.1,168.6,90.3c149.9,54.1,349.3,83.9,561.4,83.9s411.6-29.8,561.4-83.9c72.4-26.2,129.2-56.6,168.7-90.3s59.8-69.5,59.8-105.8-20.1-71.9-59.8-105.8-96.3-64.1-168.7-90.3C1405.8,512.1,1206.4,482.3,994.2,482.3Z" transform="translate(-161 595)"/>
    <path d="M1611.1,814.7c-8.3-.4-11.5,3-11.9,11-.6,12-4.4,17.3-15.8,21.2a84.8,84.8,0,0,1-11,2.9c-4.9.8-9.4-.4-12.6-4.4a28,28,0,0,1-6.7-17.2c-.3-7-.6-13.9-.7-20.8-.1-12.3,2.8-24,7.1-35.5l1.4-3.7c2.4-6.5-1.7-10.8-8.6-10.2-11.7,1.1-23.4,2.3-35.1,2.4a56.9,56.9,0,0,1-35.6-11.4c-5.8-4.3-9.9-3.6-14.3,2.1-6.1,8-12.3,15.8-18.3,23.8-8.7,11.5-14.6,24.4-19.7,37.7-3.2,8.3-6.2,16.6-9.6,24.8s-7.6,13.2-16,15-12.6-2.6-12.6-9.9a135.2,135.2,0,0,1,4.5-33.5,55.8,55.8,0,0,1,12.8-24.1c4.4-4.9,9.1-9.7,12.6-15.2,11.1-17.3,21.9-35,32.6-52.6,7.2-11.8,14.2-23.7,21.1-35.7,9.2-15.7,16.8-32.1,21.6-49.8a94.6,94.6,0,0,0,2.1-14,10,10,0,0,0-4.8-9.8c-11-6.4-22-13-33.6-18.3-9.7-4.4-18.8-1.1-26,8-5.7,7-12.1,13.2-18.4,19.5-7.8,7.9-14,17.3-20.7,26.2-9.6,13.2-15.7,28.3-22.3,43-4.8,10.7-9.2,21.7-13.4,32.7-1.8,4.7-2.5,10-3.9,14.9s-3.1,10.2-4.6,15.3c-.9,3.2-1.8,6.3-2.6,9.5-1.6,6.3-3.2,12.5-4.7,18.8-2.3,9.9-4.8,19.7-7,29.7-1.7,8-5,14.6-12,19.5-8.8,6.2-17.1,13.3-26.1,19.2-5.1,3.3-11.2,5.3-17,6.9s-9-.5-12.7-3.6-3-6-2.3-9.7c1.7-9,2.5-18.2,4.8-27,2.8-10.5,9.8-19,15.8-27.9,15.7-23.4,31.9-46.7,46.9-70.6,9.1-14.5,16.4-30,24.3-45.2,5-9.6,10.3-19.2,14.6-29,2.2-5.1,2.9-10.9,3.8-16.4.7-3.8-1-7-3.9-9.6-10.3-9.2-21.2-17.4-34.5-21.8-9.1-3-14.7-1.3-21,5.7-19.3,21.2-35.3,44.7-49.5,69.5a397.2,397.2,0,0,0-32,69.5c-6.4,18.7-12.9,37.3-18.9,56a52.7,52.7,0,0,0-2.8,17.6c.6,13.3-5.4,23-15,31-15.5,13-33.7,20.2-53.1,24.5-5,1.1-10.3.8-15.4.4s-8.8-4.1-9-10.4c-.4-8.4,4-15,12-18.5,5.7-2.5,11.7-3.1,17.8-3.3s13-.2,19.4-1a10.6,10.6,0,0,0,6.6-4.5c7.5-12.9,15-25.9,19.3-40.4a35.8,35.8,0,0,0,1.6-5.6c1.1-7.5-1-11.8-7.9-16-12.5-7.7-26.2-12.1-40.5-14.4a86.1,86.1,0,0,0-17.5-1.4c-11.9.8-19.8,7.8-24.3,18.5-3.7,8.8-9.9,14.5-19.2,16.5-6,1.3-11-1.2-14.7-5.4s-5.8-8.2-8.4-12.5-5.7-7.8-10.4-9.8l-4-1.6c-5.3-2.6-7.4-7-4.8-12.3a69.9,69.9,0,0,1,8.9-13.9,56.7,56.7,0,0,0,9.2-15.5c2.9-7.7,7.7-14.6,11.2-22,4.3-9.2,7.8-18.7,12.2-27.8s9.4-19.3,11.7-29.8.8-19-9.5-25.3c-2.4-1.4-4.7-3-7.2-4.3-7.5-3.9-15-7.7-22.7-11.4a28.7,28.7,0,0,0-5.9-1.7c-4.4-1-8,.4-11.2,3.5-10.7,10.7-19.4,23-27.9,35.4-12.6,18.3-24.5,37-34.2,57-10.5,21.5-19,43.6-23.8,67.2a38.8,38.8,0,0,1-4.1,10.9c-7.3,12.9-10,27.2-12.2,41.6-1.3,8.8-1.5,17.8-2.2,26.7-.3,3.4-1.6,5.3-5,5.6a68.6,68.6,0,0,1-11.1.2c-4-.4-5.6-2-5.3-6.1.7-8.4,1.2-16.9,2.7-25.1s4.5-17.6,6.9-26.3.5-10.5-7.6-10.2c-10,.5-20,1.4-29.9,2-12.9.8-24.8-2-35.3-9.9a23.7,23.7,0,0,0-9-4.1c-4.9-1-9,1.8-12,5.2a143.3,143.3,0,0,0-13.9,17.4c-7.3,11.6-14.4,23.4-20.8,35.5-4.8,9.4-8.6,19.4-12.5,29.3s-10.4,8.5-16.5,5.8a5.9,5.9,0,0,1-3-4.2c-.2-11.9-1.4-24,3.7-35a119.6,119.6,0,0,1,12.6-20.9c18.6-25,36.4-50.6,51.7-77.8,7.8-14,14.8-28.5,22.5-42.7,2-3.7,5-6.8,7.1-10.4,4.4-7.7,8.8-15.4,12.8-23.3s2.4-15.4-5-21c-12-9.2-25.1-16.7-39.7-21.2-5.6-1.7-10.5.3-14.3,4.4s-9.7,11-14.5,16.4-12.3,12.7-17.2,19.9c-8.3,12.3-15.7,25.2-23.3,38-13.4,22.9-23.1,47.4-30.5,72.8-4.6,15.6-9.2,31.2-14,46.8-3.3,10.6-3.8,21.6-4.8,32.5-.4,4.7,0,9.6-4,13.2s-10.8,3.2-14.4,1-4.4-5.6-3.3-10.7a380.4,380.4,0,0,0,8.2-46.1c.2-2.2.9-4.2,1.1-6.4.5-4.1-.4-5.3-4.5-6.4a27.6,27.6,0,0,0-13.4.2,119.2,119.2,0,0,1-27.3,2.6c-11.7-.3-22.5-3.1-31.5-11-6.2-5.4-12.4-2.8-16.8,2.4-2.5,2.8-4.3,6.5-8.6,7-6.9.9-11.7-2.8-11.2-8.9s1.2-12.9,2.1-19.3c.7-4.4-.6-6.4-5-6.3s-6.4.7-9.6.7c-5.9.1-8.7-2.2-9.1-8.1-.9-11.7,2.9-22.2,10.1-31.3s17.5-16.1,29.9-17.5a47.5,47.5,0,0,1,16.8,1c14.1,3.8,24.3-2,33-12,5.1-5.9,10.3-11.6,15.1-17.6a79.2,79.2,0,0,0,6.5-9.8,7.4,7.4,0,0,0-.5-8.2c-1.9-2.4-4.5-1.5-6.9-1-10.4,2.6-21,4.8-31.6,1.3-5-1.7-9.6-4.3-14.5-6.1-13.2-5-26.3-10-39.5-14.5-29.1-9.9-58.2-20-87.5-29-13.5-4.2-27.6-6.7-41.6-9a29.1,29.1,0,0,0-26.1,8.5c-16.7,16.8-32,34.8-43.6,55.6-4.1,7.2-8.4,14.4-9.7,22.9-1,6.2.5,11.9,3,17.4,7.6,17,18.1,32.1,29.3,46.8a121.4,121.4,0,0,0,7.7,9.7c4.8,5.1,9.9,6.3,15.9,2.7a228,228,0,0,0,20.9-14.4c8.8-6.7,17.6-13.6,26-21,6-5.2,7.3-12.9,3.8-20a140.2,140.2,0,0,0-21.5-30.9c-3.9-4.4-7.4-3.9-10.8,1a31.3,31.3,0,0,0-2.1,3.4c-4.3,7.7-13,8.5-18.3,1.4a106.2,106.2,0,0,1-8.6-13.5c-4-7.4.2-13.9,8.7-14.2a151.3,151.3,0,0,1,45.8,6.3c18,5,35.9,10,53.8,15.5,7.4,2.2,14.5,5.4,21.6,8.4s8.3,6.7,4.2,13a42,42,0,0,1-10.3,10.3c-7.3,5.4-14.6,10.8-20.5,17.9s-9.4,13.2-10.8,21.2-6.2,11.5-13.5,12.3-15.6,1-23.4,1.6a90,90,0,0,0-13.7,1.7c-7.2,1.6-9.2,4.7-10.3,12-1.8,11.5,1.6,22,4.7,32.7s5.8,11.2,15.2,6.7l2.2-1.2c8.4-4.2,17.2,1.1,17.1,10.6,0,4.2-1.2,8.4-1.8,12.5-1.8,11-3.3,22-5.5,32.8s-5.5,21.6-11.2,31.4c-4.2,7.2-10.8,10-19,10.9-10.4,1-16.7-3.5-20.4-12.7s-8-19.7-12-29.5c-1.5-3.8-1.8-7.6,1.1-10.8s7-3.5,11.2-2.8c2,.3,4.1.9,6,.7,6.2-.5,9.8-5.3,8.6-11.9a131,131,0,0,0-4.1-16.1c-2.4-7.3-5.3-14.5-7.8-21.8-.7-1.9-1-4-1.7-5.9-3.6-9.7-12.8-12.8-21.2-6.8s-17.8,13-26.7,19.5a43.5,43.5,0,0,1-5.7,3.8c-12.6,6.8-17.5,23.9-13,36.8,6.7,19.5,13.5,38.9,20.9,58.2,3,8,7.3,15.4,11.5,22.9,1.3,2.4,4.2,4,6.3,6h5.6c4.8-1.2,9.6-2.1,14.3-3.8,10.6-3.7,21.1-7.5,31.6-11.7q22.4-9,44.4-18.7c13-5.8,24.2-13.9,31-26.9,4.4-8.5,6.6-17.7,8.1-27.1s2.8-19.9,4.6-29.8c1.2-7.2,5.7-11.5,12.9-12.8,4.5-.8,9-2.3,13.6-2.5,7.2-.4,11.3,5.4,9.5,12.4a27.6,27.6,0,0,1-4.9,10.4,55.9,55.9,0,0,0-7.1,12.6c-2.6,6-4.7,12.1-6.7,18.3-3.7,10.9-.4,19,8,26.2,6.6,5.6,13.9,10.6,20.5,16.3,9.3,7.8,20.7,4.8,26.7-4.2,1.2-1.8,2.2-3.5,3.4-5.2,7.6-11.1,18.7-12.1,28.3-2.8a84,84,0,0,0,9.6,8.3c8.7,6.2,17.8,5.9,26.4-.4,3.8-2.8,7.2-6.1,11.3-8.1,13.9-6.9,27.3-5.3,40,3.7a122.9,122.9,0,0,0,11.3,7.5,26.8,26.8,0,0,0,27.2-.2c12.2-7,23.7-5.3,35.2,1.3a45.6,45.6,0,0,0,8.6,4.2c8.3,2.6,16.6-.4,22.2-7.7,2.7-3.6,5.1-7.5,7.8-11.2,6.6-9,17-9.5,25.2-2a164.3,164.3,0,0,0,17,14c6.4,4.6,13.3,4,19.8.1,4.7-2.8,9-6.1,13.8-8.9,12.3-7.2,25.2-7.1,38.1-1.8,9.6,4,19,8.7,28.4,12.9,6.2,2.8,12.6,4.7,19.5,4.6s13.7-2.9,18.4-8.6c8.1-9.8,15.8-19.9,21.6-31.2,2-3.9,3.6-7.9,5.3-11.9,2.5-5.7,6.2-7.8,11.6-6.7,3,.6,3.9,2.2,3.8,5-.4,8.2.1,16.3,3,24a21.4,21.4,0,0,0,8.9,11.2c6.8,4.3,13.8,8.6,21,12.4,20.2,10.9,40.3,10,59.9-1.9,6.4-3.8,12.5-8,19-11.5,14.8-8.1,29.5-6.5,43.6,1.8a153.8,153.8,0,0,1,14.9,10.5c12.1,9.4,23.6,10,36.5,1.5,10.6-7,21-14.3,31.9-20.8s22.6-7.2,33.6.1,19.1,13.4,28.7,19.9,20.6,6.8,30.7-1.4c5.3-4.2,10.9-7.7,17.8-8.8a23.4,23.4,0,0,1,14.4,2.5c5.3,2.6,10.5,5.7,15.8,8.4,8.7,4.5,13.5,3.8,20.5-3.3,5.2-5.4,10.4-10.9,15.5-16.5s17.1-6.6,23.6-1.6a279.8,279.8,0,0,0,25.4,17.6c15.3,9.1,30.2,7,44.3-3.1,7.8-5.6,13.6-12.9,19.8-19.9,2.8-3.1,5.6-6.1,8.3-9.2,5-5.6,7.5-12.3,8.7-19.5l.6-1v-2.5C1618.7,818.1,1616.1,815,1611.1,814.7ZM1436,681.6c1.5-2.7,3.5-5.2,4.6-8.1s3.8-5.3,7.2-4.9a3.4,3.4,0,0,1,1.9,5.8c-4.7,4.7-5.8,11-8.2,16.7-1.3,3-4.2,5.3-6.4,7.8a2.4,2.4,0,0,1-2.2-.3,48.2,48.2,0,0,1-3.6-4.3l6.7-12.6Zm-123,8.3c3.4-6.6,6.9-13.3,10.5-19.9,2.7-5,7.7-7,12.5-9a2.7,2.7,0,0,1,2.2,1.1c1,2.5,1.9,4.9.2,7.6-6.1,10-12,20.2-18,30.3a37.4,37.4,0,0,1-4,5.8c-1.2,1.3-3.3,2.9-4.6,2.6s-4.1-2.8-4.3-7.1C1309,698.2,1310.9,694,1313,689.9ZM1152.2,788c3.3-.1,6.7,3.4,6.7,6.8s-3.6,7.4-8,7.4-6.7-2.5-6.8-5.8a8.2,8.2,0,0,1,7.9-8.4ZM809.4,695c6-12.6,14-24,22.2-35.3,1.8-2.4,4-3.5,6.9-3a5.8,5.8,0,0,1,4.7,4.4c.7,2.5.3,4.5-2,5.9a18.1,18.1,0,0,0-7.8,10.4c-3.3,10.4-8.9,19.8-14.8,28.8-2.1,3.2-5.8,5.3-9,7.7-.6.4-2.6-.1-3.1-.8s-1.4-3.1-2.3-5.4c1.6-4,3.2-8.5,5.2-12.7ZM649.2,811c-5.8,12.6-12.8,24.4-22.4,34.6-1.9,2-4.7,3-6,3.8-6.7-.2-11-5.7-8.5-10.3,4.2-7.9,9.1-15.3,13.7-23,1.9-3.1,3.8-6.4,5.9-9.4a25.1,25.1,0,0,1,5.2-5.6c3.3-2.4,6.9-2,10,.6s4,5.1,2,9.3Zm223.6,0c-4.1,11.1-10.2,20.9-17.5,30.1-2,2.6-4.2,5.1-6.4,7.6s-5,3.8-8.3,2.6-3.4-4.4-3.8-7.5,1.7-7.3,3.2-10.6a78.7,78.7,0,0,1,19.8-27c3.8-3.2,7.1-4,10.4-2.1s3.8,3.5,2.6,6.9ZM1029,821.7c-2.4,9-5.7,17.5-12.7,23.9-3.6,3.3-7.4,6.3-12.8,6s-11.3-5.7-11-11.6c.6-8.8,1.6-17.7,5.5-25.8a92.7,92.7,0,0,1,10.3-16.7,14.5,14.5,0,0,1,16.4-5.1c5.6,1.6,7.9,5.7,7.9,15.4C1031.7,811.2,1030.4,816.4,1029,821.7Zm4.5-105.7a17.1,17.1,0,0,1-4.6,3.9c-2.6,1.4-5.5-.6-5.5-4.4.5-1.5,1.1-3.8,2-6,6-15,14.1-28.8,23.3-42.1a85.5,85.5,0,0,1,7.6-9.3c2.4-2.6,5-2.3,7.8.5s2.6,4.5.5,7.5c-3.4,4.9-7.1,9.9-9.5,15.4a138.9,138.9,0,0,1-16,26.7c-2,2.6-3.6,5.3-5.7,7.8Zm464.4,94a50.6,50.6,0,0,1-5.1,9.1c-2.1,3.3-4.1,6.6-4.1,10.7s-5,8-8.2,8.4a4.9,4.9,0,0,1-5.7-4.2,4.1,4.1,0,0,1,.1-1.9,37.1,37.1,0,0,1,2.7-6.5c3.1-6.3,6.3-12.5,9.4-18.8,1.4-2.7,3.5-4.2,5.8-4.4,4.3,0,6.7,3.6,5.1,7.6Z" transform="translate(-161 595)"/>
  </g>
</svg>
