<svg width="17" height="3" viewBox="0 0 17 3" fill="none" xmlns="http://www.w3.org/2000/svg">
<path d="M16.625 1.5C16.625 2.20312 16.0391 2.75 15.375 2.75H1.625C0.921875 2.75 0.375 2.20312 0.375 1.5C0.375 0.835938 0.921875 0.25 1.625 0.25H15.375C16.0391 0.25 16.625 0.835938 16.625 1.5Z" fill="#1B1B1B"/>
</svg>
