<svg width="21" height="21" viewBox="0 0 21 21" fill="none" xmlns="http://www.w3.org/2000/svg">
<path d="M10.5 8L15.9688 2.53125C17.1016 1.39844 18.8594 1.39844 19.9922 2.53125C20.2656 2.80469 20.2656 3.23438 19.9922 3.50781L8.9375 14.5625C9.13281 15.0703 9.25 15.5781 9.25 16.125C9.25 18.5469 7.25781 20.5 4.875 20.5C2.45312 20.5 0.5 18.5469 0.5 16.125C0.5 13.7422 2.45312 11.75 4.875 11.75C5.42188 11.75 5.92969 11.8672 6.4375 12.0625L8 10.5L6.4375 8.97656C5.92969 9.17188 5.42188 9.25 4.875 9.25C2.45312 9.25 0.5 7.29688 0.5 4.875C0.5 2.49219 2.45312 0.5 4.875 0.5C7.25781 0.5 9.25 2.49219 9.25 4.875C9.25 5.46094 9.13281 5.96875 8.9375 6.47656L10.5 8ZM11.3594 13.8984L13.8594 11.3984L19.9922 17.5312C20.2656 17.8047 20.2656 18.2344 19.9922 18.5078C18.8594 19.6406 17.1016 19.6406 15.9688 18.5078L11.3594 13.8984ZM3 4.875C3 5.57812 3.35156 6.16406 3.9375 6.51562C4.48438 6.86719 5.22656 6.86719 5.8125 6.51562C6.35938 6.16406 6.75 5.57812 6.75 4.875C6.75 4.21094 6.35938 3.625 5.8125 3.27344C5.22656 2.92188 4.48438 2.92188 3.9375 3.27344C3.35156 3.625 3 4.21094 3 4.875ZM4.875 14.25C4.17188 14.25 3.58594 14.6406 3.23438 15.1875C2.88281 15.7734 2.88281 16.5156 3.23438 17.0625C3.58594 17.6484 4.17188 18 4.875 18C5.53906 18 6.125 17.6484 6.47656 17.0625C6.82812 16.5156 6.82812 15.7734 6.47656 15.1875C6.125 14.6406 5.53906 14.25 4.875 14.25Z" fill="#1B1B1B"/>
</svg>
