<svg width="19" height="15" viewBox="0 0 19 15" fill="none" xmlns="http://www.w3.org/2000/svg">
<path d="M0.75 1.25C0.75 0.585938 1.29688 0 2 0H17C17.6641 0 18.25 0.585938 18.25 1.25C18.25 1.95312 17.6641 2.5 17 2.5H2C1.29688 2.5 0.75 1.95312 0.75 1.25ZM0.75 7.5C0.75 6.83594 1.29688 6.25 2 6.25H17C17.6641 6.25 18.25 6.83594 18.25 7.5C18.25 8.20312 17.6641 8.75 17 8.75H2C1.29688 8.75 0.75 8.20312 0.75 7.5ZM18.25 13.75C18.25 14.4531 17.6641 15 17 15H2C1.29688 15 0.75 14.4531 0.75 13.75C0.75 13.0859 1.29688 12.5 2 12.5H17C17.6641 12.5 18.25 13.0859 18.25 13.75Z" fill="#1B1B1B"/>
</svg>
