<svg width="21" height="21" viewBox="0 0 21 21" fill="none" xmlns="http://www.w3.org/2000/svg">
<path d="M10.5 0.5C14.0547 0.5 17.3359 2.41406 19.1328 5.5C20.9297 8.625 20.9297 12.4141 19.1328 15.5C17.3359 18.625 14.0547 20.5 10.5 20.5C6.90625 20.5 3.625 18.625 1.82812 15.5C0.03125 12.4141 0.03125 8.625 1.82812 5.5C3.625 2.41406 6.90625 0.5 10.5 0.5ZM9.5625 5.1875V10.5C9.5625 10.8125 9.71875 11.125 9.95312 11.2812L13.7031 13.7812C14.1328 14.0938 14.7188 13.9766 15.0312 13.5469C15.3047 13.1172 15.1875 12.5312 14.7578 12.2188L11.4375 10.0312V5.1875C11.4375 4.67969 11.0078 4.25 10.5 4.25C9.95312 4.25 9.5625 4.67969 9.5625 5.1875Z" fill="#1B1B1B"/>
</svg>
