<svg width="21" height="21" viewBox="0 0 21 21" fill="none" xmlns="http://www.w3.org/2000/svg">
<path d="M18 10.5C18 6.35938 14.6406 3 10.5 3V18C14.6406 18 18 14.6406 18 10.5ZM0.5 10.5C0.5 6.94531 2.375 3.66406 5.5 1.86719C8.58594 0.0703125 12.375 0.0703125 15.5 1.86719C18.5859 3.66406 20.5 6.94531 20.5 10.5C20.5 14.0938 18.5859 17.375 15.5 19.1719C12.375 20.9688 8.58594 20.9688 5.5 19.1719C2.375 17.375 0.5 14.0938 0.5 10.5Z" fill="#1B1B1B"/>
</svg>
