<svg width="21" height="19" viewBox="0 0 21 19" fill="none" xmlns="http://www.w3.org/2000/svg">
<path d="M10.5 0.75C11.0469 0.75 11.5547 1.0625 11.8281 1.53125L20.2656 15.9062C20.5391 16.4141 20.5391 17 20.2656 17.4688C19.9922 17.9766 19.4844 18.25 18.9375 18.25H2.0625C1.47656 18.25 0.96875 17.9766 0.695312 17.4688C0.421875 17 0.421875 16.4141 0.695312 15.9062L9.13281 1.53125C9.40625 1.0625 9.91406 0.75 10.5 0.75ZM10.5 5.75C9.95312 5.75 9.5625 6.17969 9.5625 6.6875V11.0625C9.5625 11.6094 9.95312 12 10.5 12C11.0078 12 11.4375 11.6094 11.4375 11.0625V6.6875C11.4375 6.17969 11.0078 5.75 10.5 5.75ZM11.75 14.5C11.75 13.8359 11.1641 13.25 10.5 13.25C9.79688 13.25 9.25 13.8359 9.25 14.5C9.25 15.2031 9.79688 15.75 10.5 15.75C11.1641 15.75 11.75 15.2031 11.75 14.5Z" fill="#1B1B1B"/>
</svg>
