<svg width="13" height="9" viewBox="0 0 13 9" fill="none" xmlns="http://www.w3.org/2000/svg">
<path d="M7.35938 0.890625L12.3594 5.89062C12.7109 6.24219 12.8281 6.78906 12.6328 7.25781C12.4375 7.72656 11.9688 8.03906 11.5 8.03906H1.5C0.992188 8.03906 0.523438 7.72656 0.328125 7.25781C0.132812 6.78906 0.25 6.24219 0.601562 5.89062L5.60156 0.890625C6.07031 0.382812 6.89062 0.382812 7.35938 0.890625Z" fill="#1B1B1B"/>
</svg>
