<svg width="23" height="21" viewBox="0 0 23 21" fill="none" xmlns="http://www.w3.org/2000/svg">
<path d="M14 9.25H12.1641C10.4062 9.25 9 10.6953 9 12.4531C9 13.3125 9.39062 13.7812 9.74219 14.0156C10.0156 14.2109 10.25 14.4844 10.25 14.8359C10.25 15.2266 9.9375 15.5391 9.54688 15.5391H9.42969C9.35156 15.5391 9.23438 15.5 9.15625 15.4609C8.45312 15.1484 5.25 13.5469 5.25 9.875C5.25 6.78906 7.75 4.25 10.875 4.25H14V1.86719C14 1.125 14.5859 0.5 15.3281 0.5C15.6797 0.5 15.9922 0.65625 16.2266 0.851562L21.6562 5.73438C21.9297 6.00781 22.125 6.35938 22.125 6.75C22.125 7.17969 21.9297 7.53125 21.6562 7.80469L16.2266 12.6875C15.9922 12.9219 15.6797 13 15.3672 13H15.25C14.5469 13 14 12.4531 14 11.75V9.25ZM3.375 4.25C3.02344 4.25 2.75 4.5625 2.75 4.875V17.375C2.75 17.7266 3.02344 18 3.375 18H15.875C16.1875 18 16.5 17.7266 16.5 17.375V15.5C16.5 14.8359 17.0469 14.25 17.75 14.25C18.4141 14.25 19 14.8359 19 15.5V17.375C19 19.1328 17.5938 20.5 15.875 20.5H3.375C1.61719 20.5 0.25 19.1328 0.25 17.375V4.875C0.25 3.15625 1.61719 1.75 3.375 1.75H5.25C5.91406 1.75 6.5 2.33594 6.5 3C6.5 3.70312 5.91406 4.25 5.25 4.25H3.375Z" fill="#1B1B1B"/>
</svg>
