<svg width="13" height="9" viewBox="0 0 13 9" fill="none" xmlns="http://www.w3.org/2000/svg">
<path d="M7.35938 1.14062L12.3594 6.14062C12.7109 6.49219 12.8281 7.03906 12.6328 7.50781C12.4375 7.97656 11.9688 8.28906 11.5 8.28906H1.5C0.992188 8.28906 0.523438 7.97656 0.328125 7.50781C0.132812 7.03906 0.25 6.49219 0.601562 6.14062L5.60156 1.14062C6.07031 0.632812 6.89062 0.632812 7.35938 1.14062Z" fill="#1B1B1B"/>
</svg>
