// Jest Snapshot v1, https://goo.gl/fbAQLP

exports[`br-tag deve renderizar a tag com as propriedades padrão 1`] = `
<br-tag color="" custom-id="br-tag-0" density="small" icon-name="" label="" shape="default">
  <template shadowrootmode="open">
    <span class="br-tag small" id="br-tag-0">
      <span></span>
      <slot></slot>
    </span>
  </template>
</br-tag>
`;
