{
  "version": "0.2",
  "language": "en, pt-br,lorem-ipsum",
  "ignorePaths": ["node_modules/**", "dist/**", "build/**", "**/coverage/**"],
  "import": ["@cspell/dict-pt-br/cspell-ext.json", "@cspell/dict-lorem-ipsum/cspell-ext.json"],
  "dictionaries": [
    "en_US",
    "pt-br",
    "lorem-ipsum",
    "companies",
    "softwareTerms",
    "misc",
    "typescript",
    "node",
    "html",
    "css"
  ],
  "languageSettings": [
    {
      "languageId": "markdown",
      "ignoreRegExpList": ["/^```[\\s\\S]*?^```/m"]
    }
  ],
  "words": [
    "checkgroup",
    "chromecast",
    "desselecionado",
    "desselecionar",
    "frontmatter",
    "gitlab",
    "govbr",
    "iconify",
    "NPMJS",
    "onbr",
    "Rawline",
    "resetado",
    "SERPRO",
    "webcomponents"
  ]
}
