{
  "name": "angular",
  "$schema": "../../node_modules/nx/schemas/project-schema.json",
  "sourceRoot": "packages/angular/src",
  "projectType": "library",
  "tags": ["wrapper", "angular", "govbr-ds", "webcomponents"],
  "implicitDependencies": ["webcomponents"],
  "targets": {
    "build": {
      "executor": "@nx/angular:package",
      "outputs": ["{workspaceRoot}/dist/angular"],
      "options": {
        "project": "{projectRoot}/ng-package.json"
      },
      "configurations": {
        "production": {
          "tsConfig": "{projectRoot}/tsconfig.lib.prod.json"
        },
        "development": {
          "tsConfig": "{projectRoot}/tsconfig.lib.json"
        }
      },
      "defaultConfiguration": "production",
      "dependsOn": [{ "dependencies": true, "target": "build" }]
    }
  }
}
