<svg xmlns="http://www.w3.org/2000/svg" xmlns:xlink="http://www.w3.org/1999/xlink" viewBox="0 0 73.31 73.31">
  <defs>
    <clipPath id="clip-path" transform="translate(0)">
      <rect width="73.31" height="73.31" style="fill: none"/>
    </clipPath>
  </defs>
  <g id="Layer_2" data-name="Layer 2">
    <g id="Layer_1-2" data-name="Layer 1">
      <g style="clip-path: url(#clip-path)">
        <path d="M36.66,73.31A36.66,36.66,0,1,0,0,36.65,36.65,36.65,0,0,0,36.66,73.31" transform="translate(0)" style="fill: #fff"/>
        <path d="M36.66,73.31A36.66,36.66,0,1,0,0,36.65,36.65,36.65,0,0,0,36.66,73.31" transform="translate(0)" style="fill: #004c7a"/>
        <path d="M46.94,55.84h-11a3.27,3.27,0,0,1-3.25-3.27V30.94H50.19V52.57A3.27,3.27,0,0,1,46.94,55.84Z" transform="translate(0)" style="fill: none;stroke: #fff;stroke-linecap: round;stroke-linejoin: round;stroke-width: 1.2860000133514404px"/>
        <path d="M49.62,20.59H33.15a1.63,1.63,0,0,0-1.62,1.64v8.71H51.24V22.22A1.63,1.63,0,0,0,49.62,20.59Z" transform="translate(0)" style="fill: none;stroke: #fff;stroke-linecap: round;stroke-linejoin: round;stroke-width: 1.2860000133514404px"/>
      </g>
      <line x1="34.81" y1="38.84" x2="34.81" y2="32.85" style="fill: none;stroke: #fff;stroke-linecap: round;stroke-linejoin: round;stroke-width: 1.2860000133514404px"/>
      <line x1="34.81" y1="42.38" x2="34.81" y2="41.29" style="fill: none;stroke: #fff;stroke-linecap: round;stroke-linejoin: round;stroke-width: 1.2860000133514404px"/>
      <line x1="33.76" y1="28.76" x2="33.76" y2="22.77" style="fill: none;stroke: #fff;stroke-linecap: round;stroke-linejoin: round;stroke-width: 1.2860000133514404px"/>
      <line x1="38.76" y1="28.76" x2="38.76" y2="22.77" style="fill: none;stroke: #fff;stroke-linecap: round;stroke-linejoin: round;stroke-width: 1.2860000133514404px"/>
      <line x1="43.76" y1="28.76" x2="43.76" y2="22.77" style="fill: none;stroke: #fff;stroke-linecap: round;stroke-linejoin: round;stroke-width: 1.2860000133514404px"/>
      <line x1="48.76" y1="28.76" x2="48.76" y2="22.77" style="fill: none;stroke: #fff;stroke-linecap: round;stroke-linejoin: round;stroke-width: 1.2860000133514404px"/>
      <g style="clip-path: url(#clip-path)">
        <path d="M21.37,62.67h0a2.14,2.14,0,0,0,2.79-1.77l.36-5.34-2.32-.62-2.35,4.8a2.14,2.14,0,0,0,1.52,2.93M34.93,7.44l2.32.62L24.52,55.56l-2.32-.62Z" transform="translate(0)" style="fill: #004c7a"/>
        <path d="M21.37,62.67h0a2.14,2.14,0,0,0,2.79-1.77l.36-5.34-2.32-.62-2.35,4.8A2.14,2.14,0,0,0,21.37,62.67ZM34.93,7.44l2.32.62L24.52,55.56l-2.32-.62Z" transform="translate(0)" style="fill: none;stroke: #fff;stroke-linecap: round;stroke-linejoin: round;stroke-width: 1.2860000133514404px"/>
      </g>
    </g>
  </g>
</svg>
