<svg xmlns="http://www.w3.org/2000/svg" xmlns:xlink="http://www.w3.org/1999/xlink" viewBox="0 0 55.5 55.5">
  <defs>
    <clipPath id="clip-path">
      <rect width="55.5" height="55.5" style="fill: none"/>
    </clipPath>
  </defs>
  <g id="Layer_2" data-name="Layer 2">
    <g id="Layer_1-2" data-name="Layer 1">
      <g style="clip-path: url(#clip-path)">
        <circle cx="27.75" cy="27.75" r="27.25" style="fill: none;stroke: #068d9d"/>
      </g>
      <polyline points="7.41 41.73 17.33 41.73 17.33 12.79 36.37 12.79 36.37 41.22 47.88 41.22" style="fill: none;stroke: #068d9d"/>
      <text transform="translate(17.02 18.6)" style="font-size: 4px;fill: #068d9d;font-family: MyriadPro-Regular, Myriad Pro;letter-spacing: 0.02001953125em">D<tspan x="2.74" y="0" style="letter-spacing: 0.0400390625em">R</tspan><tspan x="5.06" y="0" style="letter-spacing: -0.0001220703125em">. </tspan><tspan x="6.73" y="0" style="letter-spacing: 0.02197265625em">O</tspan><tspan x="9.58" y="0" style="letter-spacing: -0.0001220703125em">FF</tspan><tspan x="13.47" y="0">I</tspan><tspan x="14.51" y="0" style="letter-spacing: 0.0078125em">C</tspan><tspan x="16.86" y="0" style="letter-spacing: 0.000244140625em">E</tspan></text>
      <g style="clip-path: url(#clip-path)">
        <circle cx="33.15" cy="28.44" r="1.41" style="fill: none;stroke: #068d9d"/>
      </g>
    </g>
  </g>
</svg>
