<svg xmlns="http://www.w3.org/2000/svg" xmlns:xlink="http://www.w3.org/1999/xlink" viewBox="0 0 73.31 73.31">
  <defs>
    <clipPath id="clip-path" transform="translate(0)">
      <rect width="73.31" height="73.31" style="fill: none"/>
    </clipPath>
  </defs>
  <g id="Layer_2" data-name="Layer 2">
    <g id="Layer_1-2" data-name="Layer 1">
      <g style="clip-path: url(#clip-path)">
        <path d="M36.66,73.31A36.66,36.66,0,1,0,0,36.65,36.65,36.65,0,0,0,36.66,73.31" transform="translate(0)" style="fill: #004c7a"/>
        <path d="M51.89,29.65,40.23,37.44M34.1,41.53,29.79,44.4m11.05-4.92a3.68,3.68,0,1,1-3.68-3.68A3.68,3.68,0,0,1,40.84,39.48ZM27,25.93a16,16,0,0,1,21.82,1.42m3.06-12.44,4.91,4.92m-6.13,1.22,3.68-3.68M21.2,14.91l-4.91,4.92m6.14,1.22-3.68-3.68m14.73-6.14h7.36m-3.68,4.91V11.23M18,27.28a22.11,22.11,0,1,1-.53,21M10.27,44.4H23.66M8.18,30.88H23.66M3.27,38.25H18.75" transform="translate(0)" style="fill: none;stroke: #fff;stroke-linecap: round;stroke-linejoin: round;stroke-width: 2.1440000534057617px"/>
      </g>
    </g>
  </g>
</svg>
