<svg xmlns="http://www.w3.org/2000/svg" xmlns:xlink="http://www.w3.org/1999/xlink" viewBox="0 0 55.5 55.5">
  <defs>
    <clipPath id="clip-path">
      <rect width="55.5" height="55.5" style="fill: none"/>
    </clipPath>
  </defs>
  <g id="Layer_2" data-name="Layer 2">
    <g id="Layer_1-2" data-name="Layer 1">
      <g style="clip-path: url(#clip-path)">
        <path d="M17.43,44.48a.35.35,0,0,1-.34-.34V39.55a9.47,9.47,0,0,0-.49-3l-.11-.33a.33.33,0,0,1,0-.26.34.34,0,0,1,.2-.17l.1,0a.35.35,0,0,1,.33.24l.1.33a10.23,10.23,0,0,1,.53,3.24v4.59a.34.34,0,0,1-.34.34" style="fill: #068d9d"/>
        <path d="M17.43,44.48a.35.35,0,0,1-.34-.34V39.55a9.47,9.47,0,0,0-.49-3l-.11-.33a.33.33,0,0,1,0-.26.34.34,0,0,1,.2-.17l.1,0a.35.35,0,0,1,.33.24l.1.33a10.23,10.23,0,0,1,.53,3.24v4.59A.34.34,0,0,1,17.43,44.48Z" style="fill: none;stroke: #068d9d;stroke-miterlimit: 10;stroke-width: 0.44999998807907104px"/>
        <path d="M21.77,43.85a.34.34,0,0,1-.34-.33V42H19.91a.34.34,0,0,1-.34-.34.34.34,0,0,1,.34-.34h1.52V39.8a.34.34,0,0,1,.68,0v1.52h1.52a.34.34,0,0,1,.34.34.35.35,0,0,1-.34.34H22.11v1.52a.34.34,0,0,1-.34.33" style="fill: #068d9d"/>
        <path d="M21.77,43.85a.34.34,0,0,1-.34-.33V42H19.91a.34.34,0,0,1-.34-.34.34.34,0,0,1,.34-.34h1.52V39.8a.34.34,0,0,1,.68,0v1.52h1.52a.34.34,0,0,1,.34.34.35.35,0,0,1-.34.34H22.11v1.52A.34.34,0,0,1,21.77,43.85Z" style="fill: none;stroke: #068d9d;stroke-miterlimit: 10;stroke-width: 0.44999998807907104px"/>
        <path d="M26.73,43.39a.5.5,0,1,1,.49-.49.49.49,0,0,1-.49.49" style="fill: #068d9d"/>
        <circle cx="26.73" cy="42.9" r="0.49" style="fill: none;stroke: #068d9d;stroke-miterlimit: 10;stroke-width: 0.44999998807907104px"/>
        <path d="M25.55,15a6,6,0,0,1-1.71,2.73A4.15,4.15,0,0,0,23,18.81a3,3,0,0,1-.83,1,1.12,1.12,0,0,0-.32.91c0,1.22,1.37,2.06,1.38,2.07a.36.36,0,0,1,.16.22A5,5,0,0,0,25,25.71h0l.05,0h0a3.74,3.74,0,0,0,2.24.69,3.79,3.79,0,0,0,3.22-1.71A5.52,5.52,0,0,0,31.35,23a.36.36,0,0,1,.16-.22,2.89,2.89,0,0,0,1.38-2.07,1.05,1.05,0,0,0-.35-.93,2.69,2.69,0,0,1-.78-.76,8.88,8.88,0,0,0-2.91-2,11.63,11.63,0,0,1-3.08-2.09l-.15-.17Zm-.07-1.52a.34.34,0,0,1,.33.24c.33,1.1,1.87,1.92,3.36,2.72h0a9.11,9.11,0,0,1,3.13,2.24,2,2,0,0,0,.6.57,1.63,1.63,0,0,1,.66,1.5A2.75,2.75,0,0,1,33,22.37a4.24,4.24,0,0,1-1,.89l0,0v0a6,6,0,0,1-1.71,2.76l-.05,0v.06c0,.45.06.93.12,1.45v.09l.09,0a3.21,3.21,0,0,1,1.4.61l0,0h0a6.3,6.3,0,0,0,2.7-.54,2.19,2.19,0,0,0,1-.85l0-.08-.06-.07a4,4,0,0,1-.73-1.73,20.9,20.9,0,0,1-.39-4.52c0-.13,0-.28,0-.47,0-1.6.1-5.34-2-7.47A6,6,0,0,0,28,11a3.68,3.68,0,0,0-2.86,1.14h0v0h0l0,0h0a.35.35,0,0,1-.19.06l-.12,0h0a4.48,4.48,0,0,0-1.07-.09,2.33,2.33,0,0,0-2,1.24,8,8,0,0,0-1,2.69,23.3,23.3,0,0,0-.45,4.49c0,3.91-.56,5.5-1,6.14l-.06.09.08.07a5.36,5.36,0,0,0,3.59,1.49h.05l0,0a3.3,3.3,0,0,1,1.41-.61l.09,0v-.09c.07-.51.11-1,.14-1.42v-.07l-.05,0a5.87,5.87,0,0,1-1.74-2.78l0,0,0,0a4.24,4.24,0,0,1-.95-.89,2.75,2.75,0,0,1-.61-1.66,1.67,1.67,0,0,1,.59-1.45,2.16,2.16,0,0,0,.63-.75,5,5,0,0,1,1-1.3h0a5.57,5.57,0,0,0,1.79-3.49.35.35,0,0,1,.32-.28h0m-.33,13.34c-.13,1.5-.41,3-.52,3.63a.85.85,0,0,0,0,.5l.89,2.24,0,0a3.72,3.72,0,0,0,1.82.48A3.64,3.64,0,0,0,29,33.28l0,0,1-2.34a.82.82,0,0,0,0-.51c-.11-.59-.38-2.11-.5-3.64v-.18l-.17.08a4.56,4.56,0,0,1-2,.46,4.49,4.49,0,0,1-2-.45l-.16-.08Zm2.16,10.77,1.39-3.41-.24.06a4.55,4.55,0,0,1-1,.12,4.33,4.33,0,0,1-1.24-.18l-.25-.07Zm3.14-8.92c.1.69.21,1.28.28,1.65a1.51,1.51,0,0,1-.09.89l-3,7.29.45,1.12L32.47,36l-1.07-1.6a.35.35,0,0,1,0-.3.34.34,0,0,1,.21-.21l1.63-.54V30.65l-1.5-1.49a1.21,1.21,0,0,0-.16-.16,2.82,2.82,0,0,0-.93-.51l-.19-.06Zm-9,2v2.71l1.63.54a.39.39,0,0,1,.21.21.35.35,0,0,1,0,.3L22.22,36l5.57,4.56L24,31.16a1.55,1.55,0,0,1-.08-.88c.07-.37.18-1,.29-1.65l0-.2-.19.06a2.5,2.5,0,0,0-.92.5,1.29,1.29,0,0,0-.17.15ZM42.21,44.47a.34.34,0,0,1-.33-.26l-2.19-9.87a2.18,2.18,0,0,0-1.3-1.53L33.88,31V33.6a.36.36,0,0,1-.23.33l-1.44.47,1,1.49a.33.33,0,0,1-.07.45l-4.75,3.89.52,1.3h0v0h0v0h0v0h0v2.48a.34.34,0,0,1-.67,0V41.82l-6.69-5.48a.33.33,0,0,1-.07-.45l1-1.49L21,33.93a.35.35,0,0,1-.23-.33V31l-4.51,1.8A2.14,2.14,0,0,0,15,34.33l-2.19,9.88a.34.34,0,0,1-.33.26H12.4a.39.39,0,0,1-.21-.15.34.34,0,0,1,0-.26l2.19-9.87a2.83,2.83,0,0,1,1.7-2l4.92-2,1.2-1.2-.24,0a6,6,0,0,1-3.56-2,.38.38,0,0,1-.05-.31.37.37,0,0,1,.18-.21h0a2.41,2.41,0,0,0,.56-1.15,18.94,18.94,0,0,0,.45-4.72,21.66,21.66,0,0,1,.64-5.39c.68-2.46,1.85-3.7,3.46-3.7a7.16,7.16,0,0,1,1,.06h.06l.05,0A4.44,4.44,0,0,1,28,10.35a6.71,6.71,0,0,1,5,1.83c2.29,2.34,2.21,6.28,2.17,8v.46a18.94,18.94,0,0,0,.45,4.72,2.41,2.41,0,0,0,.56,1.15h0a.35.35,0,0,1,.19.36c0,.07-.29,1.85-3.54,2.17l-.26,0,1.18,1.18,4.91,2a2.82,2.82,0,0,1,1.71,2l2.19,9.87a.34.34,0,0,1,0,.26.39.39,0,0,1-.21.15h-.08" style="fill: #068d9d"/>
        <path d="M25.55,15a6,6,0,0,1-1.71,2.73A4.15,4.15,0,0,0,23,18.81a3,3,0,0,1-.83,1,1.12,1.12,0,0,0-.32.91c0,1.22,1.37,2.06,1.38,2.07a.36.36,0,0,1,.16.22A5,5,0,0,0,25,25.71h0l.05,0h0a3.74,3.74,0,0,0,2.24.69,3.79,3.79,0,0,0,3.22-1.71A5.52,5.52,0,0,0,31.35,23a.36.36,0,0,1,.16-.22,2.89,2.89,0,0,0,1.38-2.07,1.05,1.05,0,0,0-.35-.93,2.69,2.69,0,0,1-.78-.76,8.88,8.88,0,0,0-2.91-2,11.63,11.63,0,0,1-3.08-2.09l-.15-.17Zm-.07-1.52a.34.34,0,0,1,.33.24c.33,1.1,1.87,1.92,3.36,2.72h0a9.11,9.11,0,0,1,3.13,2.24,2,2,0,0,0,.6.57,1.63,1.63,0,0,1,.66,1.5A2.75,2.75,0,0,1,33,22.37a4.24,4.24,0,0,1-1,.89l0,0v0a6,6,0,0,1-1.71,2.76l-.05,0v.06c0,.45.06.93.12,1.45v.09l.09,0a3.21,3.21,0,0,1,1.4.61l0,0h0a6.3,6.3,0,0,0,2.7-.54,2.19,2.19,0,0,0,1-.85l0-.08-.06-.07a4,4,0,0,1-.73-1.73,20.9,20.9,0,0,1-.39-4.52c0-.13,0-.28,0-.47,0-1.6.1-5.34-2-7.47A6,6,0,0,0,28,11a3.68,3.68,0,0,0-2.86,1.14h0v0h0l0,0h0a.35.35,0,0,1-.19.06l-.12,0h0a4.48,4.48,0,0,0-1.07-.09,2.33,2.33,0,0,0-2,1.24,8,8,0,0,0-1,2.69,23.3,23.3,0,0,0-.45,4.49c0,3.91-.56,5.5-1,6.14l-.06.09.08.07a5.36,5.36,0,0,0,3.59,1.49h.05l0,0a3.3,3.3,0,0,1,1.41-.61l.09,0v-.09c.07-.51.11-1,.14-1.42v-.07l-.05,0a5.87,5.87,0,0,1-1.74-2.78l0,0,0,0a4.24,4.24,0,0,1-.95-.89,2.75,2.75,0,0,1-.61-1.66,1.67,1.67,0,0,1,.59-1.45,2.16,2.16,0,0,0,.63-.75,5,5,0,0,1,1-1.3h0a5.57,5.57,0,0,0,1.79-3.49.35.35,0,0,1,.32-.28Zm-.33,13.34c-.13,1.5-.41,3-.52,3.63a.85.85,0,0,0,0,.5l.89,2.24,0,0a3.72,3.72,0,0,0,1.82.48A3.64,3.64,0,0,0,29,33.28l0,0,1-2.34a.82.82,0,0,0,0-.51c-.11-.59-.38-2.11-.5-3.64v-.18l-.17.08a4.56,4.56,0,0,1-2,.46,4.49,4.49,0,0,1-2-.45l-.16-.08Zm2.16,10.77,1.39-3.41-.24.06a4.55,4.55,0,0,1-1,.12,4.33,4.33,0,0,1-1.24-.18l-.25-.07Zm3.14-8.92c.1.69.21,1.28.28,1.65a1.51,1.51,0,0,1-.09.89l-3,7.29.45,1.12L32.47,36l-1.07-1.6a.35.35,0,0,1,0-.3.34.34,0,0,1,.21-.21l1.63-.54V30.65l-1.5-1.49a1.21,1.21,0,0,0-.16-.16,2.82,2.82,0,0,0-.93-.51l-.19-.06Zm-9,2v2.71l1.63.54a.39.39,0,0,1,.21.21.35.35,0,0,1,0,.3L22.22,36l5.57,4.56L24,31.16a1.55,1.55,0,0,1-.08-.88c.07-.37.18-1,.29-1.65l0-.2-.19.06a2.5,2.5,0,0,0-.92.5,1.29,1.29,0,0,0-.17.15ZM42.21,44.47a.34.34,0,0,1-.33-.26l-2.19-9.87a2.18,2.18,0,0,0-1.3-1.53L33.88,31V33.6a.36.36,0,0,1-.23.33l-1.44.47,1,1.49a.33.33,0,0,1-.07.45l-4.75,3.89.52,1.3h0v0h0v0h0v0h0v2.48a.34.34,0,0,1-.67,0V41.82l-6.69-5.48a.33.33,0,0,1-.07-.45l1-1.49L21,33.93a.35.35,0,0,1-.23-.33V31l-4.51,1.8A2.14,2.14,0,0,0,15,34.33l-2.19,9.88a.34.34,0,0,1-.33.26H12.4a.39.39,0,0,1-.21-.15.34.34,0,0,1,0-.26l2.19-9.87a2.83,2.83,0,0,1,1.7-2l4.92-2,1.2-1.2-.24,0a6,6,0,0,1-3.56-2,.38.38,0,0,1-.05-.31.37.37,0,0,1,.18-.21h0a2.41,2.41,0,0,0,.56-1.15,18.94,18.94,0,0,0,.45-4.72,21.66,21.66,0,0,1,.64-5.39c.68-2.46,1.85-3.7,3.46-3.7a7.16,7.16,0,0,1,1,.06h.06l.05,0A4.44,4.44,0,0,1,28,10.35a6.71,6.71,0,0,1,5,1.83c2.29,2.34,2.21,6.28,2.17,8v.46a18.94,18.94,0,0,0,.45,4.72,2.41,2.41,0,0,0,.56,1.15h0a.35.35,0,0,1,.19.36c0,.07-.29,1.85-3.54,2.17l-.26,0,1.18,1.18,4.91,2a2.82,2.82,0,0,1,1.71,2l2.19,9.87a.34.34,0,0,1,0,.26.39.39,0,0,1-.21.15Z" style="fill: none;stroke: #068d9d;stroke-miterlimit: 10;stroke-width: 0.44999998807907104px"/>
        <path d="M32.64,43.8h4.28V40.14H32.64Zm-.34.67a.34.34,0,0,1-.34-.33V39.8a.34.34,0,0,1,.34-.34h4.62v-.12a10.42,10.42,0,0,1,.52-3l.11-.33a.35.35,0,0,1,.33-.24l.1,0a.34.34,0,0,1,.2.17.33.33,0,0,1,0,.26l-.11.33a9.48,9.48,0,0,0-.5,3v4.59a.33.33,0,0,1-.33.33Z" style="fill: #068d9d"/>
        <path d="M32.64,43.8h4.28V40.14H32.64Zm-.34.67a.34.34,0,0,1-.34-.33V39.8a.34.34,0,0,1,.34-.34h4.62v-.12a10.42,10.42,0,0,1,.52-3l.11-.33a.35.35,0,0,1,.33-.24l.1,0a.34.34,0,0,1,.2.17.33.33,0,0,1,0,.26l-.11.33a9.48,9.48,0,0,0-.5,3v4.59a.33.33,0,0,1-.33.33Z" style="fill: none;stroke: #068d9d;stroke-miterlimit: 10;stroke-width: 0.44999998807907104px"/>
        <circle cx="27.75" cy="27.75" r="27.25" style="fill: none;stroke: #068d9d"/>
      </g>
    </g>
  </g>
</svg>
