[
  {
    "model": "murren.murren",
    "pk": 180,
    "fields": {
      "password": "pbkdf2_sha256$180000$dKbMmCN0uWdb$evhyXo/hBsXQYeJ3zkmw0jzLEKFy3MXAnW5cYa9N+8c=",
      "last_login": null,
      "is_superuser": false,
      "username": "dipaw39635",
      "first_name": "",
      "last_name": "",
      "is_staff": false,
      "is_active": true,
      "date_joined": "2020-03-01T11:29:18.682Z",
      "email": "dipaw39635@edusamail.net",
      "murren_avatar": "default_murren_avatar.png",
      "groups": [],
      "user_permissions": []
    }
  },
  {
    "model": "murren.murren",
    "pk": 181,
    "fields": {
      "password": "pbkdf2_sha256$180000$BmNRAxUALi57$3haAKdOgF6lE2YC/sQxzEouH0CpBg1FXtF+xaJdENI8=",
      "last_login": null,
      "is_superuser": false,
      "username": "tiwap47238",
      "first_name": "",
      "last_name": "",
      "is_staff": false,
      "is_active": true,
      "date_joined": "2020-03-01T11:30:08.385Z",
      "email": "tiwap47238@p5mail.com",
      "murren_avatar": "default_murren_avatar.png",
      "groups": [],
      "user_permissions": []
    }
  },
  {
    "model": "murren.murren",
    "pk": 182,
    "fields": {
      "password": "pbkdf2_sha256$180000$qM5WWwAjbyAj$BCrSPfkHhmzjtciCamu+AEdgyD2cTE/cwe2uK9LrNe8=",
      "last_login": null,
      "is_superuser": false,
      "username": "wavox92866",
      "first_name": "",
      "last_name": "",
      "is_staff": false,
      "is_active": true,
      "date_joined": "2020-03-01T11:30:20.787Z",
      "email": "wavox92866@p5mail.com",
      "murren_avatar": "default_murren_avatar.png",
      "groups": [],
      "user_permissions": []
    }
  },
  {
    "model": "murren.murren",
    "pk": 183,
    "fields": {
      "password": "pbkdf2_sha256$180000$mqZFsWnNuIiY$PzeR4l2Ya+0DUbq35/TD6YhwFIBKwbhbK/AkPs7Qeo0=",
      "last_login": null,
      "is_superuser": false,
      "username": "gajov48084",
      "first_name": "",
      "last_name": "",
      "is_staff": false,
      "is_active": true,
      "date_joined": "2020-03-01T11:30:33.206Z",
      "email": "gajov48084@nuevomail.com",
      "murren_avatar": "default_murren_avatar.png",
      "groups": [],
      "user_permissions": []
    }
  },
  {
    "model": "murren.murren",
    "pk": 184,
    "fields": {
      "password": "pbkdf2_sha256$180000$xrBxJutHWfrR$SjQBltscZlz6XXg9vmP6AWscdcboaC4UDXthtNu/l8U=",
      "last_login": null,
      "is_superuser": false,
      "username": "vegat31971",
      "first_name": "",
      "last_name": "",
      "is_staff": false,
      "is_active": true,
      "date_joined": "2020-03-01T11:30:45.923Z",
      "email": "vegat31971@x3mailer.com",
      "murren_avatar": "default_murren_avatar.png",
      "groups": [],
      "user_permissions": []
    }
  },
  {
    "model": "murren.murren",
    "pk": 185,
    "fields": {
      "password": "pbkdf2_sha256$180000$6krxHtAO8jGB$7e4p4vIYTryOXhff630gpcxMXRuz5g0dIYGCElVD0NE=",
      "last_login": null,
      "is_superuser": false,
      "username": "xekav68474",
      "first_name": "",
      "last_name": "",
      "is_staff": false,
      "is_active": true,
      "date_joined": "2020-03-01T11:30:58.351Z",
      "email": "xekav68474@oppamail.com",
      "murren_avatar": "default_murren_avatar.png",
      "groups": [],
      "user_permissions": []
    }
  },
  {
    "model": "murren.murren",
    "pk": 186,
    "fields": {
      "password": "pbkdf2_sha256$180000$efxiIqQEVu7G$sxMumNuIIDg7lM1TOM+oovf6iGp6mOVxMKmpD/W7k+E=",
      "last_login": null,
      "is_superuser": false,
      "username": "nakisar821",
      "first_name": "",
      "last_name": "",
      "is_staff": false,
      "is_active": true,
      "date_joined": "2020-03-01T11:31:11.904Z",
      "email": "nakisar821@oppamail.com",
      "murren_avatar": "default_murren_avatar.png",
      "groups": [],
      "user_permissions": []
    }
  },
  {
    "model": "murren.murren",
    "pk": 187,
    "fields": {
      "password": "pbkdf2_sha256$180000$Wz385w57LzEU$FJZq837KzSv8buMg5isXVlToDShmNnhwxufzibD8MHU=",
      "last_login": null,
      "is_superuser": false,
      "username": "kejaxe1196",
      "first_name": "",
      "last_name": "",
      "is_staff": false,
      "is_active": true,
      "date_joined": "2020-03-01T11:31:24.263Z",
      "email": "kejaxe1196@jalcemail.net",
      "murren_avatar": "default_murren_avatar.png",
      "groups": [],
      "user_permissions": []
    }
  },
  {
    "model": "murren.murren",
    "pk": 188,
    "fields": {
      "password": "pbkdf2_sha256$180000$96P7ovxttHOc$cBPlwmMs59YZTxBYb8Rc463RQJ3LPz+G74UazbNdUZE=",
      "last_login": null,
      "is_superuser": false,
      "username": "lajewa1396",
      "first_name": "",
      "last_name": "",
      "is_staff": false,
      "is_active": true,
      "date_joined": "2020-03-01T11:31:31.648Z",
      "email": "lajewa1396@oppamail.com",
      "murren_avatar": "default_murren_avatar.png",
      "groups": [],
      "user_permissions": []
    }
  },
  {
    "model": "murren.murren",
    "pk": 189,
    "fields": {
      "password": "pbkdf2_sha256$180000$KgnZhp8wzZnX$aC/EoaUpbWaI+aFQ54W7mpgaXgXde69ZXL8YCjg347Q=",
      "last_login": null,
      "is_superuser": false,
      "username": "laterax406",
      "first_name": "",
      "last_name": "",
      "is_staff": false,
      "is_active": true,
      "date_joined": "2020-03-01T11:31:39.033Z",
      "email": "laterax406@p5mail.com",
      "murren_avatar": "default_murren_avatar.png",
      "groups": [],
      "user_permissions": []
    }
  },
  {
    "model": "murren.murren",
    "pk": 190,
    "fields": {
      "password": "pbkdf2_sha256$180000$fgAsi6i63EOD$+UOtyBQ5dr7HYg1pH8/ZuuDoKqrkwhQRwmaFFKjeu+0=",
      "last_login": null,
      "is_superuser": false,
      "username": "migaj96177",
      "first_name": "",
      "last_name": "",
      "is_staff": false,
      "is_active": true,
      "date_joined": "2020-03-01T11:31:46.348Z",
      "email": "migaj96177@p5mail.com",
      "murren_avatar": "default_murren_avatar.png",
      "groups": [],
      "user_permissions": []
    }
  },
  {
    "model": "murren.murren",
    "pk": 191,
    "fields": {
      "password": "pbkdf2_sha256$180000$W0CkEHtp4W2k$Wk8URQ/yVzIkjuKD2rY7Z5t4zuyGpdlNSXaiBE4O7Ro=",
      "last_login": null,
      "is_superuser": false,
      "username": "wijeti3823",
      "first_name": "",
      "last_name": "",
      "is_staff": false,
      "is_active": true,
      "date_joined": "2020-03-01T11:31:52.429Z",
      "email": "wijeti3823@p5mail.com",
      "murren_avatar": "default_murren_avatar.png",
      "groups": [],
      "user_permissions": []
    }
  },
  {
    "model": "murren.murren",
    "pk": 192,
    "fields": {
      "password": "pbkdf2_sha256$180000$xxTDeWtqvbuB$uaoxRtr/jxwCx2TeWXitiAfP1EEi7UOLMpLQUTBnMpc=",
      "last_login": null,
      "is_superuser": false,
      "username": "sexigov641",
      "first_name": "",
      "last_name": "",
      "is_staff": false,
      "is_active": true,
      "date_joined": "2020-03-01T11:31:57.330Z",
      "email": "sexigov641@x3mailer.com",
      "murren_avatar": "default_murren_avatar.png",
      "groups": [],
      "user_permissions": []
    }
  },
  {
    "model": "murren.murren",
    "pk": 193,
    "fields": {
      "password": "pbkdf2_sha256$180000$PHrpRBo6Ahtu$MtT48PEmUrrGImVPQo14JzZBnD1lNEYivOEmGtPpcjo=",
      "last_login": null,
      "is_superuser": false,
      "username": "kabev15647",
      "first_name": "",
      "last_name": "",
      "is_staff": false,
      "is_active": true,
      "date_joined": "2020-03-01T11:32:07.215Z",
      "email": "kabev15647@p5mail.com",
      "murren_avatar": "default_murren_avatar.png",
      "groups": [],
      "user_permissions": []
    }
  },
  {
    "model": "murren.murren",
    "pk": 194,
    "fields": {
      "password": "pbkdf2_sha256$180000$QUDkClvvqUcD$u7DrMBqDsLlFSBmYhIWE+ehg67oi4i9PtZxTNGNtiSY=",
      "last_login": null,
      "is_superuser": false,
      "username": "liyakih240",
      "first_name": "",
      "last_name": "",
      "is_staff": false,
      "is_active": true,
      "date_joined": "2020-03-01T11:32:13.795Z",
      "email": "liyakih240@mytrumail.com",
      "murren_avatar": "default_murren_avatar.png",
      "groups": [],
      "user_permissions": []
    }
  },
  {
    "model": "murren.murren",
    "pk": 195,
    "fields": {
      "password": "pbkdf2_sha256$180000$nHMLQTaFfi3h$RmKPbXnaCRW1rITuF/5fuyHDKk98aqeJWsILN4/Eo6s=",
      "last_login": null,
      "is_superuser": false,
      "username": "hemipoh496",
      "first_name": "",
      "last_name": "",
      "is_staff": false,
      "is_active": true,
      "date_joined": "2020-03-01T11:32:18.798Z",
      "email": "hemipoh496@edusamail.net",
      "murren_avatar": "default_murren_avatar.png",
      "groups": [],
      "user_permissions": []
    }
  },
  {
    "model": "murren.murren",
    "pk": 196,
    "fields": {
      "password": "pbkdf2_sha256$180000$ADbVO15XhhdK$ziu3vObKH6CzA/V66UA6meIgKXDhlNTQ9UsT6MwGuKI=",
      "last_login": null,
      "is_superuser": false,
      "username": "noher93579",
      "first_name": "",
      "last_name": "",
      "is_staff": false,
      "is_active": true,
      "date_joined": "2020-03-01T11:32:24.804Z",
      "email": "noher93579@p5mail.com",
      "murren_avatar": "default_murren_avatar.png",
      "groups": [],
      "user_permissions": []
    }
  },
  {
    "model": "murren.murren",
    "pk": 197,
    "fields": {
      "password": "pbkdf2_sha256$180000$V4Px0voay0OL$2EZ1svtTojFF92vJfJ73+l8K15z8FX1w6D/RzQT5k64=",
      "last_login": null,
      "is_superuser": false,
      "username": "yolabo1215",
      "first_name": "",
      "last_name": "",
      "is_staff": false,
      "is_active": true,
      "date_joined": "2020-03-01T11:32:29.844Z",
      "email": "yolabo1215@mytrumail.com",
      "murren_avatar": "default_murren_avatar.png",
      "groups": [],
      "user_permissions": []
    }
  },
  {
    "model": "murren.murren",
    "pk": 198,
    "fields": {
      "password": "pbkdf2_sha256$180000$EtXxBjHF5mfD$wbZtQ/wk2bXy6giq3gJHXIQiMs2rcoX8cKzf1/+W/S4=",
      "last_login": null,
      "is_superuser": false,
      "username": "pewace5150",
      "first_name": "",
      "last_name": "",
      "is_staff": false,
      "is_active": true,
      "date_joined": "2020-03-01T11:32:34.797Z",
      "email": "pewace5150@mytrumail.com",
      "murren_avatar": "default_murren_avatar.png",
      "groups": [],
      "user_permissions": []
    }
  },
  {
    "model": "murren.murren",
    "pk": 199,
    "fields": {
      "password": "pbkdf2_sha256$180000$SG6eHiALFa9e$zyBzuVybbTMwb899EoHvjPVZFuSbUbnI6jW2lzTRzzA=",
      "last_login": null,
      "is_superuser": false,
      "username": "xawade9656",
      "first_name": "",
      "last_name": "",
      "is_staff": false,
      "is_active": true,
      "date_joined": "2020-03-01T11:32:39.793Z",
      "email": "xawade9656@nuevomail.com",
      "murren_avatar": "default_murren_avatar.png",
      "groups": [],
      "user_permissions": []
    }
  },
  {
    "model": "murren.murren",
    "pk": 200,
    "fields": {
      "password": "pbkdf2_sha256$180000$pLN7ZvwDtQB8$+UsSfCzOKOGhyLMLZhnmnPiaiDw0f22ehvWMJeZJuTE=",
      "last_login": null,
      "is_superuser": false,
      "username": "jimef86586",
      "first_name": "",
      "last_name": "",
      "is_staff": false,
      "is_active": true,
      "date_joined": "2020-03-01T11:32:49.883Z",
      "email": "jimef86586@p5mail.com",
      "murren_avatar": "default_murren_avatar.png",
      "groups": [],
      "user_permissions": []
    }
  },
  {
    "model": "murren.murren",
    "pk": 201,
    "fields": {
      "password": "pbkdf2_sha256$180000$kCOggXtX6QJ0$digubr1DVpJ6AOHQrJtJf2VQzqGM1YeSfF3cg/egB5Y=",
      "last_login": null,
      "is_superuser": false,
      "username": "bokat85947",
      "first_name": "",
      "last_name": "",
      "is_staff": false,
      "is_active": true,
      "date_joined": "2020-03-01T11:32:54.873Z",
      "email": "bokat85947@finxmail.com",
      "murren_avatar": "default_murren_avatar.png",
      "groups": [],
      "user_permissions": []
    }
  },
  {
    "model": "murren.murren",
    "pk": 202,
    "fields": {
      "password": "pbkdf2_sha256$180000$8DLOr8D3VuVS$EE8ltUNZnDJD6fcYHvu9W9Jr6hcSC90r3ZQ5k7RgloI=",
      "last_login": null,
      "is_superuser": false,
      "username": "polaxif221",
      "first_name": "",
      "last_name": "",
      "is_staff": false,
      "is_active": true,
      "date_joined": "2020-03-01T11:32:59.791Z",
      "email": "polaxif221@mailimail.com",
      "murren_avatar": "default_murren_avatar.png",
      "groups": [],
      "user_permissions": []
    }
  },
  {
    "model": "murren.murren",
    "pk": 203,
    "fields": {
      "password": "pbkdf2_sha256$180000$DgbGDSYUueaN$xi+mm9oH9k8uTkTYxLkb18Acu5qknZnrsjmNgoDgy8I=",
      "last_login": null,
      "is_superuser": false,
      "username": "labedan415",
      "first_name": "",
      "last_name": "",
      "is_staff": false,
      "is_active": true,
      "date_joined": "2020-03-01T11:33:04.662Z",
      "email": "labedan415@mailimail.com",
      "murren_avatar": "default_murren_avatar.png",
      "groups": [],
      "user_permissions": []
    }
  },
  {
    "model": "murren.murren",
    "pk": 204,
    "fields": {
      "password": "pbkdf2_sha256$180000$nljduaNRub5b$62MwMc5lneSDlnFb0vlI90tdzs3P6Bi8RW3Ad6mHfR0=",
      "last_login": null,
      "is_superuser": false,
      "username": "ligaj18152",
      "first_name": "",
      "last_name": "",
      "is_staff": false,
      "is_active": true,
      "date_joined": "2020-03-01T11:33:14.628Z",
      "email": "ligaj18152@mailimail.com",
      "murren_avatar": "default_murren_avatar.png",
      "groups": [],
      "user_permissions": []
    }
  },
  {
    "model": "murren.murren",
    "pk": 205,
    "fields": {
      "password": "pbkdf2_sha256$180000$UWwnZRMJNye9$pnWZ8BdDZtIiZN2nTJnILvyEkOvKNAuY200Pq3CAUo0=",
      "last_login": null,
      "is_superuser": false,
      "username": "lepopip425",
      "first_name": "",
      "last_name": "",
      "is_staff": false,
      "is_active": true,
      "date_joined": "2020-03-01T11:33:20.819Z",
      "email": "lepopip425@edusamail.net",
      "murren_avatar": "default_murren_avatar.png",
      "groups": [],
      "user_permissions": []
    }
  },
  {
    "model": "murren.murren",
    "pk": 206,
    "fields": {
      "password": "pbkdf2_sha256$180000$TXDemxEH8xq7$FkSafqhse0+N4x9xAlMUeMkzxqAh+9TxjCI4LPTW/74=",
      "last_login": null,
      "is_superuser": false,
      "username": "koyidi1441",
      "first_name": "",
      "last_name": "",
      "is_staff": false,
      "is_active": true,
      "date_joined": "2020-03-01T11:33:27.789Z",
      "email": "koyidi1441@oppamail.com",
      "murren_avatar": "default_murren_avatar.png",
      "groups": [],
      "user_permissions": []
    }
  },
  {
    "model": "murren.murren",
    "pk": 207,
    "fields": {
      "password": "pbkdf2_sha256$180000$dI6DeW6NDUJB$/d/Gh/ID3tyUMCHw71PVzNKBlWb7PeLp1t16IVx9JMI=",
      "last_login": null,
      "is_superuser": false,
      "username": "bojagob440",
      "first_name": "",
      "last_name": "",
      "is_staff": false,
      "is_active": true,
      "date_joined": "2020-03-01T11:33:32.825Z",
      "email": "bojagob440@edusamail.net",
      "murren_avatar": "default_murren_avatar.png",
      "groups": [],
      "user_permissions": []
    }
  },
  {
    "model": "murren.murren",
    "pk": 208,
    "fields": {
      "password": "pbkdf2_sha256$180000$hI2dN6BcIHAU$nn/uhWr3LQ+I938RrWfQLNeUqQhPqa8p8rmRCbolw+o=",
      "last_login": null,
      "is_superuser": false,
      "username": "gakonos580",
      "first_name": "",
      "last_name": "",
      "is_staff": false,
      "is_active": true,
      "date_joined": "2020-03-01T11:33:37.793Z",
      "email": "gakonos580@edusamail.net",
      "murren_avatar": "default_murren_avatar.png",
      "groups": [],
      "user_permissions": []
    }
  },
  {
    "model": "murren.murren",
    "pk": 209,
    "fields": {
      "password": "pbkdf2_sha256$180000$nG3uk7S4VkXW$7/hj7bPA3K+MS5c+a2lEEzvqd0OvFjhZuJZ5u+CKcVs=",
      "last_login": null,
      "is_superuser": false,
      "username": "hekol49659",
      "first_name": "",
      "last_name": "",
      "is_staff": false,
      "is_active": true,
      "date_joined": "2020-03-01T11:33:42.799Z",
      "email": "hekol49659@x3mailer.com",
      "murren_avatar": "default_murren_avatar.png",
      "groups": [],
      "user_permissions": []
    }
  },
  {
    "model": "murren.murren",
    "pk": 210,
    "fields": {
      "password": "pbkdf2_sha256$180000$MA085wDK5En2$R0zKo60UtcSWfxAm9+kh1Yoe8AHNEKEr4Qt4SM+9R/Q=",
      "last_login": null,
      "is_superuser": false,
      "username": "pafineh568",
      "first_name": "",
      "last_name": "",
      "is_staff": false,
      "is_active": true,
      "date_joined": "2020-03-01T11:33:47.971Z",
      "email": "pafineh568@jalcemail.net",
      "murren_avatar": "default_murren_avatar.png",
      "groups": [],
      "user_permissions": []
    }
  },
  {
    "model": "murren.murren",
    "pk": 211,
    "fields": {
      "password": "pbkdf2_sha256$180000$Nsa3pA2lLmaF$JW814nPSehRDN3ftaAVdRbjENqjwpsX7wGP8U14tgpo=",
      "last_login": null,
      "is_superuser": false,
      "username": "rovan48987",
      "first_name": "",
      "last_name": "",
      "is_staff": false,
      "is_active": true,
      "date_joined": "2020-03-01T11:33:55.088Z",
      "email": "rovan48987@smlmail.net",
      "murren_avatar": "default_murren_avatar.png",
      "groups": [],
      "user_permissions": []
    }
  },
  {
    "model": "murren.murren",
    "pk": 212,
    "fields": {
      "password": "pbkdf2_sha256$180000$hGx8gtsJ7Ptl$M+p1FmDuBxd9VjeeXc41Uz9GT3rdJOVSkHaNloWcU+I=",
      "last_login": null,
      "is_superuser": false,
      "username": "rotiwo7046",
      "first_name": "",
      "last_name": "",
      "is_staff": false,
      "is_active": true,
      "date_joined": "2020-03-01T11:34:00.928Z",
      "email": "rotiwo7046@x3mailer.com",
      "murren_avatar": "default_murren_avatar.png",
      "groups": [],
      "user_permissions": []
    }
  },
  {
    "model": "murren.murren",
    "pk": 213,
    "fields": {
      "password": "pbkdf2_sha256$180000$1KQPBSC9fmM3$5iHsRjRvT9TSacBxcEzDP1MN9LbOdSWtvWV79OVqjYQ=",
      "last_login": null,
      "is_superuser": false,
      "username": "yelical620",
      "first_name": "",
      "last_name": "",
      "is_staff": false,
      "is_active": true,
      "date_joined": "2020-03-01T11:34:05.826Z",
      "email": "yelical620@mailimail.com",
      "murren_avatar": "default_murren_avatar.png",
      "groups": [],
      "user_permissions": []
    }
  },
  {
    "model": "murren.murren",
    "pk": 214,
    "fields": {
      "password": "pbkdf2_sha256$180000$FgZLOcTw7JtV$TGktPpKvFH0oDp3kk3Cd1csy5+rwrwnNfzlteAGnbZo=",
      "last_login": null,
      "is_superuser": false,
      "username": "sesimas243",
      "first_name": "",
      "last_name": "",
      "is_staff": false,
      "is_active": true,
      "date_joined": "2020-03-01T11:34:10.815Z",
      "email": "sesimas243@mytrumail.com",
      "murren_avatar": "default_murren_avatar.png",
      "groups": [],
      "user_permissions": []
    }
  },
  {
    "model": "murren.murren",
    "pk": 215,
    "fields": {
      "password": "pbkdf2_sha256$180000$kLy9N6IbU1IE$/ObyVTcbVYNCbmVUjaVa/UEESHV6SxhHzZPkbY1KScw=",
      "last_login": null,
      "is_superuser": false,
      "username": "jifoco8065",
      "first_name": "",
      "last_name": "",
      "is_staff": false,
      "is_active": true,
      "date_joined": "2020-03-01T11:34:15.814Z",
      "email": "jifoco8065@x3mailer.com",
      "murren_avatar": "default_murren_avatar.png",
      "groups": [],
      "user_permissions": []
    }
  },
  {
    "model": "murren.murren",
    "pk": 216,
    "fields": {
      "password": "pbkdf2_sha256$180000$CYMHx2gvx9VL$gchP2pIgZmeRGHUe0cqPMD7jQzK90Z9ecZ8onFa101g=",
      "last_login": null,
      "is_superuser": false,
      "username": "wihafat152",
      "first_name": "",
      "last_name": "",
      "is_staff": false,
      "is_active": true,
      "date_joined": "2020-03-01T11:34:20.812Z",
      "email": "wihafat152@mailimail.com",
      "murren_avatar": "default_murren_avatar.png",
      "groups": [],
      "user_permissions": []
    }
  },
  {
    "model": "murren.murren",
    "pk": 217,
    "fields": {
      "password": "pbkdf2_sha256$180000$9ugkN3VOWzqB$uA3JF2ozBhFIwIXeOCwCmtOr9wfZi2y3wS7K5UNykp8=",
      "last_login": null,
      "is_superuser": false,
      "username": "doret62131",
      "first_name": "",
      "last_name": "",
      "is_staff": false,
      "is_active": true,
      "date_joined": "2020-03-01T11:34:25.803Z",
      "email": "doret62131@finxmail.com",
      "murren_avatar": "default_murren_avatar.png",
      "groups": [],
      "user_permissions": []
    }
  },
  {
    "model": "murren.murren",
    "pk": 218,
    "fields": {
      "password": "pbkdf2_sha256$180000$BXu828tmDIQO$bqaKHhfBiqq0eU9LBhYrtipoN9A/+G8ZH04sNudRQpY=",
      "last_login": null,
      "is_superuser": false,
      "username": "mebix92380",
      "first_name": "",
      "last_name": "",
      "is_staff": false,
      "is_active": true,
      "date_joined": "2020-03-01T11:34:30.788Z",
      "email": "mebix92380@edusamail.net",
      "murren_avatar": "default_murren_avatar.png",
      "groups": [],
      "user_permissions": []
    }
  },
  {
    "model": "murren.murren",
    "pk": 219,
    "fields": {
      "password": "pbkdf2_sha256$180000$hBPIPOO6AzMo$m/pgjvgP0+CpWHV6rCZPQk40RxB0IAKlUqqfNedpgY8=",
      "last_login": null,
      "is_superuser": false,
      "username": "visolo2444",
      "first_name": "",
      "last_name": "",
      "is_staff": false,
      "is_active": true,
      "date_joined": "2020-03-01T11:34:35.823Z",
      "email": "visolo2444@oppamail.com",
      "murren_avatar": "default_murren_avatar.png",
      "groups": [],
      "user_permissions": []
    }
  },
  {
    "model": "murren.murren",
    "pk": 220,
    "fields": {
      "password": "pbkdf2_sha256$180000$fAfkvk4pCE56$Lhln89DI16NlIf0eIwfl7/bM4EopWS0qars/iAG11Ys=",
      "last_login": null,
      "is_superuser": false,
      "username": "sixav19624",
      "first_name": "",
      "last_name": "",
      "is_staff": false,
      "is_active": true,
      "date_joined": "2020-03-01T11:34:40.873Z",
      "email": "sixav19624@smlmail.net",
      "murren_avatar": "default_murren_avatar.png",
      "groups": [],
      "user_permissions": []
    }
  },
  {
    "model": "murren.murren",
    "pk": 221,
    "fields": {
      "password": "pbkdf2_sha256$180000$3fvV4L4lApXH$j42ykx6vmV8y7XnbYYhVE0B9SSUNMR15hAg8wyO3mMo=",
      "last_login": null,
      "is_superuser": false,
      "username": "bacos37996",
      "first_name": "",
      "last_name": "",
      "is_staff": false,
      "is_active": true,
      "date_joined": "2020-03-01T11:34:45.825Z",
      "email": "bacos37996@x3mailer.com",
      "murren_avatar": "default_murren_avatar.png",
      "groups": [],
      "user_permissions": []
    }
  },
  {
    "model": "murren.murren",
    "pk": 222,
    "fields": {
      "password": "pbkdf2_sha256$180000$wPEtpuuo6Vx0$VcJ2mKz1YG29HHi3L1bDY8U7McF7XgVf/2SzisL4JVo=",
      "last_login": null,
      "is_superuser": false,
      "username": "hidak89570",
      "first_name": "",
      "last_name": "",
      "is_staff": false,
      "is_active": true,
      "date_joined": "2020-03-01T11:34:50.419Z",
      "email": "hidak89570@finxmail.com",
      "murren_avatar": "default_murren_avatar.png",
      "groups": [],
      "user_permissions": []
    }
  },
  {
    "model": "murren.murren",
    "pk": 223,
    "fields": {
      "password": "pbkdf2_sha256$180000$cC5l9KPzUd7Y$y9ne1ktDqvqX+JLcf/b0qxNyE8PAPRWavYEFR2uQ+Dk=",
      "last_login": null,
      "is_superuser": false,
      "username": "weterah568",
      "first_name": "",
      "last_name": "",
      "is_staff": false,
      "is_active": true,
      "date_joined": "2020-03-01T11:34:55.784Z",
      "email": "weterah568@nuevomail.com",
      "murren_avatar": "default_murren_avatar.png",
      "groups": [],
      "user_permissions": []
    }
  },
  {
    "model": "murren.murren",
    "pk": 224,
    "fields": {
      "password": "pbkdf2_sha256$180000$Iv2IR8DTn9ou$+bOEoScWNPKevAFI6M9+sPPsbcMo1hbRODmA7ST8l1s=",
      "last_login": null,
      "is_superuser": false,
      "username": "necanej531",
      "first_name": "",
      "last_name": "",
      "is_staff": false,
      "is_active": true,
      "date_joined": "2020-03-01T11:35:00.794Z",
      "email": "necanej531@x3mailer.com",
      "murren_avatar": "default_murren_avatar.png",
      "groups": [],
      "user_permissions": []
    }
  },
  {
    "model": "murren.murren",
    "pk": 225,
    "fields": {
      "password": "pbkdf2_sha256$180000$CTCpdMx1IX2I$Ij8bysSVwqnQzZ2aoQYhcKWAaBLIEgWgEQou79AXCFA=",
      "last_login": null,
      "is_superuser": false,
      "username": "hosij99050",
      "first_name": "",
      "last_name": "",
      "is_staff": false,
      "is_active": true,
      "date_joined": "2020-03-01T11:35:05.745Z",
      "email": "hosij99050@p5mail.com",
      "murren_avatar": "default_murren_avatar.png",
      "groups": [],
      "user_permissions": []
    }
  },
  {
    "model": "murren.murren",
    "pk": 226,
    "fields": {
      "password": "pbkdf2_sha256$180000$eHOa5jgaqV4z$zAMwcTj0FFhTkAtmUvB4B52RRuJv1FYTn4Z/OrCZIk8=",
      "last_login": null,
      "is_superuser": false,
      "username": "jitibi5590",
      "first_name": "",
      "last_name": "",
      "is_staff": false,
      "is_active": true,
      "date_joined": "2020-03-01T11:35:10.814Z",
      "email": "jitibi5590@mailimail.com",
      "murren_avatar": "default_murren_avatar.png",
      "groups": [],
      "user_permissions": []
    }
  },
  {
    "model": "murren.murren",
    "pk": 227,
    "fields": {
      "password": "pbkdf2_sha256$180000$UFJtckMVyhcs$uTr7gEdF/U2VHjkdXNvNlaPdimpaZ6K2HYrpM6OgWj8=",
      "last_login": null,
      "is_superuser": false,
      "username": "pajid77451",
      "first_name": "",
      "last_name": "",
      "is_staff": false,
      "is_active": true,
      "date_joined": "2020-03-01T11:35:20.946Z",
      "email": "pajid77451@x3mailer.com",
      "murren_avatar": "default_murren_avatar.png",
      "groups": [],
      "user_permissions": []
    }
  },
  {
    "model": "murren.murren",
    "pk": 228,
    "fields": {
      "password": "pbkdf2_sha256$180000$22Ofcvxj5NIo$WpT9+QMtqAPG6wpX0Ct9oCFMMjkoqhkGyiy44QQqTig=",
      "last_login": null,
      "is_superuser": false,
      "username": "yorel86211",
      "first_name": "",
      "last_name": "",
      "is_staff": false,
      "is_active": true,
      "date_joined": "2020-03-01T11:35:26.807Z",
      "email": "yorel86211@nuevomail.com",
      "murren_avatar": "default_murren_avatar.png",
      "groups": [],
      "user_permissions": []
    }
  },
  {
    "model": "murren.murren",
    "pk": 229,
    "fields": {
      "password": "pbkdf2_sha256$180000$aYgZlmGf7kme$KMa2LeoloVTg9ayabTkQL3TsqHUxs/CdZFi7S2b6Idg=",
      "last_login": null,
      "is_superuser": false,
      "username": "catilog790",
      "first_name": "",
      "last_name": "",
      "is_staff": false,
      "is_active": true,
      "date_joined": "2020-03-01T11:35:31.887Z",
      "email": "catilog790@mytrumail.com",
      "murren_avatar": "default_murren_avatar.png",
      "groups": [],
      "user_permissions": []
    }
  },
  {
    "model": "murren.murren",
    "pk": 230,
    "fields": {
      "password": "pbkdf2_sha256$180000$VjrUpTJiikva$fTNmaFEs1A4ic6T5LiZQqQeeflVYsKVZTrVAm3sjscc=",
      "last_login": null,
      "is_superuser": false,
      "username": "wowiko9755",
      "first_name": "",
      "last_name": "",
      "is_staff": false,
      "is_active": true,
      "date_joined": "2020-03-01T11:35:36.928Z",
      "email": "wowiko9755@jalcemail.net",
      "murren_avatar": "default_murren_avatar.png",
      "groups": [],
      "user_permissions": []
    }
  },
  {
    "model": "murren.murren",
    "pk": 231,
    "fields": {
      "password": "pbkdf2_sha256$180000$PiSURzyxc5aM$EKkCVPPP5fNN8qoeLN5znqBeSR4aiOgMq90zwG9NZRE=",
      "last_login": null,
      "is_superuser": false,
      "username": "noxibol790",
      "first_name": "",
      "last_name": "",
      "is_staff": false,
      "is_active": true,
      "date_joined": "2020-03-01T11:35:41.879Z",
      "email": "noxibol790@finxmail.com",
      "murren_avatar": "default_murren_avatar.png",
      "groups": [],
      "user_permissions": []
    }
  },
  {
    "model": "murren.murren",
    "pk": 232,
    "fields": {
      "password": "pbkdf2_sha256$180000$x6kNn4ZklJGJ$8vAcHnulFfHnzcyZ7SteMBbQE/KFeiudMpilVwmX7MY=",
      "last_login": null,
      "is_superuser": false,
      "username": "neyox74606",
      "first_name": "",
      "last_name": "",
      "is_staff": false,
      "is_active": true,
      "date_joined": "2020-03-01T11:35:46.764Z",
      "email": "neyox74606@p5mail.com",
      "murren_avatar": "default_murren_avatar.png",
      "groups": [],
      "user_permissions": []
    }
  },
  {
    "model": "murren.murren",
    "pk": 233,
    "fields": {
      "password": "pbkdf2_sha256$180000$VPJRRza83OOM$zZSzdpX+RijjNzgbqvA7f/f0XV/l8SekAmmtnEANCeY=",
      "last_login": null,
      "is_superuser": false,
      "username": "ravigo2133",
      "first_name": "",
      "last_name": "",
      "is_staff": false,
      "is_active": true,
      "date_joined": "2020-03-01T11:35:51.682Z",
      "email": "ravigo2133@finxmail.com",
      "murren_avatar": "default_murren_avatar.png",
      "groups": [],
      "user_permissions": []
    }
  },
  {
    "model": "murren.murren",
    "pk": 234,
    "fields": {
      "password": "pbkdf2_sha256$180000$r7uCGbvgz0Sm$phvyLKezphp1ADpEv8zfpmiDHI3lN/PewoRL36c8JxU=",
      "last_login": null,
      "is_superuser": false,
      "username": "biyikev464",
      "first_name": "",
      "last_name": "",
      "is_staff": false,
      "is_active": true,
      "date_joined": "2020-03-01T11:35:56.577Z",
      "email": "biyikev464@edusamail.net",
      "murren_avatar": "default_murren_avatar.png",
      "groups": [],
      "user_permissions": []
    }
  },
  {
    "model": "murren.murren",
    "pk": 235,
    "fields": {
      "password": "pbkdf2_sha256$180000$q6EC1YyXxpG9$qHhUv0d5CeS5d9RpvMh/an9z1Gd3zepAjEJOWRlD9UM=",
      "last_login": null,
      "is_superuser": false,
      "username": "corinal166",
      "first_name": "",
      "last_name": "",
      "is_staff": false,
      "is_active": true,
      "date_joined": "2020-03-01T11:36:01.140Z",
      "email": "corinal166@mailimail.com",
      "murren_avatar": "default_murren_avatar.png",
      "groups": [],
      "user_permissions": []
    }
  }
]