<svg width="120" height="120" viewBox="0 0 120 120" fill="none" xmlns="http://www.w3.org/2000/svg">
<path d="M59.9993 0C29.9993 0 0 15.0002 0 37.5C0 52.5002 11.25 59.9998 11.25 74.9999C11.25 86.2501 7.5 86.2501 7.5 93.7502C7.5 97.4997 19.5025 101.751 29.9995 105L29.9995 120L89.9988 120V105C89.9988 105 112.641 98.0105 112.499 93.7497C112.266 86.7628 108.749 86.2496 108.749 74.9999C108.749 67.4998 120.159 52.1447 119.998 37.5C119.998 14.9997 89.9988 0 59.9993 0V0ZM37.4993 44.9998C45.7835 44.9998 52.4993 51.7159 52.4993 60C52.4993 68.2841 45.7835 75.0002 37.4993 75.0002C29.2158 74.9999 22.5 68.2839 22.5 59.9998C22.5 51.7156 29.2155 44.9996 37.4995 44.9996L37.4993 44.9998ZM82.4988 44.9998C90.7828 44.9998 97.4988 51.7159 97.4988 60C97.4988 68.2841 90.7828 75.0002 82.4988 75.0002C74.2148 75.0002 67.4988 68.2841 67.4988 60C67.4988 51.7159 74.2148 44.9998 82.4988 44.9998V44.9998ZM59.9993 71.2501C63.7493 71.2501 71.2493 86.2503 71.2493 90.0004C71.2493 97.5 71.2493 97.5 67.4993 97.5H52.4993C48.7493 97.5 48.7493 97.5 48.7493 89.9999C48.7493 86.2498 56.2493 71.2501 59.9993 71.2501Z" fill="#AD00FF"/>
</svg>
