<?xml version="1.0" encoding="UTF-8" standalone="no"?>
<svg
   xmlns:dc="http://purl.org/dc/elements/1.1/"
   xmlns:cc="http://creativecommons.org/ns#"
   xmlns:rdf="http://www.w3.org/1999/02/22-rdf-syntax-ns#"
   xmlns:svg="http://www.w3.org/2000/svg"
   xmlns="http://www.w3.org/2000/svg"
   xmlns:sodipodi="http://sodipodi.sourceforge.net/DTD/sodipodi-0.dtd"
   xmlns:inkscape="http://www.inkscape.org/namespaces/inkscape"
   version="1.1"
   id="svg2"
   xml:space="preserve"
   width="132.064"
   height="36.135399"
   viewBox="0 0 132.06399 36.135399"
   sodipodi:docname="CROIX-ROUGE_LOGO-1.svg"
   inkscape:version="1.0.2 (e86c870879, 2021-01-15)"><metadata
     id="metadata8"><rdf:RDF><cc:Work
         rdf:about=""><dc:format>image/svg+xml</dc:format><dc:type
           rdf:resource="http://purl.org/dc/dcmitype/StillImage" /><dc:title></dc:title></cc:Work></rdf:RDF></metadata><defs
     id="defs6" /><sodipodi:namedview
     pagecolor="#ffffff"
     bordercolor="#666666"
     borderopacity="1"
     objecttolerance="10"
     gridtolerance="10"
     guidetolerance="10"
     inkscape:pageopacity="0"
     inkscape:pageshadow="2"
     inkscape:window-width="1920"
     inkscape:window-height="1136"
     id="namedview4"
     showgrid="false"
     inkscape:zoom="7.3336393"
     inkscape:cx="63.435075"
     inkscape:cy="17.007998"
     inkscape:window-x="0"
     inkscape:window-y="0"
     inkscape:window-maximized="1"
     inkscape:current-layer="g12"
     inkscape:document-rotation="0"
     fit-margin-left="6"
     fit-margin-top="0"
     fit-margin-right="0"
     fit-margin-bottom="2" /><g
     id="g10"
     inkscape:groupmode="layer"
     inkscape:label="ink_ext_XXXXXX"
     transform="matrix(1.3333333,0,0,-1.3333333,-6.2666664,45.354666)"><g
       id="g12"
       transform="scale(0.1)"><path
         d="m 782.363,170.082 v 85.039 h 85.039 v 85.039 h 85.039 v -85.039 h 85.039 V 170.082 H 952.441 V 85.0391 h -85.039 v 85.0429 h -85.039"
         style="fill:#ee2722;fill-opacity:1;fill-rule:nonzero;stroke:none"
         id="path14" /><path
         d="m 128.516,244.906 c -1.813,0.481 -3.5,0.719 -5.075,0.719 -2.957,0 -5.515,-0.609 -7.656,-1.852 -2.144,-1.238 -3.91,-2.855 -5.301,-4.847 -1.39,-1.992 -2.41,-4.274 -3.082,-6.84 -0.66,-2.57 -0.996,-5.152 -0.996,-7.75 0,-2.531 0.336,-5.152 0.996,-7.832 0.672,-2.691 1.692,-5.117 3.082,-7.289 1.391,-2.18 3.137,-3.981 5.258,-5.391 2.11,-1.426 4.653,-2.129 7.613,-2.129 0.84,0 1.7,0.082 2.579,0.258 0.867,0.18 1.742,0.434 2.582,0.731 v -12.766 c -1.934,-0.793 -4.024,-1.184 -6.25,-1.184 -4.895,0 -9.215,1.012 -12.965,3.032 -3.75,2.027 -6.899,4.699 -9.4572,8.019 -2.5704,3.32 -4.5235,7.11 -5.8516,11.371 C 92.6641,215.414 92,219.773 92,224.242 c 0,4.235 0.6836,8.395 2.043,12.516 1.3633,4.097 3.3203,7.769 5.8867,10.996 2.5663,3.23 5.6753,5.848 9.3323,7.84 3.652,1.992 7.785,2.992 12.363,2.992 2.238,0 4.535,-0.422 6.891,-1.273 v -12.407"
         style="fill:#231f20;fill-opacity:1;fill-rule:nonzero;stroke:none"
         id="path16" /><path
         d="m 146.18,235.215 v -5.531 h 0.183 c 1.203,1.992 2.606,3.64 4.207,4.941 1.61,1.297 3.676,2.07 6.211,2.309 V 224.52 c -0.301,0.054 -0.621,0.105 -0.953,0.132 -0.332,0.032 -0.676,0.051 -1.039,0.051 -2.117,0 -3.758,-0.34 -4.941,-1.004 -1.176,-0.656 -2.039,-1.547 -2.578,-2.664 -0.551,-1.125 -0.86,-2.433 -0.954,-3.941 -0.097,-1.512 -0.136,-3.121 -0.136,-4.809 v -22.832 h -12.774 v 45.762 h 12.774"
         style="fill:#231f20;fill-opacity:1;fill-rule:nonzero;stroke:none"
         id="path18" /><path
         d="m 177.949,224.613 c -1.094,0 -1.953,-0.523 -2.594,-1.543 -0.628,-1.031 -1.097,-2.242 -1.402,-3.629 -0.297,-1.378 -0.476,-2.757 -0.547,-4.121 -0.062,-1.355 -0.082,-2.367 -0.082,-3.031 0,-0.668 0.02,-1.68 0.082,-3.035 0.071,-1.363 0.25,-2.731 0.547,-4.121 0.305,-1.395 0.774,-2.59 1.402,-3.621 0.641,-1.028 1.5,-1.551 2.594,-1.551 1.078,0 1.938,0.523 2.578,1.551 0.629,1.031 1.098,2.226 1.403,3.621 0.297,1.39 0.488,2.758 0.547,4.121 0.05,1.355 0.089,2.367 0.089,3.035 0,0.664 -0.039,1.676 -0.089,3.031 -0.059,1.364 -0.25,2.743 -0.547,4.121 -0.305,1.387 -0.774,2.598 -1.403,3.629 -0.64,1.02 -1.5,1.543 -2.578,1.543 m 0,11.5 c 3.438,0 6.278,-0.695 8.516,-2.082 2.23,-1.39 3.996,-3.203 5.293,-5.437 1.297,-2.231 2.215,-4.789 2.769,-7.653 0.539,-2.871 0.809,-5.75 0.809,-8.652 0,-2.894 -0.27,-5.766 -0.809,-8.609 -0.554,-2.84 -1.472,-5.379 -2.769,-7.594 -1.297,-2.242 -3.063,-4.066 -5.293,-5.441 -2.238,-1.403 -5.078,-2.082 -8.516,-2.082 -3.453,0 -6.285,0.679 -8.519,2.082 -2.235,1.375 -4.004,3.199 -5.305,5.441 -1.297,2.215 -2.215,4.754 -2.758,7.594 -0.543,2.843 -0.82,5.715 -0.82,8.609 0,2.902 0.277,5.781 0.82,8.652 0.543,2.864 1.461,5.422 2.758,7.653 1.301,2.234 3.07,4.047 5.305,5.437 2.234,1.387 5.066,2.082 8.519,2.082"
         style="fill:#231f20;fill-opacity:1;fill-rule:nonzero;stroke:none"
         id="path20" /><path
         d="m 213.777,189.453 h -12.769 v 45.762 h 12.769 z m -6.429,51.199 c -2.231,0 -4.129,0.797 -5.711,2.399 -1.571,1.594 -2.352,3.539 -2.352,5.84 0,2.289 0.813,4.211 2.453,5.754 1.621,1.535 3.59,2.308 5.891,2.308 1.078,0 2.105,-0.219 3.07,-0.668 0.973,-0.465 1.821,-1.062 2.539,-1.824 0.731,-0.75 1.289,-1.629 1.68,-2.621 0.391,-0.996 0.59,-2.035 0.59,-3.129 0,-1.09 -0.219,-2.121 -0.641,-3.078 -0.418,-0.969 -1.012,-1.828 -1.773,-2.582 -0.746,-0.758 -1.625,-1.348 -2.617,-1.766 -1,-0.422 -2.039,-0.633 -3.129,-0.633"
         style="fill:#231f20;fill-opacity:1;fill-rule:nonzero;stroke:none"
         id="path22" /><path
         d="m 233.598,235.215 3.625,-6.985 1.355,-2.804 5.172,9.789 h 13.219 l -11.68,-21.113 13.5,-24.649 h -13.5 l -6.711,12.602 -6.797,-12.602 h -13.129 l 13.129,24.649 -11.41,21.113 h 13.227"
         style="fill:#231f20;fill-opacity:1;fill-rule:nonzero;stroke:none"
         id="path24" /><path
         d="m 282.969,213.383 h -22.653 v 12.051 h 22.653 v -12.051"
         style="fill:#231f20;fill-opacity:1;fill-rule:nonzero;stroke:none"
         id="path26" /><path
         d="m 304.68,228.418 2.347,-0.094 c 3.078,0 5.286,0.922 6.61,2.762 1.34,1.848 2,4.191 2,7.027 0,1.203 -0.149,2.356 -0.453,3.446 -0.297,1.078 -0.821,2.015 -1.547,2.796 -0.723,0.79 -1.668,1.383 -2.852,1.774 -1.172,0.398 -2.609,0.555 -4.301,0.496 h -1.804 z m -13.504,-38.961 v 68.32 h 13.59 c 2.183,0 4.636,-0.16 7.379,-0.464 2.753,-0.297 5.359,-1.079 7.839,-2.348 2.473,-1.27 4.563,-3.219 6.25,-5.848 1.692,-2.625 2.539,-6.269 2.539,-10.91 0,-3.812 -0.765,-7.242 -2.308,-10.293 -1.539,-3.047 -4.008,-5.508 -7.387,-7.379 l 11.867,-31.078 h -14.222 l -11.871,31.527 h -0.172 v -31.527 h -13.504"
         style="fill:#231f20;fill-opacity:1;fill-rule:nonzero;stroke:none"
         id="path28" /><path
         d="m 351.512,224.613 c -1.086,0 -1.946,-0.523 -2.586,-1.543 -0.629,-1.031 -1.098,-2.242 -1.403,-3.629 -0.296,-1.378 -0.476,-2.757 -0.546,-4.121 -0.051,-1.355 -0.082,-2.367 -0.082,-3.031 0,-0.668 0.031,-1.68 0.082,-3.035 0.07,-1.363 0.25,-2.731 0.546,-4.121 0.305,-1.395 0.774,-2.59 1.403,-3.621 0.64,-1.028 1.5,-1.551 2.586,-1.551 1.086,0 1.945,0.523 2.586,1.551 0.629,1.031 1.097,2.226 1.398,3.621 0.301,1.39 0.488,2.758 0.551,4.121 0.047,1.355 0.09,2.367 0.09,3.035 0,0.664 -0.043,1.676 -0.09,3.031 -0.063,1.364 -0.25,2.743 -0.551,4.121 -0.301,1.387 -0.769,2.598 -1.398,3.629 -0.641,1.02 -1.5,1.543 -2.586,1.543 m 0,11.5 c 3.445,0 6.285,-0.695 8.523,-2.082 2.231,-1.39 3.992,-3.203 5.293,-5.437 1.297,-2.231 2.215,-4.789 2.766,-7.653 0.539,-2.871 0.812,-5.75 0.812,-8.652 0,-2.894 -0.273,-5.766 -0.812,-8.609 -0.551,-2.84 -1.469,-5.379 -2.766,-7.594 -1.301,-2.242 -3.062,-4.066 -5.293,-5.441 -2.238,-1.403 -5.078,-2.082 -8.523,-2.082 -3.446,0 -6.278,0.679 -8.516,2.082 -2.23,1.375 -4.004,3.199 -5.301,5.441 -1.3,2.215 -2.222,4.754 -2.757,7.594 -0.543,2.843 -0.821,5.715 -0.821,8.609 0,2.902 0.278,5.781 0.821,8.652 0.535,2.864 1.457,5.422 2.757,7.653 1.297,2.234 3.071,4.047 5.301,5.437 2.238,1.387 5.07,2.082 8.516,2.082"
         style="fill:#231f20;fill-opacity:1;fill-rule:nonzero;stroke:none"
         id="path30" /><path
         d="m 387.336,235.215 v -25.102 c 0,-0.66 -0.031,-1.527 -0.09,-2.59 -0.058,-1.058 -0.019,-2.109 0.125,-3.168 0.156,-1.05 0.461,-1.964 0.91,-2.71 0.457,-0.762 1.223,-1.133 2.313,-1.133 0.851,0 1.504,0.242 1.957,0.722 0.445,0.489 0.769,1.09 0.945,1.817 0.176,0.722 0.274,1.48 0.274,2.262 v 1.992 l 0.085,27.91 h 12.676 v -29.18 c 0,-5.312 -1.289,-9.562 -3.886,-12.73 -2.594,-3.164 -6.739,-4.75 -12.411,-4.75 -3.632,0 -6.472,0.601 -8.554,1.797 -2.09,1.211 -3.664,2.781 -4.727,4.683 -1.047,1.899 -1.719,3.957 -1.984,6.199 -0.274,2.246 -0.41,4.411 -0.41,6.528 v 27.453 h 12.777"
         style="fill:#231f20;fill-opacity:1;fill-rule:nonzero;stroke:none"
         id="path32" /><path
         d="m 429.98,200.238 c 1.028,0 1.825,0.528 2.391,1.578 0.59,1.059 1.016,2.27 1.328,3.653 0.293,1.386 0.481,2.758 0.539,4.121 0.059,1.348 0.086,2.328 0.086,2.93 0,0.593 -0.027,1.578 -0.086,2.941 -0.058,1.336 -0.246,2.707 -0.539,4.094 -0.312,1.383 -0.761,2.593 -1.363,3.613 -0.609,1.02 -1.449,1.527 -2.531,1.527 -1.086,0 -1.934,-0.507 -2.539,-1.527 -0.606,-1.02 -1.075,-2.211 -1.407,-3.57 -0.332,-1.352 -0.539,-2.707 -0.597,-4.063 -0.047,-1.347 -0.086,-2.355 -0.086,-3.015 0,-0.723 0.039,-1.782 0.086,-3.165 0.058,-1.386 0.265,-2.75 0.597,-4.105 0.332,-1.363 0.821,-2.535 1.446,-3.531 0.633,-0.992 1.535,-1.481 2.675,-1.481 m -5.8,-16.859 c 0.066,-0.723 0.164,-1.461 0.312,-2.25 0.156,-0.793 0.391,-1.5 0.731,-2.141 0.332,-0.629 0.785,-1.14 1.359,-1.531 0.574,-0.402 1.316,-0.602 2.219,-0.602 1.441,0 2.508,0.473 3.172,1.411 0.664,0.945 1.132,2.07 1.406,3.398 0.262,1.324 0.391,2.711 0.359,4.121 -0.027,1.422 -0.039,2.613 -0.039,3.57 v 5.801 h -0.183 c -0.422,-0.84 -0.887,-1.66 -1.407,-2.441 -0.507,-0.777 -1.086,-1.481 -1.718,-2.129 -0.633,-0.629 -1.387,-1.129 -2.227,-1.488 -0.851,-0.364 -1.809,-0.539 -2.902,-0.539 -1.207,0 -2.285,0.211 -3.25,0.629 -0.965,0.421 -1.867,0.988 -2.676,1.718 -0.82,0.731 -1.563,1.539 -2.219,2.442 -0.664,0.91 -1.238,1.847 -1.719,2.808 -1.152,2.301 -1.929,4.821 -2.363,7.578 -0.418,2.731 -0.633,5.391 -0.633,7.922 0,1.992 0.137,4.387 0.403,7.199 0.281,2.809 0.828,5.481 1.675,8.02 0.852,2.543 2.09,4.711 3.711,6.523 1.645,1.817 3.821,2.719 6.536,2.719 2.109,0 3.925,-0.621 5.441,-1.859 1.512,-1.242 2.613,-2.758 3.348,-4.57 h 0.183 v 5.527 h 12.766 v -49.746 c 0,-6.692 -1.453,-11.504 -4.387,-14.399 -2.93,-2.902 -7.176,-4.351 -12.734,-4.351 -5.438,0 -9.473,1.488 -12.086,4.437 -2.629,2.969 -4.106,7.043 -4.399,12.223 h 11.321"
         style="fill:#231f20;fill-opacity:1;fill-rule:nonzero;stroke:none"
         id="path34" /><path
         d="m 473.953,217.906 c 0,0.727 -0.058,1.586 -0.176,2.586 -0.117,0.992 -0.332,1.91 -0.64,2.762 -0.293,0.836 -0.774,1.57 -1.399,2.18 -0.636,0.601 -1.433,0.898 -2.402,0.898 -0.969,0 -1.746,-0.289 -2.356,-0.859 -0.601,-0.582 -1.082,-1.289 -1.453,-2.129 -0.359,-0.84 -0.597,-1.742 -0.722,-2.672 -0.117,-0.942 -0.176,-1.77 -0.176,-2.5 v -1.352 h 9.324 z m 10.781,-8.972 h -20.191 c 0,-0.84 0.016,-1.868 0.086,-3.079 0.059,-1.203 0.215,-2.375 0.5,-3.492 0.269,-1.109 0.73,-2.07 1.394,-2.851 0.672,-0.778 1.602,-1.168 2.813,-1.168 1.633,0 2.723,0.527 3.262,1.578 0.539,1.058 0.808,2.281 0.808,3.672 h 10.879 c -0.312,-2.121 -0.789,-4.082 -1.441,-5.891 -0.676,-1.808 -1.582,-3.402 -2.727,-4.75 -1.152,-1.371 -2.566,-2.441 -4.258,-3.223 -1.687,-0.785 -3.711,-1.175 -6.074,-1.175 -3.262,0 -6.008,0.668 -8.23,1.996 -2.25,1.324 -4.055,3.051 -5.453,5.191 -1.383,2.153 -2.372,4.59 -2.989,7.309 -0.593,2.711 -0.894,5.492 -0.894,8.332 0,2.719 0.269,5.539 0.808,8.469 0.536,2.929 1.485,5.601 2.813,8.019 1.328,2.41 3.105,4.402 5.351,5.934 2.227,1.535 5.008,2.308 8.329,2.308 2.121,0 4.14,-0.468 6.066,-1.402 1.934,-0.938 3.625,-2.328 5.066,-4.168 1.457,-1.844 2.602,-4.117 3.411,-6.844 0.82,-2.707 1.132,-5.886 0.949,-9.504 l -0.278,-5.261"
         style="fill:#231f20;fill-opacity:1;fill-rule:nonzero;stroke:none"
         id="path36" /><path
         d="m 535.742,222.891 c -0.898,0.839 -1.824,1.558 -2.754,2.129 -0.945,0.582 -2.07,0.859 -3.41,0.859 -1.133,0 -2,-0.297 -2.574,-0.91 -0.578,-0.598 -0.863,-1.418 -0.863,-2.442 0,-0.906 0.382,-1.668 1.132,-2.269 0.762,-0.602 1.68,-1.168 2.766,-1.719 1.082,-0.543 2.246,-1.16 3.484,-1.859 1.243,-0.688 2.395,-1.547 3.45,-2.571 1.054,-1.039 1.945,-2.296 2.675,-3.812 0.711,-1.52 1.082,-3.418 1.082,-5.707 0,-2.301 -0.32,-4.41 -0.957,-6.336 -0.632,-1.945 -1.582,-3.625 -2.847,-5.086 -1.274,-1.449 -2.817,-2.578 -4.621,-3.398 -1.809,-0.809 -3.899,-1.211 -6.25,-1.211 -2.481,0 -4.914,0.48 -7.305,1.441 -2.371,0.973 -4.531,2.23 -6.465,3.809 l 5.606,9.05 c 0.976,-0.839 1.953,-1.55 2.957,-2.121 0.988,-0.578 2.129,-0.859 3.398,-0.859 1.016,0 1.895,0.32 2.617,0.988 0.735,0.68 1.098,1.613 1.098,2.813 0,1.027 -0.356,1.871 -1.047,2.539 -0.703,0.66 -1.594,1.301 -2.668,1.91 -1.094,0.59 -2.273,1.242 -3.543,1.937 -1.269,0.704 -2.441,1.575 -3.523,2.633 -1.094,1.051 -2.004,2.379 -2.727,3.981 -0.723,1.609 -1.086,3.609 -1.086,6.031 0,2.176 0.434,4.09 1.27,5.746 0.851,1.66 1.957,3.07 3.351,4.215 1.387,1.144 3.02,2.004 4.883,2.586 1.887,0.57 3.817,0.859 5.809,0.859 2.297,0 4.433,-0.308 6.437,-0.906 1.992,-0.602 3.914,-1.602 5.801,-2.981 l -5.176,-9.339"
         style="fill:#231f20;fill-opacity:1;fill-rule:nonzero;stroke:none"
         id="path38" /><path
         d="m 559.227,235.215 v -25.102 c 0,-0.66 -0.028,-1.527 -0.086,-2.59 -0.071,-1.058 -0.02,-2.109 0.125,-3.168 0.16,-1.05 0.461,-1.964 0.918,-2.71 0.453,-0.762 1.211,-1.133 2.304,-1.133 0.852,0 1.496,0.242 1.946,0.722 0.457,0.489 0.781,1.09 0.957,1.817 0.175,0.722 0.273,1.48 0.273,2.262 v 1.992 l 0.09,27.91 h 12.676 v -29.18 c 0,-5.312 -1.293,-9.562 -3.887,-12.73 -2.609,-3.164 -6.738,-4.75 -12.414,-4.75 -3.633,0 -6.477,0.601 -8.555,1.797 -2.09,1.211 -3.664,2.781 -4.726,4.683 -1.055,1.899 -1.719,3.957 -1.985,6.199 -0.269,2.246 -0.41,4.411 -0.41,6.528 v 27.453 h 12.774"
         style="fill:#231f20;fill-opacity:1;fill-rule:nonzero;stroke:none"
         id="path40" /><path
         d="m 597.91,189.453 h -12.773 v 45.762 h 12.773 z m -6.445,51.199 c -2.227,0 -4.129,0.797 -5.703,2.399 -1.563,1.594 -2.344,3.539 -2.344,5.84 0,2.289 0.801,4.211 2.441,5.754 1.621,1.535 3.582,2.308 5.879,2.308 1.094,0 2.11,-0.219 3.075,-0.668 0.968,-0.465 1.828,-1.062 2.539,-1.824 0.734,-0.75 1.3,-1.629 1.671,-2.621 0.403,-0.996 0.606,-2.035 0.606,-3.129 0,-1.09 -0.227,-2.121 -0.645,-3.078 -0.429,-0.969 -1.007,-1.828 -1.757,-2.582 -0.774,-0.758 -1.633,-1.348 -2.629,-1.766 -1.004,-0.422 -2.039,-0.633 -3.133,-0.633"
         style="fill:#231f20;fill-opacity:1;fill-rule:nonzero;stroke:none"
         id="path42" /><path
         d="m 626.582,222.891 c -0.898,0.839 -1.836,1.558 -2.754,2.129 -0.937,0.582 -2.07,0.859 -3.398,0.859 -1.153,0 -2.012,-0.297 -2.586,-0.91 -0.586,-0.598 -0.852,-1.418 -0.852,-2.442 0,-0.906 0.371,-1.668 1.121,-2.269 0.754,-0.602 1.672,-1.168 2.766,-1.719 1.094,-0.543 2.234,-1.16 3.484,-1.859 1.231,-0.688 2.395,-1.547 3.45,-2.571 1.054,-1.039 1.945,-2.296 2.675,-3.812 0.723,-1.52 1.082,-3.418 1.082,-5.707 0,-2.301 -0.32,-4.41 -0.965,-6.336 -0.625,-1.945 -1.574,-3.625 -2.832,-5.086 -1.281,-1.449 -2.812,-2.578 -4.636,-3.398 -1.809,-0.809 -3.891,-1.211 -6.25,-1.211 -2.485,0 -4.907,0.48 -7.278,1.441 -2.402,0.973 -4.55,2.23 -6.496,3.809 l 5.617,9.05 c 0.965,-0.839 1.954,-1.55 2.95,-2.121 0.988,-0.578 2.129,-0.859 3.398,-0.859 1.035,0 1.914,0.32 2.625,0.988 0.735,0.68 1.098,1.613 1.098,2.813 0,1.027 -0.344,1.871 -1.059,2.539 -0.691,0.66 -1.57,1.301 -2.664,1.91 -1.086,0.59 -2.265,1.242 -3.535,1.937 -1.262,0.704 -2.441,1.575 -3.527,2.633 -1.082,1.051 -2.008,2.379 -2.723,3.981 -0.723,1.609 -1.074,3.609 -1.074,6.031 0,2.176 0.41,4.09 1.258,5.746 0.851,1.66 1.964,3.07 3.351,4.215 1.375,1.144 3.016,2.004 4.902,2.586 1.844,0.57 3.79,0.859 5.782,0.859 2.293,0 4.441,-0.308 6.445,-0.906 1.992,-0.602 3.926,-1.602 5.801,-2.981 l -5.176,-9.339"
         style="fill:#231f20;fill-opacity:1;fill-rule:nonzero;stroke:none"
         id="path44" /><path
         d="m 659.063,222.891 c -0.911,0.839 -1.829,1.558 -2.754,2.129 -0.938,0.582 -2.071,0.859 -3.399,0.859 -1.152,0 -2.012,-0.297 -2.578,-0.91 -0.598,-0.598 -0.859,-1.418 -0.859,-2.442 0,-0.906 0.371,-1.668 1.113,-2.269 0.762,-0.602 1.672,-1.168 2.773,-1.719 1.094,-0.543 2.235,-1.16 3.485,-1.859 1.23,-0.688 2.394,-1.547 3.449,-2.571 1.055,-1.039 1.941,-2.296 2.676,-3.812 0.722,-1.52 1.074,-3.418 1.074,-5.707 0,-2.301 -0.313,-4.41 -0.949,-6.336 -0.633,-1.945 -1.571,-3.625 -2.852,-5.086 -1.277,-1.449 -2.801,-2.578 -4.629,-3.398 -1.797,-0.809 -3.875,-1.211 -6.25,-1.211 -2.476,0 -4.89,0.48 -7.273,1.441 -2.395,0.973 -4.551,2.23 -6.496,3.809 l 5.625,9.05 c 0.961,-0.839 1.933,-1.55 2.941,-2.121 0.985,-0.578 2.129,-0.859 3.399,-0.859 1.035,0 1.914,0.32 2.625,0.988 0.734,0.68 1.086,1.613 1.086,2.813 0,1.027 -0.332,1.871 -1.047,2.539 -0.68,0.66 -1.571,1.301 -2.664,1.91 -1.086,0.59 -2.266,1.242 -3.528,1.937 -1.269,0.704 -2.449,1.575 -3.543,2.633 -1.086,1.051 -2.004,2.379 -2.715,3.981 -0.722,1.609 -1.074,3.609 -1.074,6.031 0,2.176 0.41,4.09 1.27,5.746 0.84,1.66 1.953,3.07 3.34,4.215 1.375,1.144 3.015,2.004 4.89,2.586 1.867,0.57 3.813,0.859 5.805,0.859 2.293,0 4.43,-0.308 6.434,-0.906 1.992,-0.602 3.925,-1.602 5.8,-2.981 l -5.175,-9.339"
         style="fill:#231f20;fill-opacity:1;fill-rule:nonzero;stroke:none"
         id="path46" /><path
         d="m 690.555,217.906 c 0,0.727 -0.059,1.586 -0.184,2.586 -0.117,0.992 -0.32,1.91 -0.625,2.762 -0.305,0.836 -0.773,1.57 -1.406,2.18 -0.625,0.601 -1.445,0.898 -2.402,0.898 -0.969,0 -1.75,-0.289 -2.352,-0.859 -0.617,-0.582 -1.098,-1.289 -1.457,-2.129 -0.363,-0.84 -0.598,-1.742 -0.723,-2.672 -0.117,-0.942 -0.187,-1.77 -0.187,-2.5 v -1.352 h 9.336 z m 10.785,-8.972 h -20.207 c 0,-0.84 0.039,-1.868 0.086,-3.079 0.07,-1.203 0.226,-2.375 0.508,-3.492 0.277,-1.109 0.722,-2.07 1.398,-2.851 0.664,-0.778 1.602,-1.168 2.813,-1.168 1.628,0 2.714,0.527 3.261,1.578 0.547,1.058 0.821,2.281 0.821,3.672 h 10.867 c -0.301,-2.121 -0.789,-4.082 -1.453,-5.891 -0.664,-1.808 -1.575,-3.402 -2.715,-4.75 -1.153,-1.371 -2.571,-2.441 -4.27,-3.223 -1.687,-0.785 -3.711,-1.175 -6.062,-1.175 -3.262,0 -6.004,0.668 -8.242,1.996 -2.239,1.324 -4.051,3.051 -5.43,5.191 -1.387,2.153 -2.383,4.59 -2.988,7.309 -0.618,2.711 -0.911,5.492 -0.911,8.332 0,2.719 0.266,5.539 0.813,8.469 0.547,2.929 1.484,5.601 2.801,8.019 1.34,2.41 3.117,4.402 5.351,5.934 2.239,1.535 5.012,2.308 8.34,2.308 2.109,0 4.133,-0.468 6.067,-1.402 1.921,-0.938 3.621,-2.328 5.078,-4.168 1.433,-1.844 2.578,-4.117 3.398,-6.844 0.82,-2.707 1.133,-5.886 0.945,-9.504 l -0.269,-5.261"
         style="fill:#231f20;fill-opacity:1;fill-rule:nonzero;stroke:none"
         id="path48" /><path
         d="m 352.363,86.9375 c -1.207,-0.8398 -2.59,-1.5234 -4.125,-2.0312 -1.535,-0.5118 -3.062,-0.7618 -4.57,-0.7618 -2.66,0 -4.973,0.5235 -6.934,1.5821 -1.961,1.0507 -3.629,2.4726 -4.98,4.2578 -1.359,1.7734 -2.469,3.8125 -3.309,6.0586 -0.851,2.2734 -1.511,4.602 -1.992,7.023 -0.484,2.422 -0.801,4.829 -0.949,7.211 -0.156,2.379 -0.242,4.547 -0.242,6.489 0,1.863 0.043,4.078 0.105,6.64 0.059,2.571 0.285,5.25 0.68,8.02 0.387,2.793 0.98,5.531 1.758,8.242 0.789,2.73 1.879,5.168 3.269,7.348 1.383,2.179 3.149,3.922 5.293,5.25 2.149,1.332 4.789,2 7.93,2 1.269,0 2.676,-0.168 4.219,-0.5 1.539,-0.328 2.816,-0.891 3.847,-1.672 v -6.977 c -1.269,0.84 -2.519,1.547 -3.761,2.117 -1.239,0.582 -2.645,0.871 -4.215,0.871 -2.77,0 -4.992,-0.917 -6.653,-2.718 -1.671,-1.824 -2.929,-4.114 -3.808,-6.891 -0.879,-2.777 -1.449,-5.879 -1.719,-9.277 -0.273,-3.414 -0.41,-6.696 -0.41,-9.844 0,-1.328 0.019,-2.969 0.047,-4.926 0.031,-1.965 0.164,-4.015 0.402,-6.164 0.238,-2.148 0.609,-4.301 1.09,-6.441 0.488,-2.137 1.18,-4.0667 2.09,-5.801 0.898,-1.7188 2.031,-3.0977 3.387,-4.1602 1.363,-1.0586 3.074,-1.5859 5.121,-1.5859 1.578,0 3.074,0.2969 4.488,0.9179 1.422,0.5821 2.734,1.3204 3.941,2.1719 v -6.4492"
         style="fill:#231f20;fill-opacity:1;fill-rule:nonzero;stroke:none"
         id="path50" /><path
         d="m 377.273,109.059 c 0,2.527 -0.078,4.894 -0.222,7.117 -0.156,2.203 -0.449,4.14 -0.899,5.832 -0.468,1.687 -1.113,3.015 -1.953,3.988 -0.851,0.961 -1.992,1.449 -3.437,1.449 -1.629,0 -2.926,-0.582 -3.864,-1.718 -0.929,-1.153 -1.628,-2.622 -2.078,-4.391 -0.449,-1.789 -0.722,-3.75 -0.82,-5.891 -0.082,-2.14 -0.133,-4.218 -0.133,-6.218 0,-4.832 0.18,-8.582 0.543,-11.2661 0.371,-2.7031 0.848,-4.6953 1.449,-5.9843 0.602,-1.2969 1.321,-2.1094 2.129,-2.4024 0.821,-0.2969 1.649,-0.4492 2.489,-0.4492 1.449,0 2.617,0.3438 3.488,1.0313 0.871,0.707 1.562,1.8515 2.043,3.4531 0.476,1.5859 0.816,3.664 1.004,6.1953 0.176,2.5433 0.261,5.6293 0.261,9.2543 m 5.344,-24.0121 h -5.89 v 3.6211 h -0.172 c -0.852,-1.3203 -1.926,-2.3828 -3.227,-3.1602 -1.285,-0.8008 -2.781,-1.1914 -4.48,-1.1914 -1.871,0 -3.5,0.3203 -4.887,0.9531 -1.395,0.6368 -2.535,1.8672 -3.445,3.6641 -0.907,1.8125 -1.59,4.3125 -2.039,7.4727 -0.45,3.1875 -0.68,7.3087 -0.68,12.3787 0,2.582 0.078,5.281 0.23,8.059 0.141,2.793 0.602,5.312 1.364,7.558 0.746,2.274 1.898,4.133 3.437,5.621 1.543,1.485 3.731,2.223 6.559,2.223 1.636,0 3.015,-0.332 4.129,-0.992 1.113,-0.668 2.129,-1.625 3.039,-2.899 h 0.172 v 3.172 h 5.89 V 85.0469"
         style="fill:#231f20;fill-opacity:1;fill-rule:nonzero;stroke:none"
         id="path52" /><path
         d="m 396.672,127.809 c 1.211,1.402 2.574,2.48 4.121,3.254 1.531,0.781 3.211,1.183 5.027,1.183 2.051,0 3.684,-0.43 4.883,-1.269 1.211,-0.848 2.117,-1.95 2.727,-3.309 0.593,-1.359 0.972,-2.863 1.129,-4.523 0.148,-1.672 0.226,-3.278 0.226,-4.86 V 85.0469 h -5.89 v 32.6091 c 0,1.391 -0.047,2.68 -0.125,3.852 -0.098,1.168 -0.325,2.207 -0.696,3.086 -0.359,0.875 -0.886,1.574 -1.582,2.082 -0.683,0.512 -1.648,0.769 -2.851,0.769 -1.7,0 -3.004,-0.41 -3.946,-1.218 -0.925,-0.821 -1.629,-1.852 -2.078,-3.082 -0.449,-1.25 -0.73,-2.579 -0.82,-3.981 -0.086,-1.43 -0.125,-2.746 -0.125,-3.949 V 85.0469 h -5.891 v 46.4801 h 5.891 v -3.718"
         style="fill:#231f20;fill-opacity:1;fill-rule:nonzero;stroke:none"
         id="path54" /><path
         d="M 438.973,126.078 H 431.27 V 85.0469 h -5.879 v 41.0311 h -4.993 v 5.449 h 4.993 v 12.684 h 5.879 v -12.684 h 7.703 v -5.449"
         style="fill:#231f20;fill-opacity:1;fill-rule:nonzero;stroke:none"
         id="path56" /><path
         d="m 453.926,126.813 c -1.153,0 -2.141,-0.352 -2.988,-1.043 -0.848,-0.711 -1.536,-1.622 -2.043,-2.743 -0.508,-1.109 -0.918,-2.379 -1.219,-3.781 -0.313,-1.394 -0.528,-2.777 -0.684,-4.129 -0.156,-1.379 -0.234,-2.668 -0.265,-3.879 -0.039,-1.218 -0.055,-2.179 -0.055,-2.918 0,-1.152 0.055,-2.75 0.133,-4.82 0.097,-2.059 0.375,-4.1094 0.824,-6.1328 0.445,-2.0508 1.18,-3.8086 2.176,-5.3359 0.988,-1.5235 2.375,-2.2813 4.121,-2.2813 1.75,0 3.117,0.7578 4.121,2.2813 0.996,1.5273 1.719,3.2851 2.176,5.3359 0.453,2.0234 0.722,4.0738 0.812,6.1328 0.086,2.07 0.137,3.668 0.137,4.82 0,0.739 -0.02,1.7 -0.051,2.918 -0.027,1.211 -0.113,2.5 -0.273,3.879 -0.145,1.352 -0.371,2.735 -0.672,4.129 -0.305,1.402 -0.711,2.672 -1.223,3.781 -0.508,1.121 -1.191,2.032 -2.039,2.743 -0.851,0.691 -1.836,1.043 -2.988,1.043 m 0,5.437 c 3.078,0 5.488,-0.84 7.246,-2.543 1.75,-1.699 3.086,-3.75 3.996,-6.207 0.895,-2.441 1.465,-5.043 1.707,-7.793 0.242,-2.746 0.371,-5.211 0.371,-7.387 0,-2.164 -0.129,-4.64 -0.371,-7.422 -0.242,-2.7691 -0.812,-5.3902 -1.707,-7.8355 -0.91,-2.4414 -2.246,-4.5117 -3.996,-6.2031 -1.758,-1.6992 -4.168,-2.5391 -7.246,-2.5391 -3.086,0 -5.496,0.8399 -7.254,2.5391 -1.75,1.6914 -3.078,3.7617 -3.988,6.2031 -0.899,2.4453 -1.485,5.0664 -1.715,7.8355 -0.246,2.782 -0.364,5.258 -0.364,7.422 0,2.176 0.118,4.641 0.364,7.387 0.23,2.75 0.816,5.352 1.715,7.793 0.91,2.457 2.238,4.508 3.988,6.207 1.758,1.703 4.168,2.543 7.254,2.543"
         style="fill:#231f20;fill-opacity:1;fill-rule:nonzero;stroke:none"
         id="path58" /><path
         d="m 480.02,127.809 c 1.21,1.402 2.578,2.48 4.121,3.254 1.535,0.781 3.211,1.183 5.031,1.183 2.047,0 3.68,-0.43 4.883,-1.269 1.207,-0.848 2.105,-1.95 2.722,-3.309 0.594,-1.359 0.977,-2.863 1.133,-4.523 0.145,-1.672 0.227,-3.278 0.227,-4.86 V 85.0469 h -5.891 v 32.6091 c 0,1.391 -0.051,2.68 -0.129,3.852 -0.097,1.168 -0.32,2.207 -0.691,3.086 -0.363,0.875 -0.891,1.574 -1.582,2.082 -0.684,0.512 -1.653,0.769 -2.864,0.769 -1.687,0 -2.996,-0.41 -3.933,-1.218 -0.93,-0.821 -1.629,-1.852 -2.078,-3.082 -0.453,-1.25 -0.727,-2.579 -0.824,-3.981 -0.086,-1.43 -0.125,-2.746 -0.125,-3.949 V 85.0469 h -5.887 v 46.4801 h 5.887 v -3.718"
         style="fill:#231f20;fill-opacity:1;fill-rule:nonzero;stroke:none"
         id="path60" /><path
         d="m 539.48,109.059 c 0,2.66 -0.085,5.097 -0.261,7.328 -0.188,2.242 -0.508,4.179 -0.957,5.801 -0.457,1.64 -1.114,2.91 -1.992,3.847 -0.879,0.942 -1.973,1.41 -3.301,1.41 -1.629,0 -2.918,-0.64 -3.86,-1.898 -0.933,-1.281 -1.64,-2.852 -2.089,-4.711 -0.45,-1.883 -0.711,-3.867 -0.809,-5.988 -0.09,-2.114 -0.137,-3.985 -0.137,-5.621 0,-0.723 -0.019,-1.723 -0.051,-2.981 -0.027,-1.262 0,-2.672 0.098,-4.172 0.09,-1.508 0.234,-3.0076 0.449,-4.5271 0.215,-1.5117 0.567,-2.8906 1.047,-4.1602 0.477,-1.2734 1.121,-2.3125 1.942,-3.0898 0.812,-0.7813 1.859,-1.1719 3.125,-1.1719 1.582,0 2.824,0.4688 3.722,1.4023 0.899,0.9258 1.59,2.2696 2.039,3.9883 0.45,1.7188 0.743,3.8008 0.86,6.2504 0.121,2.441 0.175,5.211 0.175,8.293 m -0.535,-20.391 h -0.195 c -0.84,-1.3203 -1.914,-2.3828 -3.203,-3.1602 -1.301,-0.8008 -2.793,-1.1914 -4.484,-1.1914 -2.422,0 -4.344,0.6875 -5.801,2.0313 -1.446,1.3671 -2.567,3.1875 -3.36,5.4492 -0.781,2.2617 -1.297,4.8672 -1.543,7.7969 -0.23,2.9292 -0.359,5.9722 -0.359,9.1912 0,3.129 0.129,6.141 0.359,9.012 0.246,2.867 0.774,5.348 1.594,7.48 0.82,2.11 1.981,3.789 3.496,5.071 1.504,1.269 3.555,1.898 6.153,1.898 1.628,0 3.007,-0.332 4.121,-0.992 1.113,-0.668 2.129,-1.625 3.027,-2.899 h 0.195 v 29.168 h 5.891 V 85.0469 h -5.891 v 3.6211"
         style="fill:#231f20;fill-opacity:1;fill-rule:nonzero;stroke:none"
         id="path62" /><path
         d="m 558.516,131.527 v -29.242 c 0,-1.578 0.039,-3.1209 0.125,-4.6287 0.089,-1.5196 0.351,-2.8711 0.773,-4.0391 0.422,-1.1797 1.055,-2.125 1.856,-2.8125 0.82,-0.707 1.953,-1.0586 3.41,-1.0586 1.5,0 2.683,0.3516 3.523,1.0586 0.852,0.6875 1.477,1.6328 1.863,2.8125 0.383,1.168 0.637,2.5195 0.762,4.0391 0.129,1.5078 0.188,3.0507 0.188,4.6287 v 29.242 h 5.898 V 97.3672 c 0,-3.9297 -0.996,-7.0899 -2.961,-9.4727 -1.961,-2.3867 -5.019,-3.5781 -9.187,-3.5781 -4.172,0 -7.239,1.1797 -9.192,3.5391 -1.972,2.3593 -2.945,5.5312 -2.945,9.5117 v 34.1598 h 5.887"
         style="fill:#231f20;fill-opacity:1;fill-rule:nonzero;stroke:none"
         id="path64" /><path
         d="m 613.992,97.8164 c 0,-2.1133 -0.074,-4.0234 -0.23,-5.7031 -0.149,-1.6875 -0.539,-3.1289 -1.184,-4.2969 -0.625,-1.1914 -1.601,-2.0898 -2.949,-2.7187 -1.309,-0.6446 -3.125,-0.9532 -5.43,-0.9532 -2.59,0 -5.058,0.5625 -7.433,1.7188 v 6.6133 c 0.918,-0.8203 1.886,-1.5196 2.902,-2.0625 1.035,-0.5703 2.148,-0.8399 3.348,-0.8399 1.047,0 1.847,0.1914 2.453,0.5821 0.605,0.3906 1.074,0.9179 1.406,1.5859 0.32,0.6641 0.547,1.4297 0.645,2.3164 0.078,0.8672 0.125,1.7578 0.125,2.6641 v 56.6323 h 6.347 V 97.8164"
         style="fill:#231f20;fill-opacity:1;fill-rule:nonzero;stroke:none"
         id="path66" /><path
         d="m 629.031,131.527 v -29.242 c 0,-1.578 0.051,-3.1209 0.129,-4.6287 0.098,-1.5196 0.352,-2.8711 0.781,-4.0391 0.411,-1.1797 1.028,-2.125 1.844,-2.8125 0.813,-0.707 1.965,-1.0586 3.399,-1.0586 1.515,0 2.699,0.3516 3.546,1.0586 0.84,0.6875 1.454,1.6328 1.844,2.8125 0.395,1.168 0.656,2.5195 0.774,4.0391 0.125,1.5078 0.195,3.0507 0.195,4.6287 v 29.242 h 5.879 V 97.3672 c 0,-3.9297 -0.996,-7.0899 -2.949,-9.4727 -1.953,-2.3867 -5.02,-3.5781 -9.2,-3.5781 -4.16,0 -7.238,1.1797 -9.179,3.5391 -1.973,2.3593 -2.949,5.5312 -2.949,9.5117 v 34.1598 h 5.886"
         style="fill:#231f20;fill-opacity:1;fill-rule:nonzero;stroke:none"
         id="path68" /><path
         d="m 661.102,125.367 h 0.187 c 0.293,0.766 0.684,1.586 1.172,2.434 0.488,0.851 1.023,1.613 1.68,2.273 0.625,0.656 1.347,1.192 2.16,1.59 0.828,0.391 1.707,0.582 2.683,0.582 v -6.879 l -1.171,0.086 c -1.512,0 -2.735,-0.351 -3.633,-1.051 -0.899,-0.687 -1.582,-1.64 -2.043,-2.839 -0.438,-1.215 -0.742,-2.618 -0.848,-4.219 -0.129,-1.602 -0.187,-3.34 -0.187,-5.211 v -27.09 h -5.887 v 46.48 h 5.887 v -6.156"
         style="fill:#231f20;fill-opacity:1;fill-rule:nonzero;stroke:none"
         id="path70" /><path
         d="m 691.902,109.059 c 0,2.527 -0.086,4.894 -0.222,7.117 -0.157,2.203 -0.45,4.14 -0.918,5.832 -0.449,1.687 -1.106,3.015 -1.946,3.988 -0.847,0.961 -1.98,1.449 -3.445,1.449 -1.621,0 -2.91,-0.582 -3.84,-1.718 -0.937,-1.153 -1.629,-2.622 -2.078,-4.391 -0.469,-1.789 -0.734,-3.75 -0.82,-5.891 -0.098,-2.14 -0.137,-4.218 -0.137,-6.218 0,-4.832 0.176,-8.582 0.547,-11.2661 0.352,-2.7031 0.84,-4.6953 1.434,-5.9843 0.617,-1.2969 1.308,-2.1094 2.128,-2.4024 0.825,-0.2969 1.641,-0.4492 2.493,-0.4492 1.465,0 2.617,0.3438 3.496,1.0313 0.879,0.707 1.551,1.8515 2.051,3.4531 0.468,1.5859 0.8,3.664 0.996,6.1953 0.175,2.5433 0.261,5.6293 0.261,9.2543 m 5.344,-24.0121 h -5.891 v 3.6211 h -0.183 c -0.84,-1.3203 -1.926,-2.3828 -3.203,-3.1602 -1.309,-0.8008 -2.801,-1.1914 -4.492,-1.1914 -1.875,0 -3.497,0.3203 -4.883,0.9531 -1.406,0.6368 -2.539,1.8672 -3.457,3.6641 -0.91,1.8125 -1.582,4.3125 -2.032,7.4727 -0.449,3.1875 -0.683,7.3087 -0.683,12.3787 0,2.582 0.078,5.281 0.234,8.059 0.149,2.793 0.606,5.312 1.348,7.558 0.762,2.274 1.894,4.133 3.457,5.621 1.523,1.485 3.719,2.223 6.562,2.223 1.629,0 3.008,-0.332 4.122,-0.992 1.101,-0.668 2.128,-1.625 3.027,-2.899 h 0.183 v 3.172 h 5.891 V 85.0469"
         style="fill:#231f20;fill-opacity:1;fill-rule:nonzero;stroke:none"
         id="path72" /></g></g></svg>
