<?xml version="1.0" encoding="UTF-8" standalone="no"?>
<!-- Created with Inkscape (http://www.inkscape.org/) -->

<svg
   version="1.1"
   id="svg2"
   width="160.14287"
   height="151.2291"
   viewBox="0 0 160.14287 151.2291"
   xmlns="http://www.w3.org/2000/svg"
   xmlns:svg="http://www.w3.org/2000/svg">
  <defs
     id="defs6" />
  <g
     id="g8"
     transform="translate(-82.880163,-4.8075069)">
    <path
       style="fill:#000000"
       d="m 106.09121,154.52323 c -0.95803,-0.98641 -1.25,-10.7001 -1.25,-41.58702 V 72.636209 h -9.87756 c -10.188386,0 -12.725655,-0.933759 -11.955015,-4.399656 0.458861,-2.063692 77.369575,-59.6003443 79.669305,-59.6003443 1.01952,0 6.63528,3.6000003 12.47946,8.0000003 12.85534,9.678599 11.68381,9.70957 11.68381,-0.30887 0,-5.884088 0.10416,-11.2294318 0.10416,-11.2294318 0,0 6.68738,-0.4230454 13.40892,-0.2479335 l 10.98692,0.286235 0.5,19.6825243 0.5,19.682524 14.65849,11.014909 c 20.479,15.388636 20.86394,17.120043 3.80633,17.120043 h -9.96482 v 39.928571 c 0,49.31826 4.07875,43.41082 -29.62752,42.91089 -30.72601,-0.45572 -26.98793,0.52447 -26.98805,0.56093 l -0.2943,-15.98332 11.73261,-3.54932 c 10.85805,-3.28475 15.39219,-7.21845 20.61345,-13.01591 18.53104,-20.57607 -6.84561,-48.701263 -28.62757,-31.72824 -4.60762,3.59037 -4.54154,3.59385 -10.7203,-0.564149 -22.04137,-14.832748 -45.68259,11.942819 -28.53647,32.319829 3.18676,3.78724 3.72537,3.83973 5.49379,0.53541 2.87063,-5.36383 10.361,-6.9652 24.67699,-5.27572 5.37754,0.63463 14.50235,1.20048 20.27735,1.25745 15.82348,0.1561 13.80096,6.70215 -2.50102,8.09476 -16.75096,1.43096 -15.11875,0.0191 -15.80516,13.67106 -0.33419,6.64669 -0.88901,12.36629 -1.23294,12.71021 -1.34936,1.34937 -51.90103,1.36321 -53.21088,0.0146 z m 61.5,-38.5554 c -2.63467,-0.72004 -2.31529,-6.47415 0.5,-9.00829 6.39049,-5.7523 14.76737,-1.54319 13.58288,6.82496 -0.33529,2.36874 -8.67404,3.66153 -14.08288,2.18333 z m -21.42126,-1.78938 c -9.28653,-4.03958 -6.06721,-17.54224 4.18244,-17.54224 9.15288,0 11.4956,14.01009 2.94045,17.58466 -3.97894,1.6625 -3.1927,1.66718 -7.12289,-0.0424 z"
       id="path293" />
  </g>
</svg>
