EESchema Schematic File Version 4
EELAYER 30 0
EELAYER END
$Descr A4 11693 8268
encoding utf-8
Sheet 2 2
Title ""
Date ""
Rev ""
Comp ""
Comment1 ""
Comment2 ""
Comment3 ""
Comment4 ""
$EndDescr
$Comp
L Device:R_POT_Dual_Separate RV?
U 1 1 6075B0A2
P 3700 2400
F 0 "RV?" H 3631 2446 50  0000 R CNN
F 1 "Потенциометр_16K1-B10K" H 3631 2355 50  0000 R CNN
F 2 "" H 3700 2400 50  0001 C CNN
F 3 "~" H 3700 2400 50  0001 C CNN
	1    3700 2400
	1    0    0    -1  
$EndComp
$Comp
L Device:R_POT_Dual_Separate RV?
U 1 1 6075B0A8
P 2200 2400
F 0 "RV?" H 2131 2446 50  0000 R CNN
F 1 "Потенциометр_16K1-B10K" H 2131 2355 50  0000 R CNN
F 2 "" H 2200 2400 50  0001 C CNN
F 3 "~" H 2200 2400 50  0001 C CNN
	1    2200 2400
	1    0    0    -1  
$EndComp
$Comp
L Switch:SW_MEC_5G SW?
U 1 1 6075B0AE
P 3650 4550
F 0 "SW?" H 3650 4835 50  0000 C CNN
F 1 "Кнопка_PBS-15B" H 3650 4744 50  0000 C CNN
F 2 "" H 3650 4750 50  0001 C CNN
F 3 "http://www.apem.com/int/index.php?controller=attachment&id_attachment=488" H 3650 4750 50  0001 C CNN
	1    3650 4550
	1    0    0    -1  
$EndComp
$Comp
L mylib:Тумблер_MTS-102 D?
U 1 1 6075BAB2
P 6700 4300
F 0 "D?" H 6828 4159 50  0000 L CNN
F 1 "Тумблер_MTS-102" H 6828 4068 50  0000 L CNN
F 2 "" H 6900 4100 50  0001 C CNN
F 3 "" H 6900 4100 50  0001 C CNN
	1    6700 4300
	1    0    0    -1  
$EndComp
NoConn ~ 3850 2400
NoConn ~ 2350 2400
$Comp
L Device:R R?
U 1 1 60761518
P 3700 2850
F 0 "R?" H 3770 2896 50  0000 L CNN
F 1 "10K" H 3770 2805 50  0000 L CNN
F 2 "" V 3630 2850 50  0001 C CNN
F 3 "~" H 3700 2850 50  0001 C CNN
	1    3700 2850
	1    0    0    -1  
$EndComp
$Comp
L power:GND #PWR?
U 1 1 60761F4A
P 3700 3000
F 0 "#PWR?" H 3700 2750 50  0001 C CNN
F 1 "GND" H 3705 2827 50  0000 C CNN
F 2 "" H 3700 3000 50  0001 C CNN
F 3 "" H 3700 3000 50  0001 C CNN
	1    3700 3000
	1    0    0    -1  
$EndComp
$Comp
L power:+5V #PWR?
U 1 1 60762848
P 3700 2250
F 0 "#PWR?" H 3700 2100 50  0001 C CNN
F 1 "+5V" H 3715 2423 50  0000 C CNN
F 2 "" H 3700 2250 50  0001 C CNN
F 3 "" H 3700 2250 50  0001 C CNN
	1    3700 2250
	1    0    0    -1  
$EndComp
Wire Wire Line
	3700 2550 3700 2650
Text HLabel 3350 2650 0    50   Output ~ 0
POT_2
Wire Wire Line
	3350 2650 3700 2650
Connection ~ 3700 2650
Wire Wire Line
	3700 2650 3700 2700
$Comp
L Device:R R?
U 1 1 60763CFA
P 2200 2850
F 0 "R?" H 2270 2896 50  0000 L CNN
F 1 "10K" H 2270 2805 50  0000 L CNN
F 2 "" V 2130 2850 50  0001 C CNN
F 3 "~" H 2200 2850 50  0001 C CNN
	1    2200 2850
	1    0    0    -1  
$EndComp
$Comp
L power:GND #PWR?
U 1 1 607644BF
P 2200 3000
F 0 "#PWR?" H 2200 2750 50  0001 C CNN
F 1 "GND" H 2205 2827 50  0000 C CNN
F 2 "" H 2200 3000 50  0001 C CNN
F 3 "" H 2200 3000 50  0001 C CNN
	1    2200 3000
	1    0    0    -1  
$EndComp
$Comp
L power:+5V #PWR?
U 1 1 607647AD
P 2200 2250
F 0 "#PWR?" H 2200 2100 50  0001 C CNN
F 1 "+5V" H 2215 2423 50  0000 C CNN
F 2 "" H 2200 2250 50  0001 C CNN
F 3 "" H 2200 2250 50  0001 C CNN
	1    2200 2250
	1    0    0    -1  
$EndComp
Wire Wire Line
	2200 2550 2200 2650
Text HLabel 1950 2650 0    50   Output ~ 0
POT_1
Wire Wire Line
	1950 2650 2200 2650
Connection ~ 2200 2650
Wire Wire Line
	2200 2650 2200 2700
$Comp
L Device:R R?
U 1 1 60764E31
P 2950 4400
F 0 "R?" H 3020 4446 50  0000 L CNN
F 1 "10K" H 3020 4355 50  0000 L CNN
F 2 "" V 2880 4400 50  0001 C CNN
F 3 "~" H 2950 4400 50  0001 C CNN
	1    2950 4400
	1    0    0    -1  
$EndComp
$Comp
L power:+5V #PWR?
U 1 1 6076551E
P 2950 4250
F 0 "#PWR?" H 2950 4100 50  0001 C CNN
F 1 "+5V" H 2965 4423 50  0000 C CNN
F 2 "" H 2950 4250 50  0001 C CNN
F 3 "" H 2950 4250 50  0001 C CNN
	1    2950 4250
	1    0    0    -1  
$EndComp
Wire Wire Line
	2950 4550 3450 4550
Text HLabel 4300 4550 2    50   Output ~ 0
BUT_1
Wire Wire Line
	3850 4550 4300 4550
$Comp
L Device:C C?
U 1 1 6076651D
P 2950 4700
F 0 "C?" H 3065 4746 50  0000 L CNN
F 1 "10uF" H 3065 4655 50  0000 L CNN
F 2 "" H 2988 4550 50  0001 C CNN
F 3 "~" H 2950 4700 50  0001 C CNN
	1    2950 4700
	1    0    0    -1  
$EndComp
Connection ~ 2950 4550
$Comp
L power:GND #PWR?
U 1 1 60766A59
P 2950 4850
F 0 "#PWR?" H 2950 4600 50  0001 C CNN
F 1 "GND" H 2955 4677 50  0000 C CNN
F 2 "" H 2950 4850 50  0001 C CNN
F 3 "" H 2950 4850 50  0001 C CNN
	1    2950 4850
	1    0    0    -1  
$EndComp
$Comp
L Device:R R?
U 1 1 607DD761
P 5950 4450
F 0 "R?" H 6020 4496 50  0000 L CNN
F 1 "10K" H 6020 4405 50  0000 L CNN
F 2 "" V 5880 4450 50  0001 C CNN
F 3 "~" H 5950 4450 50  0001 C CNN
	1    5950 4450
	1    0    0    -1  
$EndComp
Wire Wire Line
	5950 4650 5950 4600
Wire Wire Line
	5950 4650 6500 4650
$Comp
L power:+5V #PWR?
U 1 1 607F0C41
P 5950 4300
F 0 "#PWR?" H 5950 4150 50  0001 C CNN
F 1 "+5V" H 5965 4473 50  0000 C CNN
F 2 "" H 5950 4300 50  0001 C CNN
F 3 "" H 5950 4300 50  0001 C CNN
	1    5950 4300
	1    0    0    -1  
$EndComp
Text HLabel 6600 4650 3    50   Output ~ 0
TUMB1_S1
Text HLabel 6700 4650 3    50   Output ~ 0
TUMB1_S2
$Comp
L mylib:Тумблер_MTS-102 D?
U 1 1 609277E5
P 6750 3350
F 0 "D?" H 6878 3209 50  0000 L CNN
F 1 "Тумблер_MTS-102" H 6878 3118 50  0000 L CNN
F 2 "" H 6950 3150 50  0001 C CNN
F 3 "" H 6950 3150 50  0001 C CNN
	1    6750 3350
	1    0    0    -1  
$EndComp
$Comp
L Device:R R?
U 1 1 609277EB
P 6000 3500
F 0 "R?" H 6070 3546 50  0000 L CNN
F 1 "10K" H 6070 3455 50  0000 L CNN
F 2 "" V 5930 3500 50  0001 C CNN
F 3 "~" H 6000 3500 50  0001 C CNN
	1    6000 3500
	1    0    0    -1  
$EndComp
Wire Wire Line
	6000 3700 6000 3650
Wire Wire Line
	6000 3700 6550 3700
$Comp
L power:+5V #PWR?
U 1 1 609277F3
P 6000 3350
F 0 "#PWR?" H 6000 3200 50  0001 C CNN
F 1 "+5V" H 6015 3523 50  0000 C CNN
F 2 "" H 6000 3350 50  0001 C CNN
F 3 "" H 6000 3350 50  0001 C CNN
	1    6000 3350
	1    0    0    -1  
$EndComp
Text HLabel 6650 3700 3    50   Output ~ 0
TUMB2_S1
Text HLabel 6750 3700 3    50   Output ~ 0
TUMB2_S2
$Comp
L mylib:Тумблер_MTS-102 D?
U 1 1 609284CA
P 6750 2350
F 0 "D?" H 6878 2209 50  0000 L CNN
F 1 "Тумблер_MTS-102" H 6878 2118 50  0000 L CNN
F 2 "" H 6950 2150 50  0001 C CNN
F 3 "" H 6950 2150 50  0001 C CNN
	1    6750 2350
	1    0    0    -1  
$EndComp
$Comp
L Device:R R?
U 1 1 609284D0
P 6000 2500
F 0 "R?" H 6070 2546 50  0000 L CNN
F 1 "10K" H 6070 2455 50  0000 L CNN
F 2 "" V 5930 2500 50  0001 C CNN
F 3 "~" H 6000 2500 50  0001 C CNN
	1    6000 2500
	1    0    0    -1  
$EndComp
Wire Wire Line
	6000 2700 6000 2650
Wire Wire Line
	6000 2700 6550 2700
$Comp
L power:+5V #PWR?
U 1 1 609284D8
P 6000 2350
F 0 "#PWR?" H 6000 2200 50  0001 C CNN
F 1 "+5V" H 6015 2523 50  0000 C CNN
F 2 "" H 6000 2350 50  0001 C CNN
F 3 "" H 6000 2350 50  0001 C CNN
	1    6000 2350
	1    0    0    -1  
$EndComp
Text HLabel 6650 2700 3    50   Output ~ 0
TUMB3_S1
Text HLabel 6750 2700 3    50   Output ~ 0
TUMB3_S2
$EndSCHEMATC
