EESchema Schematic File Version 4
EELAYER 30 0
EELAYER END
$Descr A4 11693 8268
encoding utf-8
Sheet 1 2
Title ""
Date ""
Rev ""
Comp ""
Comment1 ""
Comment2 ""
Comment3 ""
Comment4 ""
$EndDescr
$Comp
L Sensor_Current:A1363xKTTN-1 U?
U 1 1 6074C365
P 4900 1500
F 0 "U?" H 4671 1546 50  0000 R CNN
F 1 "ДатчикХолла_SS496A1" H 4671 1455 50  0000 R CNN
F 2 "Sensor_Current:Allegro_SIP-4" H 5250 1400 50  0001 L CIN
F 3 "http://www.allegromicro.com/~/media/Files/Datasheets/A1363-Datasheet.ashx?la=en" H 4900 1500 50  0001 C CNN
	1    4900 1500
	1    0    0    -1  
$EndComp
$Comp
L Sensor_Current:A1363xKTTN-1 U?
U 1 1 6074C7A6
P 4900 2650
F 0 "U?" H 4671 2696 50  0000 R CNN
F 1 "ДатчикХолла_SS496A1" H 4671 2605 50  0000 R CNN
F 2 "Sensor_Current:Allegro_SIP-4" H 5250 2550 50  0001 L CIN
F 3 "http://www.allegromicro.com/~/media/Files/Datasheets/A1363-Datasheet.ashx?la=en" H 4900 2650 50  0001 C CNN
	1    4900 2650
	1    0    0    -1  
$EndComp
$Sheet
S 1800 6050 1000 1100
U 6075AA97
F0 "rud" 50
F1 "rud.sch" 50
F2 "POT_2" O L 1800 6400 50 
F3 "POT_1" O L 1800 6300 50 
F4 "BUT_1" O L 1800 6550 50 
F5 "TUMB1_S1" O R 2800 6250 50 
F6 "TUMB1_S2" O R 2800 6350 50 
F7 "TUMB2_S1" O R 2800 6550 50 
F8 "TUMB2_S2" O R 2800 6650 50 
F9 "TUMB3_S1" O R 2800 6850 50 
F10 "TUMB3_S2" O R 2800 6950 50 
$EndSheet
$Comp
L MCU_Module:Arduino_Leonardo A?
U 1 1 607688B8
P 1900 2550
F 0 "A?" H 1900 3731 50  0000 C CNN
F 1 "Arduino_Micro" H 1900 3640 50  0000 C CNN
F 2 "" H 1900 2550 50  0001 C CIN
F 3 "https://www.arduino.cc/en/Main/ArduinoBoardLeonardo" H 1900 2550 50  0001 C CNN
	1    1900 2550
	0    1    1    0   
$EndComp
$Comp
L power:GND #PWR?
U 1 1 6091B3FE
P 4900 2950
F 0 "#PWR?" H 4900 2700 50  0001 C CNN
F 1 "GND" H 4905 2777 50  0000 C CNN
F 2 "" H 4900 2950 50  0001 C CNN
F 3 "" H 4900 2950 50  0001 C CNN
	1    4900 2950
	1    0    0    -1  
$EndComp
$Comp
L power:GND #PWR?
U 1 1 6091B8C1
P 4900 1800
F 0 "#PWR?" H 4900 1550 50  0001 C CNN
F 1 "GND" H 4905 1627 50  0000 C CNN
F 2 "" H 4900 1800 50  0001 C CNN
F 3 "" H 4900 1800 50  0001 C CNN
	1    4900 1800
	1    0    0    -1  
$EndComp
$Comp
L power:+5V #PWR?
U 1 1 60922996
P 4900 1200
F 0 "#PWR?" H 4900 1050 50  0001 C CNN
F 1 "+5V" H 4915 1373 50  0000 C CNN
F 2 "" H 4900 1200 50  0001 C CNN
F 3 "" H 4900 1200 50  0001 C CNN
	1    4900 1200
	1    0    0    -1  
$EndComp
$Comp
L power:+5V #PWR?
U 1 1 60922DC4
P 4900 2350
F 0 "#PWR?" H 4900 2200 50  0001 C CNN
F 1 "+5V" H 4915 2523 50  0000 C CNN
F 2 "" H 4900 2350 50  0001 C CNN
F 3 "" H 4900 2350 50  0001 C CNN
	1    4900 2350
	1    0    0    -1  
$EndComp
Text Label 5300 1500 0    50   ~ 0
A0
Text Label 5300 2650 0    50   ~ 0
A1
Text Label 1800 3050 3    50   ~ 0
A1
Text Label 1900 3050 3    50   ~ 0
A0
$Comp
L power:GND #PWR?
U 1 1 60933A7E
P 800 2750
F 0 "#PWR?" H 800 2500 50  0001 C CNN
F 1 "GND" H 805 2577 50  0000 C CNN
F 2 "" H 800 2750 50  0001 C CNN
F 3 "" H 800 2750 50  0001 C CNN
	1    800  2750
	1    0    0    -1  
$EndComp
Wire Wire Line
	800  2750 800  2650
Connection ~ 800  2550
Wire Wire Line
	800  2550 800  2450
Connection ~ 800  2650
Wire Wire Line
	800  2650 800  2550
$Comp
L power:+5V #PWR?
U 1 1 60935793
P 3200 2750
F 0 "#PWR?" H 3200 2600 50  0001 C CNN
F 1 "+5V" H 3215 2923 50  0000 C CNN
F 2 "" H 3200 2750 50  0001 C CNN
F 3 "" H 3200 2750 50  0001 C CNN
	1    3200 2750
	1    0    0    -1  
$EndComp
Wire Wire Line
	3200 2750 2900 2750
Text Notes 3100 2850 0    50   ~ 0
OUTPUT
$Comp
L Connector:AudioJack2_SwitchT J?
U 1 1 60A3E026
P 6800 1250
F 0 "J?" H 6832 1575 50  0000 C CNN
F 1 "Микропереключатель_MSW-11" H 6832 1484 50  0000 C CNN
F 2 "" H 6800 1250 50  0001 C CNN
F 3 "~" H 6800 1250 50  0001 C CNN
	1    6800 1250
	1    0    0    -1  
$EndComp
$Comp
L Device:R R?
U 1 1 60A3E886
P 7600 1500
F 0 "R?" H 7670 1546 50  0000 L CNN
F 1 "10K" H 7670 1455 50  0000 L CNN
F 2 "" V 7530 1500 50  0001 C CNN
F 3 "~" H 7600 1500 50  0001 C CNN
	1    7600 1500
	-1   0    0    1   
$EndComp
$Comp
L Device:C C?
U 1 1 60A400A5
P 7900 1500
F 0 "C?" H 8015 1546 50  0000 L CNN
F 1 "10nF" H 8015 1455 50  0000 L CNN
F 2 "" H 7938 1350 50  0001 C CNN
F 3 "~" H 7900 1500 50  0001 C CNN
	1    7900 1500
	1    0    0    -1  
$EndComp
$Comp
L power:GND #PWR?
U 1 1 60A40DB3
P 7750 1750
F 0 "#PWR?" H 7750 1500 50  0001 C CNN
F 1 "GND" H 7755 1577 50  0000 C CNN
F 2 "" H 7750 1750 50  0001 C CNN
F 3 "" H 7750 1750 50  0001 C CNN
	1    7750 1750
	1    0    0    -1  
$EndComp
Wire Wire Line
	7600 1650 7600 1700
Wire Wire Line
	7600 1700 7750 1700
Wire Wire Line
	7900 1650 7900 1700
Wire Wire Line
	7900 1700 7750 1700
Connection ~ 7750 1700
Wire Wire Line
	7750 1750 7750 1700
Text Label 8100 1250 0    50   ~ 0
Button1
Wire Wire Line
	7000 1250 7600 1250
Wire Wire Line
	7600 1350 7600 1250
Connection ~ 7600 1250
Wire Wire Line
	7900 1350 7900 1250
Wire Wire Line
	7600 1250 7900 1250
Connection ~ 7900 1250
Wire Wire Line
	7900 1250 8100 1250
$Comp
L power:+5V #PWR?
U 1 1 60A439CA
P 7000 1150
F 0 "#PWR?" H 7000 1000 50  0001 C CNN
F 1 "+5V" V 7015 1278 50  0000 L CNN
F 2 "" H 7000 1150 50  0001 C CNN
F 3 "" H 7000 1150 50  0001 C CNN
	1    7000 1150
	0    1    1    0   
$EndComp
NoConn ~ 7000 1350
$Comp
L Connector:AudioJack2_SwitchT J?
U 1 1 60A54288
P 6550 2450
F 0 "J?" H 6582 2775 50  0000 C CNN
F 1 "Микропереключатель_MSW-11" H 6582 2684 50  0000 C CNN
F 2 "" H 6550 2450 50  0001 C CNN
F 3 "~" H 6550 2450 50  0001 C CNN
	1    6550 2450
	1    0    0    -1  
$EndComp
$Comp
L Device:R R?
U 1 1 60A5428E
P 7350 2700
F 0 "R?" H 7420 2746 50  0000 L CNN
F 1 "10K" H 7420 2655 50  0000 L CNN
F 2 "" V 7280 2700 50  0001 C CNN
F 3 "~" H 7350 2700 50  0001 C CNN
	1    7350 2700
	-1   0    0    1   
$EndComp
$Comp
L Device:C C?
U 1 1 60A54294
P 7650 2700
F 0 "C?" H 7765 2746 50  0000 L CNN
F 1 "10nF" H 7765 2655 50  0000 L CNN
F 2 "" H 7688 2550 50  0001 C CNN
F 3 "~" H 7650 2700 50  0001 C CNN
	1    7650 2700
	1    0    0    -1  
$EndComp
$Comp
L power:GND #PWR?
U 1 1 60A5429A
P 7500 2950
F 0 "#PWR?" H 7500 2700 50  0001 C CNN
F 1 "GND" H 7505 2777 50  0000 C CNN
F 2 "" H 7500 2950 50  0001 C CNN
F 3 "" H 7500 2950 50  0001 C CNN
	1    7500 2950
	1    0    0    -1  
$EndComp
Wire Wire Line
	7350 2850 7350 2900
Wire Wire Line
	7350 2900 7500 2900
Wire Wire Line
	7650 2850 7650 2900
Wire Wire Line
	7650 2900 7500 2900
Connection ~ 7500 2900
Wire Wire Line
	7500 2950 7500 2900
Text Label 7850 2450 0    50   ~ 0
Button2
Wire Wire Line
	6750 2450 7350 2450
Wire Wire Line
	7350 2550 7350 2450
Connection ~ 7350 2450
Wire Wire Line
	7650 2550 7650 2450
Wire Wire Line
	7350 2450 7650 2450
Connection ~ 7650 2450
Wire Wire Line
	7650 2450 7850 2450
$Comp
L power:+5V #PWR?
U 1 1 60A542AE
P 6750 2350
F 0 "#PWR?" H 6750 2200 50  0001 C CNN
F 1 "+5V" V 6765 2478 50  0000 L CNN
F 2 "" H 6750 2350 50  0001 C CNN
F 3 "" H 6750 2350 50  0001 C CNN
	1    6750 2350
	0    1    1    0   
$EndComp
NoConn ~ 6750 2550
$Comp
L Connector:AudioJack2_SwitchT J?
U 1 1 60A54FDC
P 6550 3350
F 0 "J?" H 6582 3675 50  0000 C CNN
F 1 "Микропереключатель_MSW-11" H 6582 3584 50  0000 C CNN
F 2 "" H 6550 3350 50  0001 C CNN
F 3 "~" H 6550 3350 50  0001 C CNN
	1    6550 3350
	1    0    0    -1  
$EndComp
$Comp
L Device:R R?
U 1 1 60A54FE2
P 7350 3600
F 0 "R?" H 7420 3646 50  0000 L CNN
F 1 "10K" H 7420 3555 50  0000 L CNN
F 2 "" V 7280 3600 50  0001 C CNN
F 3 "~" H 7350 3600 50  0001 C CNN
	1    7350 3600
	-1   0    0    1   
$EndComp
$Comp
L Device:C C?
U 1 1 60A54FE8
P 7650 3600
F 0 "C?" H 7765 3646 50  0000 L CNN
F 1 "10nF" H 7765 3555 50  0000 L CNN
F 2 "" H 7688 3450 50  0001 C CNN
F 3 "~" H 7650 3600 50  0001 C CNN
	1    7650 3600
	1    0    0    -1  
$EndComp
$Comp
L power:GND #PWR?
U 1 1 60A54FEE
P 7500 3850
F 0 "#PWR?" H 7500 3600 50  0001 C CNN
F 1 "GND" H 7505 3677 50  0000 C CNN
F 2 "" H 7500 3850 50  0001 C CNN
F 3 "" H 7500 3850 50  0001 C CNN
	1    7500 3850
	1    0    0    -1  
$EndComp
Wire Wire Line
	7350 3750 7350 3800
Wire Wire Line
	7350 3800 7500 3800
Wire Wire Line
	7650 3750 7650 3800
Wire Wire Line
	7650 3800 7500 3800
Connection ~ 7500 3800
Wire Wire Line
	7500 3850 7500 3800
Text Label 7850 3350 0    50   ~ 0
Button3
Wire Wire Line
	6750 3350 7350 3350
Wire Wire Line
	7350 3450 7350 3350
Connection ~ 7350 3350
Wire Wire Line
	7650 3450 7650 3350
Wire Wire Line
	7350 3350 7650 3350
Connection ~ 7650 3350
Wire Wire Line
	7650 3350 7850 3350
$Comp
L power:+5V #PWR?
U 1 1 60A55002
P 6750 3250
F 0 "#PWR?" H 6750 3100 50  0001 C CNN
F 1 "+5V" V 6765 3378 50  0000 L CNN
F 2 "" H 6750 3250 50  0001 C CNN
F 3 "" H 6750 3250 50  0001 C CNN
	1    6750 3250
	0    1    1    0   
$EndComp
NoConn ~ 6750 3450
$Comp
L Connector:AudioJack2_SwitchT J?
U 1 1 60A564A4
P 6650 4250
F 0 "J?" H 6682 4575 50  0000 C CNN
F 1 "Микропереключатель_MSW-11" H 6682 4484 50  0000 C CNN
F 2 "" H 6650 4250 50  0001 C CNN
F 3 "~" H 6650 4250 50  0001 C CNN
	1    6650 4250
	1    0    0    -1  
$EndComp
$Comp
L Device:R R?
U 1 1 60A564AA
P 7450 4500
F 0 "R?" H 7520 4546 50  0000 L CNN
F 1 "10K" H 7520 4455 50  0000 L CNN
F 2 "" V 7380 4500 50  0001 C CNN
F 3 "~" H 7450 4500 50  0001 C CNN
	1    7450 4500
	-1   0    0    1   
$EndComp
$Comp
L Device:C C?
U 1 1 60A564B0
P 7750 4500
F 0 "C?" H 7865 4546 50  0000 L CNN
F 1 "10nF" H 7865 4455 50  0000 L CNN
F 2 "" H 7788 4350 50  0001 C CNN
F 3 "~" H 7750 4500 50  0001 C CNN
	1    7750 4500
	1    0    0    -1  
$EndComp
$Comp
L power:GND #PWR?
U 1 1 60A564B6
P 7600 4750
F 0 "#PWR?" H 7600 4500 50  0001 C CNN
F 1 "GND" H 7605 4577 50  0000 C CNN
F 2 "" H 7600 4750 50  0001 C CNN
F 3 "" H 7600 4750 50  0001 C CNN
	1    7600 4750
	1    0    0    -1  
$EndComp
Wire Wire Line
	7450 4650 7450 4700
Wire Wire Line
	7450 4700 7600 4700
Wire Wire Line
	7750 4650 7750 4700
Wire Wire Line
	7750 4700 7600 4700
Connection ~ 7600 4700
Wire Wire Line
	7600 4750 7600 4700
Text Label 7950 4250 0    50   ~ 0
Button4
Wire Wire Line
	6850 4250 7450 4250
Wire Wire Line
	7450 4350 7450 4250
Connection ~ 7450 4250
Wire Wire Line
	7750 4350 7750 4250
Wire Wire Line
	7450 4250 7750 4250
Connection ~ 7750 4250
Wire Wire Line
	7750 4250 7950 4250
$Comp
L power:+5V #PWR?
U 1 1 60A564CA
P 6850 4150
F 0 "#PWR?" H 6850 4000 50  0001 C CNN
F 1 "+5V" V 6865 4278 50  0000 L CNN
F 2 "" H 6850 4150 50  0001 C CNN
F 3 "" H 6850 4150 50  0001 C CNN
	1    6850 4150
	0    1    1    0   
$EndComp
NoConn ~ 6850 4350
$Comp
L Connector:AudioJack2_SwitchT J?
U 1 1 60A577CC
P 6700 5300
F 0 "J?" H 6732 5625 50  0000 C CNN
F 1 "Микропереключатель_MSW-11" H 6732 5534 50  0000 C CNN
F 2 "" H 6700 5300 50  0001 C CNN
F 3 "~" H 6700 5300 50  0001 C CNN
	1    6700 5300
	1    0    0    -1  
$EndComp
$Comp
L Device:R R?
U 1 1 60A577D2
P 7500 5550
F 0 "R?" H 7570 5596 50  0000 L CNN
F 1 "10K" H 7570 5505 50  0000 L CNN
F 2 "" V 7430 5550 50  0001 C CNN
F 3 "~" H 7500 5550 50  0001 C CNN
	1    7500 5550
	-1   0    0    1   
$EndComp
$Comp
L Device:C C?
U 1 1 60A577D8
P 7800 5550
F 0 "C?" H 7915 5596 50  0000 L CNN
F 1 "10nF" H 7915 5505 50  0000 L CNN
F 2 "" H 7838 5400 50  0001 C CNN
F 3 "~" H 7800 5550 50  0001 C CNN
	1    7800 5550
	1    0    0    -1  
$EndComp
$Comp
L power:GND #PWR?
U 1 1 60A577DE
P 7650 5800
F 0 "#PWR?" H 7650 5550 50  0001 C CNN
F 1 "GND" H 7655 5627 50  0000 C CNN
F 2 "" H 7650 5800 50  0001 C CNN
F 3 "" H 7650 5800 50  0001 C CNN
	1    7650 5800
	1    0    0    -1  
$EndComp
Wire Wire Line
	7500 5700 7500 5750
Wire Wire Line
	7500 5750 7650 5750
Wire Wire Line
	7800 5700 7800 5750
Wire Wire Line
	7800 5750 7650 5750
Connection ~ 7650 5750
Wire Wire Line
	7650 5800 7650 5750
Text Label 8000 5300 0    50   ~ 0
Button5
Wire Wire Line
	6900 5300 7500 5300
Wire Wire Line
	7500 5400 7500 5300
Connection ~ 7500 5300
Wire Wire Line
	7800 5400 7800 5300
Wire Wire Line
	7500 5300 7800 5300
Connection ~ 7800 5300
Wire Wire Line
	7800 5300 8000 5300
$Comp
L power:+5V #PWR?
U 1 1 60A577F2
P 6900 5200
F 0 "#PWR?" H 6900 5050 50  0001 C CNN
F 1 "+5V" V 6915 5328 50  0000 L CNN
F 2 "" H 6900 5200 50  0001 C CNN
F 3 "" H 6900 5200 50  0001 C CNN
	1    6900 5200
	0    1    1    0   
$EndComp
NoConn ~ 6900 5400
Text Label 2100 2050 1    50   ~ 0
Button1
Text Label 2000 2050 1    50   ~ 0
Button2
Text Label 1900 2050 1    50   ~ 0
Button3
Text Label 1800 2050 1    50   ~ 0
Button4
Text Label 1700 2050 1    50   ~ 0
Button5
$EndSCHEMATC
