<svg width="28" height="28" viewBox="0 0 28 28" fill="none" xmlns="http://www.w3.org/2000/svg">
<path fill-rule="evenodd" clip-rule="evenodd" d="M2.04761 9.64068C2.04761 8.75965 2.76182 8.04544 3.64285 8.04544H16.6905H19.9762H22.1667C23.0477 8.04544 23.7619 8.75965 23.7619 9.64068V10.9971C23.7619 11.1242 23.8649 11.2273 23.9921 11.2273C25.0747 11.2273 25.9524 12.1049 25.9524 13.1876V14.8124C25.9524 15.8951 25.0747 16.7727 23.9921 16.7727C23.8649 16.7727 23.7619 16.8758 23.7619 17.0029V18.3593C23.7619 19.2403 23.0477 19.9545 22.1667 19.9545H3.64285C2.76182 19.9545 2.04761 19.2403 2.04761 18.3593V16.7273V14V9.64068ZM3.64285 9.04544C3.3141 9.04544 3.04761 9.31194 3.04761 9.64068V14V16.7273V18.3593C3.04761 18.688 3.3141 18.9545 3.64285 18.9545H22.1667C22.4954 18.9545 22.7619 18.688 22.7619 18.3593V17.0029C22.7619 16.3235 23.3127 15.7727 23.9921 15.7727C24.5224 15.7727 24.9524 15.3428 24.9524 14.8124V13.1876C24.9524 12.6572 24.5224 12.2273 23.9921 12.2273C23.3127 12.2273 22.7619 11.6765 22.7619 10.9971V9.64068C22.7619 9.31194 22.4954 9.04544 22.1667 9.04544H19.9762H16.6905H3.64285Z" fill="#A3A3A5"/>
</svg>
