<svg width="16" height="16" viewBox="0 0 16 16" fill="none" xmlns="http://www.w3.org/2000/svg">
<g clip-path="url(#clip0_2627_1796)">
<g filter="url(#filter0_ddd_2627_1796)">
<path fill-rule="evenodd" clip-rule="evenodd" d="M7.20013 4.18066L6.89898 3.96753C6.46917 3.66335 5.95558 3.5 5.42902 3.5H5.06154C4.81903 3.5 4.57405 3.51529 4.34549 3.59636C2.91587 4.1034 1.93249 5.95702 2.00362 10.1616C2.01795 11.0087 2.21618 11.945 2.98054 12.3105C3.21873 12.4244 3.498 12.5 3.81603 12.5C4.19764 12.5 4.50068 12.3912 4.73458 12.2379C4.97985 12.0772 5.1958 11.8682 5.41168 11.6594C5.67843 11.4013 5.94506 11.1434 6.26675 10.9765C6.61712 10.7948 7.00601 10.7 7.40069 10.7H8.59931C8.99399 10.7 9.38288 10.7948 9.73325 10.9765C10.0549 11.1434 10.3216 11.4013 10.5883 11.6594C10.8042 11.8682 11.0202 12.0772 11.2654 12.2379C11.4993 12.3912 11.8024 12.5 12.184 12.5C12.502 12.5 12.7813 12.4244 13.0195 12.3105C13.7838 11.945 13.982 11.0087 13.9964 10.1616C14.0675 5.95702 13.0841 4.10339 11.6545 3.59636C11.4259 3.51529 11.181 3.5 10.9385 3.5H10.571C10.0444 3.5 9.53083 3.66335 9.10103 3.96753L8.79991 4.18065C8.56602 4.34617 8.28654 4.43506 8.00001 4.43506C7.71348 4.43506 7.43401 4.34618 7.20013 4.18066ZM10.85 5.9C11.0985 5.9 11.3 6.10147 11.3 6.35C11.3 6.59853 11.0985 6.8 10.85 6.8C10.6015 6.8 10.4 6.59853 10.4 6.35C10.4 6.10147 10.6015 5.9 10.85 5.9ZM5.3 6.05C5.54853 6.05 5.75 6.25147 5.75 6.5V6.95H6.2C6.44853 6.95 6.65 7.15147 6.65 7.4C6.65 7.64853 6.44853 7.85 6.2 7.85H5.75V8.3C5.75 8.54853 5.54853 8.75 5.3 8.75C5.05147 8.75 4.85 8.54853 4.85 8.3V7.85H4.4C4.15147 7.85 3.95 7.64853 3.95 7.4C3.95 7.15147 4.15147 6.95 4.4 6.95H4.85V6.5C4.85 6.25147 5.05147 6.05 5.3 6.05ZM12.2 7.25C12.2 7.49853 11.9985 7.7 11.75 7.7C11.5015 7.7 11.3 7.49853 11.3 7.25C11.3 7.00147 11.5015 6.8 11.75 6.8C11.9985 6.8 12.2 7.00147 12.2 7.25ZM9.95 7.7C10.1985 7.7 10.4 7.49853 10.4 7.25C10.4 7.00147 10.1985 6.8 9.95 6.8C9.70147 6.8 9.5 7.00147 9.5 7.25C9.5 7.49853 9.70147 7.7 9.95 7.7ZM11.3 8.15C11.3 7.90147 11.0985 7.7 10.85 7.7C10.6015 7.7 10.4 7.90147 10.4 8.15C10.4 8.39853 10.6015 8.6 10.85 8.6C11.0985 8.6 11.3 8.39853 11.3 8.15Z" fill="#E7EAFA"/>
</g>
</g>
<defs>
<filter id="filter0_ddd_2627_1796" x="-4.61818" y="-1.84545" width="25.2364" height="22.2364" filterUnits="userSpaceOnUse" color-interpolation-filters="sRGB">
<feFlood flood-opacity="0" result="BackgroundImageFix"/>
<feColorMatrix in="SourceAlpha" type="matrix" values="0 0 0 0 0 0 0 0 0 0 0 0 0 0 0 0 0 0 127 0" result="hardAlpha"/>
<feOffset dy="0.103704"/>
<feGaussianBlur stdDeviation="0.26963"/>
<feColorMatrix type="matrix" values="0 0 0 0 0.00784314 0 0 0 0 0.00392157 0 0 0 0 0.0117647 0 0 0 0.12563 0"/>
<feBlend mode="normal" in2="BackgroundImageFix" result="effect1_dropShadow_2627_1796"/>
<feColorMatrix in="SourceAlpha" type="matrix" values="0 0 0 0 0 0 0 0 0 0 0 0 0 0 0 0 0 0 127 0" result="hardAlpha"/>
<feOffset dy="0.490236"/>
<feGaussianBlur stdDeviation="1.05401"/>
<feColorMatrix type="matrix" values="0 0 0 0 0.00784314 0 0 0 0 0.00392157 0 0 0 0 0.0117647 0 0 0 0.19437 0"/>
<feBlend mode="normal" in2="effect1_dropShadow_2627_1796" result="effect2_dropShadow_2627_1796"/>
<feColorMatrix in="SourceAlpha" type="matrix" values="0 0 0 0 0 0 0 0 0 0 0 0 0 0 0 0 0 0 127 0" result="hardAlpha"/>
<feOffset dy="1.27273"/>
<feGaussianBlur stdDeviation="3.30909"/>
<feColorMatrix type="matrix" values="0 0 0 0 0.00784314 0 0 0 0 0.00392157 0 0 0 0 0.0117647 0 0 0 0.32 0"/>
<feBlend mode="normal" in2="effect2_dropShadow_2627_1796" result="effect3_dropShadow_2627_1796"/>
<feBlend mode="normal" in="SourceGraphic" in2="effect3_dropShadow_2627_1796" result="shape"/>
</filter>
<clipPath id="clip0_2627_1796">
<rect width="16" height="16" fill="white"/>
</clipPath>
</defs>
</svg>
