<svg width="16" height="16" viewBox="0 0 16 16" fill="none" xmlns="http://www.w3.org/2000/svg">
<g clip-path="url(#clip0_2627_1707)">
<g filter="url(#filter0_ddd_2627_1707)">
<path fill-rule="evenodd" clip-rule="evenodd" d="M5.3552 2.27566C4.19513 2.50898 3.31236 3.52622 3.17835 4.7841L3.16962 4.86597C3.03704 6.11036 2.98218 7.36186 3.00504 8.61214L3 8.80247L3.25 9.06234C3.47616 9.26044 3.59981 9.42212 5.08333 9.85001C5.58205 9.99386 6.24657 10.0404 6.5 10.0559C7.25 10.1018 7.5 10.1018 8 10.1018C8.50014 10.1018 8.25 10.1018 9.25 10.1018C9.75 10.1018 10 10.0662 10.2671 10.0112C10.7622 9.90923 11.1633 9.77905 11.4868 9.6428C12.1998 9.34248 12.5528 9.0058 12.7181 8.84236L12.9946 8.56901C13.019 7.28367 12.961 5.99707 12.8208 4.7183C12.687 3.49871 11.8297 2.51402 10.7045 2.28772L10.5251 2.25163C8.85613 1.91596 7.14359 1.91596 5.47466 2.25163L5.3552 2.27566ZM6.04943 3.78094C6.22392 3.61953 6.24374 3.3365 6.09371 3.14877C5.94368 2.96105 5.68061 2.93972 5.50613 3.10113C5.24668 3.34113 5.08333 3.69851 5.08333 4.03874C5.08333 4.64463 5.50947 5.06116 6.00174 5.30281C6.50771 5.55119 7.19754 5.68243 8 5.68243C8.80246 5.68243 9.49229 5.55119 9.99826 5.30281C10.4905 5.06116 10.9167 4.64463 10.9167 4.03874C10.9167 3.66606 10.7249 3.36772 10.4939 3.15405C10.3194 2.99263 10.0563 3.01397 9.90628 3.20169C9.75625 3.38942 9.77608 3.67245 9.95057 3.83386C10.0755 3.94944 10.0833 4.02078 10.0833 4.03874C10.0833 4.12229 10.0265 4.30346 9.65233 4.48715C9.29183 4.66412 8.73167 4.78587 8 4.78587C7.26833 4.78587 6.70816 4.66412 6.34767 4.48715C5.97347 4.30346 5.91667 4.12229 5.91667 4.03874C5.91667 4.01976 5.92254 3.97824 5.94687 3.92441C5.97044 3.87226 6.00567 3.82143 6.04943 3.78094Z" fill="#E7EAFA"/>
<path d="M12.9456 9.85001C12.6907 10.0544 12.3203 10.3005 11.7904 10.5237C10.9582 10.8742 9.75009 11.161 7.99986 11.161C5.14593 11.161 3.72772 10.3872 3.05105 9.86401C3.07904 10.3437 3.11851 10.8229 3.16944 11.301C3.30686 12.5907 4.24909 13.6122 5.44993 13.7732L6.01409 13.8489C6.28899 13.8857 6.42644 13.9042 6.56374 13.9196C7.51843 14.0268 8.48094 14.0268 9.43563 13.9196C9.57292 13.9042 9.71037 13.8857 9.98527 13.8489L10.4887 13.7814C11.7243 13.6157 12.6927 12.5625 12.8303 11.235L12.8398 11.1429C12.8844 10.7126 12.9196 10.2816 12.9456 9.85001Z" fill="#E7EAFA"/>
</g>
</g>
<defs>
<filter id="filter0_ddd_2627_1707" x="-2.43309" y="-2.38839" width="20.8662" height="22.8663" filterUnits="userSpaceOnUse" color-interpolation-filters="sRGB">
<feFlood flood-opacity="0" result="BackgroundImageFix"/>
<feColorMatrix in="SourceAlpha" type="matrix" values="0 0 0 0 0 0 0 0 0 0 0 0 0 0 0 0 0 0 127 0" result="hardAlpha"/>
<feOffset dy="0.0851339"/>
<feGaussianBlur stdDeviation="0.221348"/>
<feColorMatrix type="matrix" values="0 0 0 0 0.00784314 0 0 0 0 0.00392157 0 0 0 0 0.0117647 0 0 0 0.12563 0"/>
<feBlend mode="normal" in2="BackgroundImageFix" result="effect1_dropShadow_2627_1707"/>
<feColorMatrix in="SourceAlpha" type="matrix" values="0 0 0 0 0 0 0 0 0 0 0 0 0 0 0 0 0 0 127 0" result="hardAlpha"/>
<feOffset dy="0.402451"/>
<feGaussianBlur stdDeviation="0.86527"/>
<feColorMatrix type="matrix" values="0 0 0 0 0.00784314 0 0 0 0 0.00392157 0 0 0 0 0.0117647 0 0 0 0.19437 0"/>
<feBlend mode="normal" in2="effect1_dropShadow_2627_1707" result="effect2_dropShadow_2627_1707"/>
<feColorMatrix in="SourceAlpha" type="matrix" values="0 0 0 0 0 0 0 0 0 0 0 0 0 0 0 0 0 0 127 0" result="hardAlpha"/>
<feOffset dy="1.04483"/>
<feGaussianBlur stdDeviation="2.71655"/>
<feColorMatrix type="matrix" values="0 0 0 0 0.00784314 0 0 0 0 0.00392157 0 0 0 0 0.0117647 0 0 0 0.32 0"/>
<feBlend mode="normal" in2="effect2_dropShadow_2627_1707" result="effect3_dropShadow_2627_1707"/>
<feBlend mode="normal" in="SourceGraphic" in2="effect3_dropShadow_2627_1707" result="shape"/>
</filter>
<clipPath id="clip0_2627_1707">
<rect width="16" height="16" fill="white"/>
</clipPath>
</defs>
</svg>
