^C:\USERS\MAGSHIMIM\DOCUMENTS\MAGSHIMIM_WORKS\ADVANCED_PRINCIPLES_SEMESTER_1\HW7\CHESS_PROJECT\CHESS\CHESS\BOARD.CPP|C:\USERS\MAGSHIMIM\DOCUMENTS\MAGSHIMIM_WORKS\ADVANCED_PRINCIPLES_SEMESTER_1\HW7\CHESS_PROJECT\CHESS\CHESS\PIECE.CPP|C:\USERS\MAGSHIMIM\DOCUMENTS\MAGSHIMIM_WORKS\ADVANCED_PRINCIPLES_SEMESTER_1\HW7\CHESS_PROJECT\CHESS\CHESS\ROOK.CPP|C:\USERS\MAGSHIMIM\DOCUMENTS\MAGSHIMIM_WORKS\ADVANCED_PRINCIPLES_SEMESTER_1\HW7\CHESS_PROJECT\CHESS\CHESS\SOURCE.CPP|C:\USERS\MAGSHIMIM\DOCUMENTS\MAGSHIMIM_WORKS\ADVANCED_PRINCIPLES_SEMESTER_1\HW7\CHESS_PROJECT\CHESS\CHESS\STDAFX.CPP
C:\USERS\MAGSHIMIM\DOCUMENTS\MAGSHIMIM_WORKS\ADVANCED_PRINCIPLES_SEMESTER_1\HW7\CHESS_PROJECT\CHESS\CHESS\X64\DEBUG\VC141.PDB
C:\USERS\MAGSHIMIM\DOCUMENTS\MAGSHIMIM_WORKS\ADVANCED_PRINCIPLES_SEMESTER_1\HW7\CHESS_PROJECT\CHESS\CHESS\X64\DEBUG\VC141.IDB
C:\USERS\MAGSHIMIM\DOCUMENTS\MAGSHIMIM_WORKS\ADVANCED_PRINCIPLES_SEMESTER_1\HW7\CHESS_PROJECT\CHESS\CHESS\X64\DEBUG\STDAFX.OBJ
C:\USERS\MAGSHIMIM\DOCUMENTS\MAGSHIMIM_WORKS\ADVANCED_PRINCIPLES_SEMESTER_1\HW7\CHESS_PROJECT\CHESS\CHESS\X64\DEBUG\SOURCE.OBJ
C:\USERS\MAGSHIMIM\DOCUMENTS\MAGSHIMIM_WORKS\ADVANCED_PRINCIPLES_SEMESTER_1\HW7\CHESS_PROJECT\CHESS\CHESS\X64\DEBUG\ROOK.OBJ
C:\USERS\MAGSHIMIM\DOCUMENTS\MAGSHIMIM_WORKS\ADVANCED_PRINCIPLES_SEMESTER_1\HW7\CHESS_PROJECT\CHESS\CHESS\X64\DEBUG\PIECE.OBJ
C:\USERS\MAGSHIMIM\DOCUMENTS\MAGSHIMIM_WORKS\ADVANCED_PRINCIPLES_SEMESTER_1\HW7\CHESS_PROJECT\CHESS\CHESS\X64\DEBUG\BOARD.OBJ
^C:\USERS\MAGSHIMIM\DOCUMENTS\MAGSHIMIM_WORKS\ADVANCED_PRINCIPLES_SEMESTER_1\HW7\CHESS_PROJECT\CHESS\CHESS\PIECE.CPP|C:\USERS\MAGSHIMIM\DOCUMENTS\MAGSHIMIM_WORKS\ADVANCED_PRINCIPLES_SEMESTER_1\HW7\CHESS_PROJECT\CHESS\CHESS\SOURCE.CPP
C:\USERS\MAGSHIMIM\DOCUMENTS\MAGSHIMIM_WORKS\ADVANCED_PRINCIPLES_SEMESTER_1\HW7\CHESS_PROJECT\CHESS\CHESS\X64\DEBUG\VC141.PDB
C:\USERS\MAGSHIMIM\DOCUMENTS\MAGSHIMIM_WORKS\ADVANCED_PRINCIPLES_SEMESTER_1\HW7\CHESS_PROJECT\CHESS\CHESS\X64\DEBUG\VC141.IDB
C:\USERS\MAGSHIMIM\DOCUMENTS\MAGSHIMIM_WORKS\ADVANCED_PRINCIPLES_SEMESTER_1\HW7\CHESS_PROJECT\CHESS\CHESS\X64\DEBUG\PIECE.OBJ
C:\USERS\MAGSHIMIM\DOCUMENTS\MAGSHIMIM_WORKS\ADVANCED_PRINCIPLES_SEMESTER_1\HW7\CHESS_PROJECT\CHESS\CHESS\X64\DEBUG\SOURCE.OBJ
^C:\USERS\MAGSHIMIM\DOCUMENTS\MAGSHIMIM_WORKS\ADVANCED_PRINCIPLES_SEMESTER_1\HW7\CHESS_PROJECT\CHESS\CHESS\BOARD.CPP|C:\USERS\MAGSHIMIM\DOCUMENTS\MAGSHIMIM_WORKS\ADVANCED_PRINCIPLES_SEMESTER_1\HW7\CHESS_PROJECT\CHESS\CHESS\KING.CPP|C:\USERS\MAGSHIMIM\DOCUMENTS\MAGSHIMIM_WORKS\ADVANCED_PRINCIPLES_SEMESTER_1\HW7\CHESS_PROJECT\CHESS\CHESS\SOURCE.CPP
C:\USERS\MAGSHIMIM\DOCUMENTS\MAGSHIMIM_WORKS\ADVANCED_PRINCIPLES_SEMESTER_1\HW7\CHESS_PROJECT\CHESS\CHESS\X64\DEBUG\VC141.PDB
C:\USERS\MAGSHIMIM\DOCUMENTS\MAGSHIMIM_WORKS\ADVANCED_PRINCIPLES_SEMESTER_1\HW7\CHESS_PROJECT\CHESS\CHESS\X64\DEBUG\VC141.IDB
C:\USERS\MAGSHIMIM\DOCUMENTS\MAGSHIMIM_WORKS\ADVANCED_PRINCIPLES_SEMESTER_1\HW7\CHESS_PROJECT\CHESS\CHESS\X64\DEBUG\SOURCE.OBJ
C:\USERS\MAGSHIMIM\DOCUMENTS\MAGSHIMIM_WORKS\ADVANCED_PRINCIPLES_SEMESTER_1\HW7\CHESS_PROJECT\CHESS\CHESS\X64\DEBUG\KING.OBJ
^C:\USERS\MAGSHIMIM\DOCUMENTS\MAGSHIMIM_WORKS\ADVANCED_PRINCIPLES_SEMESTER_1\HW7\CHESS_PROJECT\CHESS\CHESS\BOARD.CPP|C:\USERS\MAGSHIMIM\DOCUMENTS\MAGSHIMIM_WORKS\ADVANCED_PRINCIPLES_SEMESTER_1\HW7\CHESS_PROJECT\CHESS\CHESS\SOURCE.CPP
C:\USERS\MAGSHIMIM\DOCUMENTS\MAGSHIMIM_WORKS\ADVANCED_PRINCIPLES_SEMESTER_1\HW7\CHESS_PROJECT\CHESS\CHESS\X64\DEBUG\VC141.PDB
C:\USERS\MAGSHIMIM\DOCUMENTS\MAGSHIMIM_WORKS\ADVANCED_PRINCIPLES_SEMESTER_1\HW7\CHESS_PROJECT\CHESS\CHESS\X64\DEBUG\VC141.IDB
C:\USERS\MAGSHIMIM\DOCUMENTS\MAGSHIMIM_WORKS\ADVANCED_PRINCIPLES_SEMESTER_1\HW7\CHESS_PROJECT\CHESS\CHESS\X64\DEBUG\BOARD.OBJ
C:\USERS\MAGSHIMIM\DOCUMENTS\MAGSHIMIM_WORKS\ADVANCED_PRINCIPLES_SEMESTER_1\HW7\CHESS_PROJECT\CHESS\CHESS\X64\DEBUG\SOURCE.OBJ
^C:\USERS\MAGSHIMIM\DOCUMENTS\MAGSHIMIM_WORKS\ADVANCED_PRINCIPLES_SEMESTER_1\HW7\CHESS_PROJECT\CHESS\CHESS\KING.CPP|C:\USERS\MAGSHIMIM\DOCUMENTS\MAGSHIMIM_WORKS\ADVANCED_PRINCIPLES_SEMESTER_1\HW7\CHESS_PROJECT\CHESS\CHESS\ROOK.CPP
C:\USERS\MAGSHIMIM\DOCUMENTS\MAGSHIMIM_WORKS\ADVANCED_PRINCIPLES_SEMESTER_1\HW7\CHESS_PROJECT\CHESS\CHESS\X64\DEBUG\VC141.PDB
C:\USERS\MAGSHIMIM\DOCUMENTS\MAGSHIMIM_WORKS\ADVANCED_PRINCIPLES_SEMESTER_1\HW7\CHESS_PROJECT\CHESS\CHESS\X64\DEBUG\VC141.IDB
C:\USERS\MAGSHIMIM\DOCUMENTS\MAGSHIMIM_WORKS\ADVANCED_PRINCIPLES_SEMESTER_1\HW7\CHESS_PROJECT\CHESS\CHESS\X64\DEBUG\ROOK.OBJ
C:\USERS\MAGSHIMIM\DOCUMENTS\MAGSHIMIM_WORKS\ADVANCED_PRINCIPLES_SEMESTER_1\HW7\CHESS_PROJECT\CHESS\CHESS\X64\DEBUG\KING.OBJ
^C:\USERS\MAGSHIMIM\DOCUMENTS\MAGSHIMIM_WORKS\ADVANCED_PRINCIPLES_SEMESTER_1\HW7\CHESS_PROJECT\CHESS\CHESS\BOARD.CPP|C:\USERS\MAGSHIMIM\DOCUMENTS\MAGSHIMIM_WORKS\ADVANCED_PRINCIPLES_SEMESTER_1\HW7\CHESS_PROJECT\CHESS\CHESS\KING.CPP|C:\USERS\MAGSHIMIM\DOCUMENTS\MAGSHIMIM_WORKS\ADVANCED_PRINCIPLES_SEMESTER_1\HW7\CHESS_PROJECT\CHESS\CHESS\PIECE.CPP|C:\USERS\MAGSHIMIM\DOCUMENTS\MAGSHIMIM_WORKS\ADVANCED_PRINCIPLES_SEMESTER_1\HW7\CHESS_PROJECT\CHESS\CHESS\ROOK.CPP|C:\USERS\MAGSHIMIM\DOCUMENTS\MAGSHIMIM_WORKS\ADVANCED_PRINCIPLES_SEMESTER_1\HW7\CHESS_PROJECT\CHESS\CHESS\SOURCE.CPP
C:\USERS\MAGSHIMIM\DOCUMENTS\MAGSHIMIM_WORKS\ADVANCED_PRINCIPLES_SEMESTER_1\HW7\CHESS_PROJECT\CHESS\CHESS\X64\DEBUG\VC141.PDB
C:\USERS\MAGSHIMIM\DOCUMENTS\MAGSHIMIM_WORKS\ADVANCED_PRINCIPLES_SEMESTER_1\HW7\CHESS_PROJECT\CHESS\CHESS\X64\DEBUG\VC141.IDB
C:\USERS\MAGSHIMIM\DOCUMENTS\MAGSHIMIM_WORKS\ADVANCED_PRINCIPLES_SEMESTER_1\HW7\CHESS_PROJECT\CHESS\CHESS\X64\DEBUG\ROOK.OBJ
C:\USERS\MAGSHIMIM\DOCUMENTS\MAGSHIMIM_WORKS\ADVANCED_PRINCIPLES_SEMESTER_1\HW7\CHESS_PROJECT\CHESS\CHESS\X64\DEBUG\PIECE.OBJ
C:\USERS\MAGSHIMIM\DOCUMENTS\MAGSHIMIM_WORKS\ADVANCED_PRINCIPLES_SEMESTER_1\HW7\CHESS_PROJECT\CHESS\CHESS\X64\DEBUG\BOARD.OBJ
C:\USERS\MAGSHIMIM\DOCUMENTS\MAGSHIMIM_WORKS\ADVANCED_PRINCIPLES_SEMESTER_1\HW7\CHESS_PROJECT\CHESS\CHESS\X64\DEBUG\SOURCE.OBJ
C:\USERS\MAGSHIMIM\DOCUMENTS\MAGSHIMIM_WORKS\ADVANCED_PRINCIPLES_SEMESTER_1\HW7\CHESS_PROJECT\CHESS\CHESS\X64\DEBUG\KING.OBJ
^C:\USERS\MAGSHIMIM\DOCUMENTS\MAGSHIMIM_WORKS\ADVANCED_PRINCIPLES_SEMESTER_1\HW7\CHESS_PROJECT\CHESS\CHESS\BISHOP.CPP|C:\USERS\MAGSHIMIM\DOCUMENTS\MAGSHIMIM_WORKS\ADVANCED_PRINCIPLES_SEMESTER_1\HW7\CHESS_PROJECT\CHESS\CHESS\BOARD.CPP|C:\USERS\MAGSHIMIM\DOCUMENTS\MAGSHIMIM_WORKS\ADVANCED_PRINCIPLES_SEMESTER_1\HW7\CHESS_PROJECT\CHESS\CHESS\ROOK.CPP|C:\USERS\MAGSHIMIM\DOCUMENTS\MAGSHIMIM_WORKS\ADVANCED_PRINCIPLES_SEMESTER_1\HW7\CHESS_PROJECT\CHESS\CHESS\SOURCE.CPP
C:\USERS\MAGSHIMIM\DOCUMENTS\MAGSHIMIM_WORKS\ADVANCED_PRINCIPLES_SEMESTER_1\HW7\CHESS_PROJECT\CHESS\CHESS\X64\DEBUG\VC141.PDB
C:\USERS\MAGSHIMIM\DOCUMENTS\MAGSHIMIM_WORKS\ADVANCED_PRINCIPLES_SEMESTER_1\HW7\CHESS_PROJECT\CHESS\CHESS\X64\DEBUG\VC141.IDB
C:\USERS\MAGSHIMIM\DOCUMENTS\MAGSHIMIM_WORKS\ADVANCED_PRINCIPLES_SEMESTER_1\HW7\CHESS_PROJECT\CHESS\CHESS\X64\DEBUG\ROOK.OBJ
C:\USERS\MAGSHIMIM\DOCUMENTS\MAGSHIMIM_WORKS\ADVANCED_PRINCIPLES_SEMESTER_1\HW7\CHESS_PROJECT\CHESS\CHESS\X64\DEBUG\BOARD.OBJ
C:\USERS\MAGSHIMIM\DOCUMENTS\MAGSHIMIM_WORKS\ADVANCED_PRINCIPLES_SEMESTER_1\HW7\CHESS_PROJECT\CHESS\CHESS\X64\DEBUG\BISHOP.OBJ
^C:\USERS\MAGSHIMIM\DOCUMENTS\MAGSHIMIM_WORKS\ADVANCED_PRINCIPLES_SEMESTER_1\HW7\CHESS_PROJECT\CHESS\CHESS\BISHOP.CPP|C:\USERS\MAGSHIMIM\DOCUMENTS\MAGSHIMIM_WORKS\ADVANCED_PRINCIPLES_SEMESTER_1\HW7\CHESS_PROJECT\CHESS\CHESS\ROOK.CPP
C:\USERS\MAGSHIMIM\DOCUMENTS\MAGSHIMIM_WORKS\ADVANCED_PRINCIPLES_SEMESTER_1\HW7\CHESS_PROJECT\CHESS\CHESS\X64\DEBUG\VC141.PDB
C:\USERS\MAGSHIMIM\DOCUMENTS\MAGSHIMIM_WORKS\ADVANCED_PRINCIPLES_SEMESTER_1\HW7\CHESS_PROJECT\CHESS\CHESS\X64\DEBUG\VC141.IDB
C:\USERS\MAGSHIMIM\DOCUMENTS\MAGSHIMIM_WORKS\ADVANCED_PRINCIPLES_SEMESTER_1\HW7\CHESS_PROJECT\CHESS\CHESS\X64\DEBUG\ROOK.OBJ
C:\USERS\MAGSHIMIM\DOCUMENTS\MAGSHIMIM_WORKS\ADVANCED_PRINCIPLES_SEMESTER_1\HW7\CHESS_PROJECT\CHESS\CHESS\X64\DEBUG\BISHOP.OBJ
^C:\USERS\MAGSHIMIM\DOCUMENTS\MAGSHIMIM_WORKS\ADVANCED_PRINCIPLES_SEMESTER_1\HW7\CHESS_PROJECT\CHESS\CHESS\BOARD.CPP|C:\USERS\MAGSHIMIM\DOCUMENTS\MAGSHIMIM_WORKS\ADVANCED_PRINCIPLES_SEMESTER_1\HW7\CHESS_PROJECT\CHESS\CHESS\QUEEN.CPP|C:\USERS\MAGSHIMIM\DOCUMENTS\MAGSHIMIM_WORKS\ADVANCED_PRINCIPLES_SEMESTER_1\HW7\CHESS_PROJECT\CHESS\CHESS\SOURCE.CPP
C:\USERS\MAGSHIMIM\DOCUMENTS\MAGSHIMIM_WORKS\ADVANCED_PRINCIPLES_SEMESTER_1\HW7\CHESS_PROJECT\CHESS\CHESS\X64\DEBUG\VC141.PDB
C:\USERS\MAGSHIMIM\DOCUMENTS\MAGSHIMIM_WORKS\ADVANCED_PRINCIPLES_SEMESTER_1\HW7\CHESS_PROJECT\CHESS\CHESS\X64\DEBUG\VC141.IDB
C:\USERS\MAGSHIMIM\DOCUMENTS\MAGSHIMIM_WORKS\ADVANCED_PRINCIPLES_SEMESTER_1\HW7\CHESS_PROJECT\CHESS\CHESS\X64\DEBUG\SOURCE.OBJ
C:\USERS\MAGSHIMIM\DOCUMENTS\MAGSHIMIM_WORKS\ADVANCED_PRINCIPLES_SEMESTER_1\HW7\CHESS_PROJECT\CHESS\CHESS\X64\DEBUG\QUEEN.OBJ
C:\USERS\MAGSHIMIM\DOCUMENTS\MAGSHIMIM_WORKS\ADVANCED_PRINCIPLES_SEMESTER_1\HW7\CHESS_PROJECT\CHESS\CHESS\X64\DEBUG\BOARD.OBJ
^C:\USERS\MAGSHIMIM\DOCUMENTS\MAGSHIMIM_WORKS\ADVANCED_PRINCIPLES_SEMESTER_1\HW7\CHESS_PROJECT\CHESS\CHESS\BOARD.CPP|C:\USERS\MAGSHIMIM\DOCUMENTS\MAGSHIMIM_WORKS\ADVANCED_PRINCIPLES_SEMESTER_1\HW7\CHESS_PROJECT\CHESS\CHESS\KING.CPP|C:\USERS\MAGSHIMIM\DOCUMENTS\MAGSHIMIM_WORKS\ADVANCED_PRINCIPLES_SEMESTER_1\HW7\CHESS_PROJECT\CHESS\CHESS\KNIGHT.CPP|C:\USERS\MAGSHIMIM\DOCUMENTS\MAGSHIMIM_WORKS\ADVANCED_PRINCIPLES_SEMESTER_1\HW7\CHESS_PROJECT\CHESS\CHESS\QUEEN.CPP|C:\USERS\MAGSHIMIM\DOCUMENTS\MAGSHIMIM_WORKS\ADVANCED_PRINCIPLES_SEMESTER_1\HW7\CHESS_PROJECT\CHESS\CHESS\ROOK.CPP|C:\USERS\MAGSHIMIM\DOCUMENTS\MAGSHIMIM_WORKS\ADVANCED_PRINCIPLES_SEMESTER_1\HW7\CHESS_PROJECT\CHESS\CHESS\SOURCE.CPP
C:\USERS\MAGSHIMIM\DOCUMENTS\MAGSHIMIM_WORKS\ADVANCED_PRINCIPLES_SEMESTER_1\HW7\CHESS_PROJECT\CHESS\CHESS\X64\DEBUG\VC141.PDB
C:\USERS\MAGSHIMIM\DOCUMENTS\MAGSHIMIM_WORKS\ADVANCED_PRINCIPLES_SEMESTER_1\HW7\CHESS_PROJECT\CHESS\CHESS\X64\DEBUG\VC141.IDB
C:\USERS\MAGSHIMIM\DOCUMENTS\MAGSHIMIM_WORKS\ADVANCED_PRINCIPLES_SEMESTER_1\HW7\CHESS_PROJECT\CHESS\CHESS\X64\DEBUG\SOURCE.OBJ
C:\USERS\MAGSHIMIM\DOCUMENTS\MAGSHIMIM_WORKS\ADVANCED_PRINCIPLES_SEMESTER_1\HW7\CHESS_PROJECT\CHESS\CHESS\X64\DEBUG\ROOK.OBJ
C:\USERS\MAGSHIMIM\DOCUMENTS\MAGSHIMIM_WORKS\ADVANCED_PRINCIPLES_SEMESTER_1\HW7\CHESS_PROJECT\CHESS\CHESS\X64\DEBUG\QUEEN.OBJ
C:\USERS\MAGSHIMIM\DOCUMENTS\MAGSHIMIM_WORKS\ADVANCED_PRINCIPLES_SEMESTER_1\HW7\CHESS_PROJECT\CHESS\CHESS\X64\DEBUG\KNIGHT.OBJ
C:\USERS\MAGSHIMIM\DOCUMENTS\MAGSHIMIM_WORKS\ADVANCED_PRINCIPLES_SEMESTER_1\HW7\CHESS_PROJECT\CHESS\CHESS\X64\DEBUG\KING.OBJ
C:\USERS\MAGSHIMIM\DOCUMENTS\MAGSHIMIM_WORKS\ADVANCED_PRINCIPLES_SEMESTER_1\HW7\CHESS_PROJECT\CHESS\CHESS\X64\DEBUG\BOARD.OBJ
^C:\USERS\MAGSHIMIM\DOCUMENTS\MAGSHIMIM_WORKS\ADVANCED_PRINCIPLES_SEMESTER_1\HW7\CHESS_PROJECT\CHESS\CHESS\BOARD.CPP|C:\USERS\MAGSHIMIM\DOCUMENTS\MAGSHIMIM_WORKS\ADVANCED_PRINCIPLES_SEMESTER_1\HW7\CHESS_PROJECT\CHESS\CHESS\KING.CPP
C:\USERS\MAGSHIMIM\DOCUMENTS\MAGSHIMIM_WORKS\ADVANCED_PRINCIPLES_SEMESTER_1\HW7\CHESS_PROJECT\CHESS\CHESS\X64\DEBUG\VC141.PDB
C:\USERS\MAGSHIMIM\DOCUMENTS\MAGSHIMIM_WORKS\ADVANCED_PRINCIPLES_SEMESTER_1\HW7\CHESS_PROJECT\CHESS\CHESS\X64\DEBUG\VC141.IDB
C:\USERS\MAGSHIMIM\DOCUMENTS\MAGSHIMIM_WORKS\ADVANCED_PRINCIPLES_SEMESTER_1\HW7\CHESS_PROJECT\CHESS\CHESS\X64\DEBUG\BOARD.OBJ
C:\USERS\MAGSHIMIM\DOCUMENTS\MAGSHIMIM_WORKS\ADVANCED_PRINCIPLES_SEMESTER_1\HW7\CHESS_PROJECT\CHESS\CHESS\X64\DEBUG\KING.OBJ
^C:\USERS\MAGSHIMIM\DOCUMENTS\MAGSHIMIM_WORKS\ADVANCED_PRINCIPLES_SEMESTER_1\HW7\CHESS_PROJECT\CHESS\CHESS\BOARD.CPP|C:\USERS\MAGSHIMIM\DOCUMENTS\MAGSHIMIM_WORKS\ADVANCED_PRINCIPLES_SEMESTER_1\HW7\CHESS_PROJECT\CHESS\CHESS\PAWN.CPP|C:\USERS\MAGSHIMIM\DOCUMENTS\MAGSHIMIM_WORKS\ADVANCED_PRINCIPLES_SEMESTER_1\HW7\CHESS_PROJECT\CHESS\CHESS\SOURCE.CPP
C:\USERS\MAGSHIMIM\DOCUMENTS\MAGSHIMIM_WORKS\ADVANCED_PRINCIPLES_SEMESTER_1\HW7\CHESS_PROJECT\CHESS\CHESS\X64\DEBUG\VC141.PDB
C:\USERS\MAGSHIMIM\DOCUMENTS\MAGSHIMIM_WORKS\ADVANCED_PRINCIPLES_SEMESTER_1\HW7\CHESS_PROJECT\CHESS\CHESS\X64\DEBUG\VC141.IDB
C:\USERS\MAGSHIMIM\DOCUMENTS\MAGSHIMIM_WORKS\ADVANCED_PRINCIPLES_SEMESTER_1\HW7\CHESS_PROJECT\CHESS\CHESS\X64\DEBUG\SOURCE.OBJ
C:\USERS\MAGSHIMIM\DOCUMENTS\MAGSHIMIM_WORKS\ADVANCED_PRINCIPLES_SEMESTER_1\HW7\CHESS_PROJECT\CHESS\CHESS\X64\DEBUG\PAWN.OBJ
C:\USERS\MAGSHIMIM\DOCUMENTS\MAGSHIMIM_WORKS\ADVANCED_PRINCIPLES_SEMESTER_1\HW7\CHESS_PROJECT\CHESS\CHESS\X64\DEBUG\BOARD.OBJ
^C:\USERS\MAGSHIMIM\DOCUMENTS\MAGSHIMIM_WORKS\ADVANCED_PRINCIPLES_SEMESTER_1\HW7\CHESS_PROJECT\CHESS\CHESS\BISHOP.CPP|C:\USERS\MAGSHIMIM\DOCUMENTS\MAGSHIMIM_WORKS\ADVANCED_PRINCIPLES_SEMESTER_1\HW7\CHESS_PROJECT\CHESS\CHESS\BOARD.CPP|C:\USERS\MAGSHIMIM\DOCUMENTS\MAGSHIMIM_WORKS\ADVANCED_PRINCIPLES_SEMESTER_1\HW7\CHESS_PROJECT\CHESS\CHESS\KING.CPP|C:\USERS\MAGSHIMIM\DOCUMENTS\MAGSHIMIM_WORKS\ADVANCED_PRINCIPLES_SEMESTER_1\HW7\CHESS_PROJECT\CHESS\CHESS\KNIGHT.CPP|C:\USERS\MAGSHIMIM\DOCUMENTS\MAGSHIMIM_WORKS\ADVANCED_PRINCIPLES_SEMESTER_1\HW7\CHESS_PROJECT\CHESS\CHESS\PAWN.CPP|C:\USERS\MAGSHIMIM\DOCUMENTS\MAGSHIMIM_WORKS\ADVANCED_PRINCIPLES_SEMESTER_1\HW7\CHESS_PROJECT\CHESS\CHESS\PIECE.CPP|C:\USERS\MAGSHIMIM\DOCUMENTS\MAGSHIMIM_WORKS\ADVANCED_PRINCIPLES_SEMESTER_1\HW7\CHESS_PROJECT\CHESS\CHESS\QUEEN.CPP|C:\USERS\MAGSHIMIM\DOCUMENTS\MAGSHIMIM_WORKS\ADVANCED_PRINCIPLES_SEMESTER_1\HW7\CHESS_PROJECT\CHESS\CHESS\ROOK.CPP|C:\USERS\MAGSHIMIM\DOCUMENTS\MAGSHIMIM_WORKS\ADVANCED_PRINCIPLES_SEMESTER_1\HW7\CHESS_PROJECT\CHESS\CHESS\SOURCE.CPP|C:\USERS\MAGSHIMIM\DOCUMENTS\MAGSHIMIM_WORKS\ADVANCED_PRINCIPLES_SEMESTER_1\HW7\CHESS_PROJECT\CHESS\CHESS\STDAFX.CPP
C:\USERS\MAGSHIMIM\DOCUMENTS\MAGSHIMIM_WORKS\ADVANCED_PRINCIPLES_SEMESTER_1\HW7\CHESS_PROJECT\CHESS\CHESS\X64\DEBUG\VC141.PDB
C:\USERS\MAGSHIMIM\DOCUMENTS\MAGSHIMIM_WORKS\ADVANCED_PRINCIPLES_SEMESTER_1\HW7\CHESS_PROJECT\CHESS\CHESS\X64\DEBUG\VC141.IDB
C:\USERS\MAGSHIMIM\DOCUMENTS\MAGSHIMIM_WORKS\ADVANCED_PRINCIPLES_SEMESTER_1\HW7\CHESS_PROJECT\CHESS\CHESS\X64\DEBUG\STDAFX.OBJ
C:\USERS\MAGSHIMIM\DOCUMENTS\MAGSHIMIM_WORKS\ADVANCED_PRINCIPLES_SEMESTER_1\HW7\CHESS_PROJECT\CHESS\CHESS\X64\DEBUG\ROOK.OBJ
C:\USERS\MAGSHIMIM\DOCUMENTS\MAGSHIMIM_WORKS\ADVANCED_PRINCIPLES_SEMESTER_1\HW7\CHESS_PROJECT\CHESS\CHESS\X64\DEBUG\PIECE.OBJ
C:\USERS\MAGSHIMIM\DOCUMENTS\MAGSHIMIM_WORKS\ADVANCED_PRINCIPLES_SEMESTER_1\HW7\CHESS_PROJECT\CHESS\CHESS\X64\DEBUG\BOARD.OBJ
C:\USERS\MAGSHIMIM\DOCUMENTS\MAGSHIMIM_WORKS\ADVANCED_PRINCIPLES_SEMESTER_1\HW7\CHESS_PROJECT\CHESS\CHESS\X64\DEBUG\QUEEN.OBJ
C:\USERS\MAGSHIMIM\DOCUMENTS\MAGSHIMIM_WORKS\ADVANCED_PRINCIPLES_SEMESTER_1\HW7\CHESS_PROJECT\CHESS\CHESS\X64\DEBUG\PAWN.OBJ
C:\USERS\MAGSHIMIM\DOCUMENTS\MAGSHIMIM_WORKS\ADVANCED_PRINCIPLES_SEMESTER_1\HW7\CHESS_PROJECT\CHESS\CHESS\X64\DEBUG\KNIGHT.OBJ
C:\USERS\MAGSHIMIM\DOCUMENTS\MAGSHIMIM_WORKS\ADVANCED_PRINCIPLES_SEMESTER_1\HW7\CHESS_PROJECT\CHESS\CHESS\X64\DEBUG\KING.OBJ
C:\USERS\MAGSHIMIM\DOCUMENTS\MAGSHIMIM_WORKS\ADVANCED_PRINCIPLES_SEMESTER_1\HW7\CHESS_PROJECT\CHESS\CHESS\X64\DEBUG\BISHOP.OBJ
^C:\USERS\MAGSHIMIM\DOCUMENTS\MAGSHIMIM_WORKS\ADVANCED_PRINCIPLES_SEMESTER_1\HW7\CHESS_PROJECT\CHESS\CHESS\STDAFX.CPP
C:\USERS\MAGSHIMIM\DOCUMENTS\MAGSHIMIM_WORKS\ADVANCED_PRINCIPLES_SEMESTER_1\HW7\CHESS_PROJECT\CHESS\CHESS\X64\DEBUG\STDAFX.OBJ
^C:\USERS\MAGSHIMIM\DOCUMENTS\MAGSHIMIM_WORKS\ADVANCED_PRINCIPLES_SEMESTER_1\HW7\CHESS_PROJECT\CHESS\CHESS\BOARD.CPP|C:\USERS\MAGSHIMIM\DOCUMENTS\MAGSHIMIM_WORKS\ADVANCED_PRINCIPLES_SEMESTER_1\HW7\CHESS_PROJECT\CHESS\CHESS\QUEEN.CPP
C:\USERS\MAGSHIMIM\DOCUMENTS\MAGSHIMIM_WORKS\ADVANCED_PRINCIPLES_SEMESTER_1\HW7\CHESS_PROJECT\CHESS\CHESS\X64\DEBUG\VC141.PDB
C:\USERS\MAGSHIMIM\DOCUMENTS\MAGSHIMIM_WORKS\ADVANCED_PRINCIPLES_SEMESTER_1\HW7\CHESS_PROJECT\CHESS\CHESS\X64\DEBUG\VC141.IDB
C:\USERS\MAGSHIMIM\DOCUMENTS\MAGSHIMIM_WORKS\ADVANCED_PRINCIPLES_SEMESTER_1\HW7\CHESS_PROJECT\CHESS\CHESS\X64\DEBUG\BOARD.OBJ
C:\USERS\MAGSHIMIM\DOCUMENTS\MAGSHIMIM_WORKS\ADVANCED_PRINCIPLES_SEMESTER_1\HW7\CHESS_PROJECT\CHESS\CHESS\X64\DEBUG\QUEEN.OBJ
^C:\USERS\MAGSHIMIM\DOCUMENTS\MAGSHIMIM_WORKS\ADVANCED_PRINCIPLES_SEMESTER_1\HW7\CHESS_PROJECT\CHESS\CHESS\BISHOP.CPP|C:\USERS\MAGSHIMIM\DOCUMENTS\MAGSHIMIM_WORKS\ADVANCED_PRINCIPLES_SEMESTER_1\HW7\CHESS_PROJECT\CHESS\CHESS\BOARD.CPP|C:\USERS\MAGSHIMIM\DOCUMENTS\MAGSHIMIM_WORKS\ADVANCED_PRINCIPLES_SEMESTER_1\HW7\CHESS_PROJECT\CHESS\CHESS\KING.CPP|C:\USERS\MAGSHIMIM\DOCUMENTS\MAGSHIMIM_WORKS\ADVANCED_PRINCIPLES_SEMESTER_1\HW7\CHESS_PROJECT\CHESS\CHESS\KNIGHT.CPP|C:\USERS\MAGSHIMIM\DOCUMENTS\MAGSHIMIM_WORKS\ADVANCED_PRINCIPLES_SEMESTER_1\HW7\CHESS_PROJECT\CHESS\CHESS\PAWN.CPP|C:\USERS\MAGSHIMIM\DOCUMENTS\MAGSHIMIM_WORKS\ADVANCED_PRINCIPLES_SEMESTER_1\HW7\CHESS_PROJECT\CHESS\CHESS\PIECE.CPP|C:\USERS\MAGSHIMIM\DOCUMENTS\MAGSHIMIM_WORKS\ADVANCED_PRINCIPLES_SEMESTER_1\HW7\CHESS_PROJECT\CHESS\CHESS\QUEEN.CPP|C:\USERS\MAGSHIMIM\DOCUMENTS\MAGSHIMIM_WORKS\ADVANCED_PRINCIPLES_SEMESTER_1\HW7\CHESS_PROJECT\CHESS\CHESS\ROOK.CPP|C:\USERS\MAGSHIMIM\DOCUMENTS\MAGSHIMIM_WORKS\ADVANCED_PRINCIPLES_SEMESTER_1\HW7\CHESS_PROJECT\CHESS\CHESS\SOURCE.CPP
C:\USERS\MAGSHIMIM\DOCUMENTS\MAGSHIMIM_WORKS\ADVANCED_PRINCIPLES_SEMESTER_1\HW7\CHESS_PROJECT\CHESS\CHESS\X64\DEBUG\VC141.PDB
C:\USERS\MAGSHIMIM\DOCUMENTS\MAGSHIMIM_WORKS\ADVANCED_PRINCIPLES_SEMESTER_1\HW7\CHESS_PROJECT\CHESS\CHESS\X64\DEBUG\VC141.IDB
C:\USERS\MAGSHIMIM\DOCUMENTS\MAGSHIMIM_WORKS\ADVANCED_PRINCIPLES_SEMESTER_1\HW7\CHESS_PROJECT\CHESS\CHESS\X64\DEBUG\ROOK.OBJ
C:\USERS\MAGSHIMIM\DOCUMENTS\MAGSHIMIM_WORKS\ADVANCED_PRINCIPLES_SEMESTER_1\HW7\CHESS_PROJECT\CHESS\CHESS\X64\DEBUG\PIECE.OBJ
C:\USERS\MAGSHIMIM\DOCUMENTS\MAGSHIMIM_WORKS\ADVANCED_PRINCIPLES_SEMESTER_1\HW7\CHESS_PROJECT\CHESS\CHESS\X64\DEBUG\BOARD.OBJ
C:\USERS\MAGSHIMIM\DOCUMENTS\MAGSHIMIM_WORKS\ADVANCED_PRINCIPLES_SEMESTER_1\HW7\CHESS_PROJECT\CHESS\CHESS\X64\DEBUG\SOURCE.OBJ
C:\USERS\MAGSHIMIM\DOCUMENTS\MAGSHIMIM_WORKS\ADVANCED_PRINCIPLES_SEMESTER_1\HW7\CHESS_PROJECT\CHESS\CHESS\X64\DEBUG\QUEEN.OBJ
C:\USERS\MAGSHIMIM\DOCUMENTS\MAGSHIMIM_WORKS\ADVANCED_PRINCIPLES_SEMESTER_1\HW7\CHESS_PROJECT\CHESS\CHESS\X64\DEBUG\PAWN.OBJ
C:\USERS\MAGSHIMIM\DOCUMENTS\MAGSHIMIM_WORKS\ADVANCED_PRINCIPLES_SEMESTER_1\HW7\CHESS_PROJECT\CHESS\CHESS\X64\DEBUG\KNIGHT.OBJ
C:\USERS\MAGSHIMIM\DOCUMENTS\MAGSHIMIM_WORKS\ADVANCED_PRINCIPLES_SEMESTER_1\HW7\CHESS_PROJECT\CHESS\CHESS\X64\DEBUG\KING.OBJ
C:\USERS\MAGSHIMIM\DOCUMENTS\MAGSHIMIM_WORKS\ADVANCED_PRINCIPLES_SEMESTER_1\HW7\CHESS_PROJECT\CHESS\CHESS\X64\DEBUG\BISHOP.OBJ
^C:\USERS\MAGSHIMIM\DOCUMENTS\MAGSHIMIM_WORKS\ADVANCED_PRINCIPLES_SEMESTER_1\HW7\CHESS_PROJECT\CHESS\CHESS\BISHOP.CPP
C:\USERS\MAGSHIMIM\DOCUMENTS\MAGSHIMIM_WORKS\ADVANCED_PRINCIPLES_SEMESTER_1\HW7\CHESS_PROJECT\CHESS\CHESS\X64\DEBUG\VC141.PDB
^C:\USERS\MAGSHIMIM\DOCUMENTS\MAGSHIMIM_WORKS\ADVANCED_PRINCIPLES_SEMESTER_1\HW7\CHESS_PROJECT\CHESS\CHESS\KING.CPP
C:\USERS\MAGSHIMIM\DOCUMENTS\MAGSHIMIM_WORKS\ADVANCED_PRINCIPLES_SEMESTER_1\HW7\CHESS_PROJECT\CHESS\CHESS\X64\DEBUG\VC141.PDB
^C:\USERS\MAGSHIMIM\DOCUMENTS\MAGSHIMIM_WORKS\ADVANCED_PRINCIPLES_SEMESTER_1\HW7\CHESS_PROJECT\CHESS\CHESS\KNIGHT.CPP
C:\USERS\MAGSHIMIM\DOCUMENTS\MAGSHIMIM_WORKS\ADVANCED_PRINCIPLES_SEMESTER_1\HW7\CHESS_PROJECT\CHESS\CHESS\X64\DEBUG\VC141.PDB
^C:\USERS\MAGSHIMIM\DOCUMENTS\MAGSHIMIM_WORKS\ADVANCED_PRINCIPLES_SEMESTER_1\HW7\CHESS_PROJECT\CHESS\CHESS\QUEEN.CPP
C:\USERS\MAGSHIMIM\DOCUMENTS\MAGSHIMIM_WORKS\ADVANCED_PRINCIPLES_SEMESTER_1\HW7\CHESS_PROJECT\CHESS\CHESS\X64\DEBUG\VC141.PDB
^C:\USERS\MAGSHIMIM\DOCUMENTS\MAGSHIMIM_WORKS\ADVANCED_PRINCIPLES_SEMESTER_1\HW7\CHESS_PROJECT\CHESS\CHESS\SOURCE.CPP
C:\USERS\MAGSHIMIM\DOCUMENTS\MAGSHIMIM_WORKS\ADVANCED_PRINCIPLES_SEMESTER_1\HW7\CHESS_PROJECT\CHESS\CHESS\X64\DEBUG\VC141.PDB
^C:\USERS\MAGSHIMIM\DOCUMENTS\MAGSHIMIM_WORKS\ADVANCED_PRINCIPLES_SEMESTER_1\HW7\CHESS_PROJECT\CHESS\CHESS\PIECE.CPP
C:\USERS\MAGSHIMIM\DOCUMENTS\MAGSHIMIM_WORKS\ADVANCED_PRINCIPLES_SEMESTER_1\HW7\CHESS_PROJECT\CHESS\CHESS\X64\DEBUG\VC141.PDB
^C:\USERS\MAGSHIMIM\DOCUMENTS\MAGSHIMIM_WORKS\ADVANCED_PRINCIPLES_SEMESTER_1\HW7\CHESS_PROJECT\CHESS\CHESS\ROOK.CPP
C:\USERS\MAGSHIMIM\DOCUMENTS\MAGSHIMIM_WORKS\ADVANCED_PRINCIPLES_SEMESTER_1\HW7\CHESS_PROJECT\CHESS\CHESS\X64\DEBUG\VC141.PDB
^C:\USERS\MAGSHIMIM\DOCUMENTS\MAGSHIMIM_WORKS\ADVANCED_PRINCIPLES_SEMESTER_1\HW7\CHESS_PROJECT\CHESS\CHESS\BOARD.CPP|C:\USERS\MAGSHIMIM\DOCUMENTS\MAGSHIMIM_WORKS\ADVANCED_PRINCIPLES_SEMESTER_1\HW7\CHESS_PROJECT\CHESS\CHESS\PAWN.CPP
C:\USERS\MAGSHIMIM\DOCUMENTS\MAGSHIMIM_WORKS\ADVANCED_PRINCIPLES_SEMESTER_1\HW7\CHESS_PROJECT\CHESS\CHESS\X64\DEBUG\VC141.PDB
C:\USERS\MAGSHIMIM\DOCUMENTS\MAGSHIMIM_WORKS\ADVANCED_PRINCIPLES_SEMESTER_1\HW7\CHESS_PROJECT\CHESS\CHESS\X64\DEBUG\VC141.IDB
C:\USERS\MAGSHIMIM\DOCUMENTS\MAGSHIMIM_WORKS\ADVANCED_PRINCIPLES_SEMESTER_1\HW7\CHESS_PROJECT\CHESS\CHESS\X64\DEBUG\BOARD.OBJ
C:\USERS\MAGSHIMIM\DOCUMENTS\MAGSHIMIM_WORKS\ADVANCED_PRINCIPLES_SEMESTER_1\HW7\CHESS_PROJECT\CHESS\CHESS\X64\DEBUG\PAWN.OBJ
^C:\USERS\MAGSHIMIM\DOCUMENTS\MAGSHIMIM_WORKS\ADVANCED_PRINCIPLES_SEMESTER_1\HW7\CHESS_PROJECT\CHESS\CHESS\PAWN.CPP
C:\USERS\MAGSHIMIM\DOCUMENTS\MAGSHIMIM_WORKS\ADVANCED_PRINCIPLES_SEMESTER_1\HW7\CHESS_PROJECT\CHESS\CHESS\X64\DEBUG\VC141.PDB
C:\USERS\MAGSHIMIM\DOCUMENTS\MAGSHIMIM_WORKS\ADVANCED_PRINCIPLES_SEMESTER_1\HW7\CHESS_PROJECT\CHESS\CHESS\X64\DEBUG\VC141.IDB
C:\USERS\MAGSHIMIM\DOCUMENTS\MAGSHIMIM_WORKS\ADVANCED_PRINCIPLES_SEMESTER_1\HW7\CHESS_PROJECT\CHESS\CHESS\X64\DEBUG\PAWN.OBJ
^C:\USERS\MAGSHIMIM\DOCUMENTS\MAGSHIMIM_WORKS\ADVANCED_PRINCIPLES_SEMESTER_1\HW7\CHESS_PROJECT\CHESS\CHESS\BOARD.CPP
C:\USERS\MAGSHIMIM\DOCUMENTS\MAGSHIMIM_WORKS\ADVANCED_PRINCIPLES_SEMESTER_1\HW7\CHESS_PROJECT\CHESS\CHESS\X64\DEBUG\VC141.PDB
C:\USERS\MAGSHIMIM\DOCUMENTS\MAGSHIMIM_WORKS\ADVANCED_PRINCIPLES_SEMESTER_1\HW7\CHESS_PROJECT\CHESS\CHESS\X64\DEBUG\VC141.IDB
C:\USERS\MAGSHIMIM\DOCUMENTS\MAGSHIMIM_WORKS\ADVANCED_PRINCIPLES_SEMESTER_1\HW7\CHESS_PROJECT\CHESS\CHESS\X64\DEBUG\BOARD.OBJ
