^C:\USERS\MAGSHIMIM\DOCUMENTS\MAGSHIMIM_WORKS\ADVANCED_PRINCIPLES_SEMESTER_1\HW7\CHESS_PROJECT\CHESS\CHESS\STDAFX.CPP
/c /ZI /nologo /W3 /WX- /diagnostics:classic /sdl /Od /Oy- /D _MBCS /Gm- /EHsc /RTC1 /MDd /GS /fp:precise /permissive- /Zc:wchar_t /Zc:forScope /Zc:inline /Fo"DEBUG\\" /Fd"DEBUG\VC141.PDB" /Gd /TP /analyze- /FC C:\USERS\MAGSHIMIM\DOCUMENTS\MAGSHIMIM_WORKS\ADVANCED_PRINCIPLES_SEMESTER_1\HW7\CHESS_PROJECT\CHESS\CHESS\STDAFX.CPP
^C:\USERS\MAGSHIMIM\DOCUMENTS\MAGSHIMIM_WORKS\ADVANCED_PRINCIPLES_SEMESTER_1\HW7\CHESS_PROJECT\CHESS\CHESS\BOARD.CPP
/c /ZI /nologo /W3 /WX- /diagnostics:classic /sdl /Od /Oy- /D _MBCS /Gm- /EHsc /RTC1 /MDd /GS /fp:precise /permissive- /Zc:wchar_t /Zc:forScope /Zc:inline /Fo"DEBUG\\" /Fd"DEBUG\VC141.PDB" /Gd /TP /analyze- /FC C:\USERS\MAGSHIMIM\DOCUMENTS\MAGSHIMIM_WORKS\ADVANCED_PRINCIPLES_SEMESTER_1\HW7\CHESS_PROJECT\CHESS\CHESS\BOARD.CPP
^C:\USERS\MAGSHIMIM\DOCUMENTS\MAGSHIMIM_WORKS\ADVANCED_PRINCIPLES_SEMESTER_1\HW7\CHESS_PROJECT\CHESS\CHESS\PIECE.CPP
/c /ZI /nologo /W3 /WX- /diagnostics:classic /sdl /Od /Oy- /D _MBCS /Gm- /EHsc /RTC1 /MDd /GS /fp:precise /permissive- /Zc:wchar_t /Zc:forScope /Zc:inline /Fo"DEBUG\\" /Fd"DEBUG\VC141.PDB" /Gd /TP /analyze- /FC C:\USERS\MAGSHIMIM\DOCUMENTS\MAGSHIMIM_WORKS\ADVANCED_PRINCIPLES_SEMESTER_1\HW7\CHESS_PROJECT\CHESS\CHESS\PIECE.CPP
^C:\USERS\MAGSHIMIM\DOCUMENTS\MAGSHIMIM_WORKS\ADVANCED_PRINCIPLES_SEMESTER_1\HW7\CHESS_PROJECT\CHESS\CHESS\ROOK.CPP
/c /ZI /nologo /W3 /WX- /diagnostics:classic /sdl /Od /Oy- /D _MBCS /Gm- /EHsc /RTC1 /MDd /GS /fp:precise /permissive- /Zc:wchar_t /Zc:forScope /Zc:inline /Fo"DEBUG\\" /Fd"DEBUG\VC141.PDB" /Gd /TP /analyze- /FC C:\USERS\MAGSHIMIM\DOCUMENTS\MAGSHIMIM_WORKS\ADVANCED_PRINCIPLES_SEMESTER_1\HW7\CHESS_PROJECT\CHESS\CHESS\ROOK.CPP
^C:\USERS\MAGSHIMIM\DOCUMENTS\MAGSHIMIM_WORKS\ADVANCED_PRINCIPLES_SEMESTER_1\HW7\CHESS_PROJECT\CHESS\CHESS\SOURCE.CPP
/c /ZI /nologo /W3 /WX- /diagnostics:classic /sdl /Od /Oy- /D _MBCS /Gm- /EHsc /RTC1 /MDd /GS /fp:precise /permissive- /Zc:wchar_t /Zc:forScope /Zc:inline /Fo"DEBUG\\" /Fd"DEBUG\VC141.PDB" /Gd /TP /analyze- /FC C:\USERS\MAGSHIMIM\DOCUMENTS\MAGSHIMIM_WORKS\ADVANCED_PRINCIPLES_SEMESTER_1\HW7\CHESS_PROJECT\CHESS\CHESS\SOURCE.CPP
