<?xml version="1.0" encoding="utf-8"?>
<!-- Generator: Adobe Illustrator 23.0.6, SVG Export Plug-In . SVG Version: 6.00 Build 0)  -->
<svg version="1.1" id="Layer_1" xmlns="http://www.w3.org/2000/svg" xmlns:xlink="http://www.w3.org/1999/xlink" x="0px" y="0px"
	 viewBox="0 0 256 256" enable-background="new 0 0 256 256" xml:space="preserve">
<path fill="currentColor" d="M128,8L23.8,68.1v120.3L128,248.6l104.2-60.1V68.1L128,8z M92.1,149.1v37.3l-32.4-18.7v-37.3L92.1,149.1L92.1,149.1z
	 M59.7,127.7V90.3L92.1,109v37.3L59.7,127.7z M94.4,187.8v-37.3l32.4,18.7v37.3L94.4,187.8z M126.8,166.3l-32.4-18.7v-37.3
	l32.4,18.7V166.3z M95.6,68.1L128,49.5l32.4,18.7L128,86.8C128,86.8,95.6,68.1,95.6,68.1z M161.5,226.5l-32.4,18.7v-35.9l32.4-18.7
	V226.5z M161.5,187.8l-32.3,18.7v-37.3l32.4-18.7L161.5,187.8L161.5,187.8z M161.5,147.7l-32.4,18.7V129l32.4-18.7V147.7
	L161.5,147.7z M130.4,88.2l32.4-18.7l32.4,18.7l-32.4,18.7L130.4,88.2L130.4,88.2z M196.3,206.5l-32.4,18.7v-35.9l32.4-18.7V206.5z
	 M196.3,167.7l-32.4,18.7V149l32.4-18.7V167.7L196.3,167.7z M196.3,127.7l-32.4,18.7V109l32.4-18.7V127.7L196.3,127.7z M229.8,187.1
	l-31.1,18v-35.9l31.1-18L229.8,187.1L229.8,187.1z M229.8,148.4l-31.1,18V129l31.1-18L229.8,148.4L229.8,148.4z M229.8,108.3
	l-31.1,18V88.9l31.1-18L229.8,108.3L229.8,108.3z"/>
</svg>
