{
    "trace_processor_shell": {
        "linux_arm64": {
            "hash": "5074025a2898ec41a872e70a5719e417acb0a380",
            "full_remote_path": "chromium-telemetry/perfetto_binaries/trace_processor_shell/linux_arm64/49b4b5dcbc312d8d2c3751cf29238b8efeb4e494/trace_processor_shell"
        },
        "win": {
            "hash": "464349636569a9f96e9ee2dc440a85667ef862db",
            "full_remote_path": "chromium-telemetry/perfetto_binaries/trace_processor_shell/win/3a9f96aecc5ffe0b5a9d6d540653468f0b215842/trace_processor_shell.exe"
        },
        "linux_arm": {
            "hash": "58893933be305d3bfe0a72ebebcacde2ac3ca893",
            "full_remote_path": "chromium-telemetry/perfetto_binaries/trace_processor_shell/linux_arm/49b4b5dcbc312d8d2c3751cf29238b8efeb4e494/trace_processor_shell"
        },
        "mac": {
            "hash": "ef8f48de5e54c1aae1298115d04e68c8abfadf4c",
            "full_remote_path": "chromium-telemetry/perfetto_binaries/trace_processor_shell/mac/3a9f96aecc5ffe0b5a9d6d540653468f0b215842/trace_processor_shell"
        },
        "mac_arm64": {
            "hash": "e1ad4861384b06d911a65f035317914b8cc975c6",
            "full_remote_path": "perfetto-luci-artifacts/v25.0/mac-arm64/trace_processor_shell"
        },
        "linux": {
            "hash": "120c76863562e2e62a7c3c94906fb617d1b04bea",
            "full_remote_path": "chromium-telemetry/perfetto_binaries/trace_processor_shell/linux/3a9f96aecc5ffe0b5a9d6d540653468f0b215842/trace_processor_shell"
        }
    },
    "power_profile.sql": {
        "hash": "5bc5eae952c72d04403409a56838f66da13394d6",
        "full_remote_path": "chrome-telemetry/perfetto_data/power_profile.sql/20200713T171147/power_profile.sql"
    }
}