{
  "ChromeOS FYI Release (amd64-generic)": {
    "args_file": "//build/args/chromeos/amd64-generic-vm.gni",
    "gn_args": {
      "dcheck_always_on": false,
      "ffmpeg_branding": "Chrome",
      "is_chromeos_device": true,
      "is_component_build": false,
      "is_debug": false,
      "ozone_platform_headless": true,
      "proprietary_codecs": true,
      "symbol_level": 0,
      "use_remoteexec": true
    }
  },
  "ChromeOS FYI Release (kevin)": {
    "args_file": "//build/args/chromeos/kevin.gni",
    "gn_args": {
      "dcheck_always_on": false,
      "ffmpeg_branding": "Chrome",
      "is_chromeos_device": true,
      "is_component_build": false,
      "is_debug": false,
      "ozone_platform_headless": true,
      "proprietary_codecs": true,
      "symbol_level": 0,
      "use_remoteexec": true
    }
  },
  "GPU FYI Android arm Builder": {
    "gn_args": {
      "dcheck_always_on": true,
      "ffmpeg_branding": "Chrome",
      "is_component_build": false,
      "is_debug": false,
      "proprietary_codecs": true,
      "symbol_level": 1,
      "target_os": "android",
      "use_remoteexec": true,
      "use_static_angle": true
    }
  },
  "GPU FYI Android arm64 Builder": {
    "gn_args": {
      "dcheck_always_on": true,
      "ffmpeg_branding": "Chrome",
      "is_component_build": false,
      "is_debug": false,
      "proprietary_codecs": true,
      "symbol_level": 1,
      "target_cpu": "arm64",
      "target_os": "android",
      "use_remoteexec": true,
      "use_static_angle": true
    }
  },
  "GPU FYI Lacros x64 Builder": {
    "gn_args": {
      "dcheck_always_on": true,
      "ffmpeg_branding": "Chrome",
      "is_component_build": false,
      "is_debug": false,
      "ozone_platform": "headless",
      "ozone_platform_x11": false,
      "proprietary_codecs": true,
      "symbol_level": 1,
      "use_bundled_weston": true,
      "use_ozone": true,
      "use_remoteexec": true
    }
  },
  "GPU FYI Linux Builder": {
    "gn_args": {
      "dcheck_always_on": true,
      "enable_nacl": false,
      "ffmpeg_branding": "Chrome",
      "is_component_build": false,
      "is_debug": false,
      "proprietary_codecs": true,
      "symbol_level": 1,
      "use_remoteexec": true
    }
  },
  "GPU FYI Linux Builder (dbg)": {
    "gn_args": {
      "enable_nacl": false,
      "ffmpeg_branding": "Chrome",
      "is_component_build": true,
      "is_debug": true,
      "proprietary_codecs": true,
      "symbol_level": 1,
      "use_remoteexec": true
    }
  },
  "GPU FYI Mac Builder": {
    "gn_args": {
      "dcheck_always_on": true,
      "enable_nacl": false,
      "ffmpeg_branding": "Chrome",
      "is_component_build": false,
      "is_debug": false,
      "proprietary_codecs": true,
      "symbol_level": 1,
      "use_remoteexec": true
    }
  },
  "GPU FYI Mac Builder (asan)": {
    "gn_args": {
      "dcheck_always_on": true,
      "enable_nacl": false,
      "ffmpeg_branding": "Chrome",
      "is_asan": true,
      "is_component_build": false,
      "is_debug": false,
      "proprietary_codecs": true,
      "symbol_level": 1,
      "use_remoteexec": true
    }
  },
  "GPU FYI Mac Builder (dbg)": {
    "gn_args": {
      "enable_nacl": false,
      "ffmpeg_branding": "Chrome",
      "is_component_build": true,
      "is_debug": true,
      "proprietary_codecs": true,
      "symbol_level": 1,
      "use_remoteexec": true
    }
  },
  "GPU FYI Mac arm64 Builder": {
    "gn_args": {
      "dcheck_always_on": true,
      "enable_nacl": false,
      "ffmpeg_branding": "Chrome",
      "is_component_build": false,
      "is_debug": false,
      "proprietary_codecs": true,
      "symbol_level": 1,
      "target_cpu": "arm64",
      "use_remoteexec": true
    }
  },
  "GPU FYI Win Builder": {
    "gn_args": {
      "dcheck_always_on": true,
      "enable_nacl": false,
      "ffmpeg_branding": "Chrome",
      "is_component_build": false,
      "is_debug": false,
      "proprietary_codecs": true,
      "symbol_level": 1,
      "target_cpu": "x86",
      "use_remoteexec": true
    }
  },
  "GPU FYI Win x64 Builder": {
    "gn_args": {
      "dcheck_always_on": true,
      "enable_nacl": false,
      "ffmpeg_branding": "Chrome",
      "is_component_build": false,
      "is_debug": false,
      "proprietary_codecs": true,
      "symbol_level": 1,
      "use_remoteexec": true
    }
  },
  "GPU FYI Win x64 Builder (dbg)": {
    "gn_args": {
      "enable_nacl": false,
      "ffmpeg_branding": "Chrome",
      "is_component_build": true,
      "is_debug": true,
      "proprietary_codecs": true,
      "symbol_level": 1,
      "use_remoteexec": true
    }
  },
  "GPU FYI Win x64 DX12 Vulkan Builder": {
    "gn_args": {
      "dcheck_always_on": true,
      "enable_nacl": false,
      "enable_vulkan": true,
      "ffmpeg_branding": "Chrome",
      "is_component_build": false,
      "is_debug": false,
      "proprietary_codecs": true,
      "symbol_level": 1,
      "use_remoteexec": true
    }
  },
  "GPU FYI Win x64 DX12 Vulkan Builder (dbg)": {
    "gn_args": {
      "enable_nacl": false,
      "enable_vulkan": true,
      "ffmpeg_branding": "Chrome",
      "is_component_build": true,
      "is_debug": true,
      "proprietary_codecs": true,
      "symbol_level": 1,
      "use_remoteexec": true
    }
  },
  "GPU FYI XR Win x64 Builder": {
    "gn_args": {
      "dcheck_always_on": true,
      "enable_nacl": false,
      "ffmpeg_branding": "Chrome",
      "is_component_build": false,
      "is_debug": false,
      "proprietary_codecs": true,
      "symbol_level": 1,
      "use_remoteexec": true
    }
  },
  "Linux FYI GPU TSAN Release": {
    "gn_args": {
      "dcheck_always_on": true,
      "enable_nacl": false,
      "ffmpeg_branding": "Chrome",
      "is_component_build": false,
      "is_debug": false,
      "is_tsan": true,
      "proprietary_codecs": true,
      "symbol_level": 1,
      "use_remoteexec": true
    }
  },
  "gpu-fyi-chromeos-jacuzzi-exp": {
    "args_file": "//build/args/chromeos/jacuzzi.gni",
    "gn_args": {
      "dcheck_always_on": true,
      "ffmpeg_branding": "Chrome",
      "is_chromeos_device": true,
      "is_component_build": false,
      "is_debug": false,
      "ozone_platform_headless": true,
      "proprietary_codecs": true,
      "symbol_level": 0,
      "use_goma": true
    }
  },
  "gpu-fyi-chromeos-octopus-exp": {
    "args_file": "//build/args/chromeos/octopus.gni",
    "gn_args": {
      "dcheck_always_on": true,
      "ffmpeg_branding": "Chrome",
      "is_chromeos_device": true,
      "is_component_build": false,
      "is_debug": false,
      "ozone_platform_headless": true,
      "proprietary_codecs": true,
      "symbol_level": 0,
      "use_goma": true
    }
  },
  "gpu-fyi-chromeos-zork-exp": {
    "args_file": "//build/args/chromeos/zork.gni",
    "gn_args": {
      "dcheck_always_on": true,
      "ffmpeg_branding": "Chrome",
      "is_chromeos_device": true,
      "is_component_build": false,
      "is_debug": false,
      "ozone_platform_headless": true,
      "proprietary_codecs": true,
      "symbol_level": 0,
      "use_goma": true
    }
  }
}