[
  {
    "autotest_name": "audio_LoopbackLatency",
    "master_name": "ChromeOS_Audio"
  },
  {
    "autotest_name": "audio_PlaybackPower",
    "master_name": "ChromeOS_Audio"
  },
  {
    "autotest_name": "audio_WebRtcAudioLoopback",
    "master_name": "ChromeOSWebRtcAudio"
  },
  {
    "autotest_name": "audiovideo_AVSync",
    "master_name": "ChromeOS_Audio"
  },
  {
    "autotest_name": "autoupdate_EndToEndTest.paygen_au_beta_delta",
    "master_name": "ChromeOSPerf"
  },
  {
     "autotest_name": "autoupdate_EndToEndTest.paygen_au_beta_full",
     "master_name": "ChromeOSPerf"
  },
  {
     "autotest_name": "autoupdate_EndToEndTest.paygen_au_canary_delta",
     "master_name": "ChromeOSPerf"
  },
  {
     "autotest_name": "autoupdate_EndToEndTest.paygen_au_canary_full",
     "master_name": "ChromeOSPerf"
  },
  {
     "autotest_name": "autoupdate_EndToEndTest.paygen_au_dev_delta",
     "master_name": "ChromeOSPerf"
  },
  {
     "autotest_name": "autoupdate_EndToEndTest.paygen_au_dev_full",
     "master_name": "ChromeOSPerf"
  },
  {
     "autotest_name": "autoupdate_EndToEndTest.paygen_au_stable_delta",
     "master_name": "ChromeOSPerf"
  },
  {
     "autotest_name": "autoupdate_EndToEndTest.paygen_au_stable_full",
     "master_name": "ChromeOSPerf"
  },
  {
    "autotest_name": "bluetooth_Sanity_Discoverable",
    "master_name": "ChromeOSPerf"
  },
  {
    "autotest_name": "bluetooth_Sanity_Discovery",
    "master_name": "ChromeOSPerf"
  },
  {
    "autotest_name": "build_RootFilesystemSize",
    "master_name": "ChromeOSPerf"
  },
  {
    "autotest_name": "camera_HAL3Perf",
    "master_name": "ChromeOSVideo"
  },
  {
    "autotest_name": "cheets_StartAndroid.stress",
    "master_name": "ChromeOSPerf",
    "dashboard_test_name": "cheets_StartAndroid"
  },
  {
    "autotest_name": "cheets_CTS_.*CtsDeqpTestCases$",
    "master_name": "ChromeOS_Graphics",
    "dashboard_test_name": "cheets_CTS"
  },
  {
    "autotest_name": "cheets_CTS_.*CtsGraphicsTestCases$",
    "master_name": "ChromeOS_Graphics",
    "dashboard_test_name": "cheets_CTS"
  },
  {
    "autotest_name": "cheets_CTS_.*CtsGraphics2TestCases$",
    "master_name": "ChromeOS_Graphics",
    "dashboard_test_name": "cheets_CTS"
  },
  {
    "autotest_name": "cheets_CTS_.*CtsSkQPTestCases$",
    "master_name": "ChromeOS_Graphics",
    "dashboard_test_name": "cheets_CTS"
  },
  {
    "autotest_name": "cheets_CTS_.*CtsViewTestCases$",
    "master_name": "ChromeOS_Graphics",
    "dashboard_test_name": "cheets_CTS"
  },
  {
    "autotest_name": "enterprise_CFM_Perf.meet_app",
    "master_name": "ChromeOS_Enterprise"
  },
  {
    "autotest_name": "enterprise_CFM_USBPeripheralHotplugDetect.c920",
    "master_name": "ChromeOS_Enterprise"
  },
  {
    "autotest_name": "enterprise_CFM_USBPeripheralHotplugDetect.c930",
    "master_name": "ChromeOS_Enterprise"
  },
  {
    "autotest_name": "firmware_StandbyPowerConsumption.30min",
    "master_name": "ChromeOSPower"
  },
  {
    "autotest_name": "firmware_StandbyPowerConsumption.4hr",
    "master_name": "ChromeOSPower"
  },
  {
    "autotest_name": "graphics_Chrome",
    "master_name": "ChromeOS_Graphics"
  },
  {
    "autotest_name": "graphics_dEQP.bvt",
    "master_name": "ChromeOS_Graphics",
    "dashboard_test_name": "graphics_dEQP"
  },
  {
    "autotest_name": "graphics_dEQP.gles2-master",
    "master_name": "ChromeOS_Graphics",
    "dashboard_test_name": "graphics_dEQP"
  },
  {
    "autotest_name": "graphics_dEQP.gles3-master",
    "master_name": "ChromeOS_Graphics",
    "dashboard_test_name": "graphics_dEQP"
  },
  {
    "autotest_name": "graphics_dEQP.gles31-master",
    "master_name": "ChromeOS_Graphics",
    "dashboard_test_name": "graphics_dEQP"
  },
  {
    "autotest_name": "graphics_dEQP.gles32-master",
    "master_name": "ChromeOS_Graphics",
    "dashboard_test_name": "graphics_dEQP"
  },
  {
    "autotest_name": "graphics_dEQP.vk-master",
    "master_name": "ChromeOS_Graphics",
    "dashboard_test_name": "graphics_dEQP"
  },
  {
    "autotest_name": "graphics_Drm",
    "master_name": "ChromeOS_Graphics"
  },
  {
    "autotest_name": "graphics_Gbm",
    "master_name": "ChromeOS_Graphics"
  },
  {
    "autotest_name": "graphics_GLAPICheck",
    "master_name": "ChromeOS_Graphics"
  },
  {
    "autotest_name": "graphics_GLBench",
    "master_name": "ChromeOS_Graphics"
  },
  {
    "autotest_name": "graphics_GLMark2",
    "master_name": "ChromeOS_Graphics"
  },
  {
    "autotest_name": "graphics_Gralloc",
    "master_name": "ChromeOS_Graphics"
  },
  {
    "autotest_name": "graphics_GpuReset",
    "master_name": "ChromeOS_Graphics"
  },
  {
    "autotest_name": "graphics_KernelMemory",
    "master_name": "ChromeOS_Graphics"
  },
  {
    "autotest_name": "graphics_KernelConfig",
    "master_name": "ChromeOS_Graphics"
  },
  {
    "autotest_name": "graphics_Idle",
    "master_name": "ChromeOS_Graphics"
  },
  {
    "autotest_name": "graphics_LibDRM",
    "master_name": "ChromeOS_Graphics"
  },
  {
    "autotest_name": "graphics_SanAngeles",
    "master_name": "ChromeOS_Graphics"
  },
  {
    "autotest_name": "graphics_Sanity",
    "master_name": "ChromeOS_Graphics"
  },
  {
    "autotest_name": "graphics_Stress",
    "master_name": "ChromeOS_Graphics"
  },
  {
    "autotest_name": "graphics_PerfControl",
    "master_name": "ChromeOS_Graphics"
  },
  {
    "autotest_name": "graphics_VideoRenderingPower",
    "master_name": "ChromeOS_Graphics"
  },
  {
    "autotest_name": "graphics_WebGLAquarium",
    "master_name": "ChromeOS_Graphics"
  },
  {
    "autotest_name": "graphics_WebGLClear",
    "master_name": "ChromeOS_Graphics"
  },
  {
    "autotest_name": "graphics_WebGLManyPlanetsDeep",
    "master_name": "ChromeOS_Graphics"
  },
  {
    "autotest_name": "graphics_WebGLPerformance",
    "master_name": "ChromeOS_Graphics"
  },
  {
    "autotest_name": "graphics_VTSwitch",
    "master_name": "ChromeOS_Graphics"
  },
  {
    "autotest_name": "hardware_MemoryZRAMThroughput",
    "master_name": "ChromeOSPerf"
  },
  {
    "autotest_name": "hardware_RamFio",
    "master_name": "ChromeOSPerf"
  },
  {
    "autotest_name": "hardware_StorageFio",
    "master_name": "ChromeOSPerf"
  },
  {
    "autotest_name": "hardware_StorageFio.bvt",
    "master_name": "ChromeOSPerf"
  },
  {
    "autotest_name": "enterprise_LongevityTrackerServer.chromesign_20min",
    "master_name": "ChromeOS_Enterprise"
  },
  {
    "autotest_name": "enterprise_LongevityTrackerServer.chromesign_3hr",
    "master_name": "ChromeOS_Enterprise"
  },
  {
    "autotest_name": "enterprise_LongevityTrackerServer.riseplayer",
    "master_name": "ChromeOS_Enterprise"
  },
  {
    "autotest_name": "network_WiFi_AssocConfigPerformance",
    "master_name": "ChromeOSWiFi",
    "dashboard_test_name": "network_WiFi_AssocConfig"
  },
  {
    "autotest_name": "network_WiFi_AttenuatedPerf.ht40_ch001",
    "master_name": "ChromeOSWiFi",
    "dashboard_test_name": "network_WiFi_AttenuatedPerf"
  },
  {
    "autotest_name": "network_WiFi_AttenuatedPerf.ht40_ch006",
    "master_name": "ChromeOSWiFi",
    "dashboard_test_name": "network_WiFi_AttenuatedPerf"
  },
  {
    "autotest_name": "network_WiFi_AttenuatedPerf.ht40_ch011",
    "master_name": "ChromeOSWiFi",
    "dashboard_test_name": "network_WiFi_AttenuatedPerf"
  },
  {
    "autotest_name": "network_WiFi_AttenuatedPerf.ht40_ch044",
    "master_name": "ChromeOSWiFi",
    "dashboard_test_name": "network_WiFi_AttenuatedPerf"
  },
  {
    "autotest_name": "network_WiFi_AttenuatedPerf.ht40_ch153",
    "master_name": "ChromeOSWiFi",
    "dashboard_test_name": "network_WiFi_AttenuatedPerf"
  },
  {
    "autotest_name": "network_WiFi_BluetoothStreamPerf.11a",
    "master_name": "ChromeOSWiFi",
    "dashboard_test_name": "network_WiFi_BluetoothStreamPerf"
  },
  {
    "autotest_name": "network_WiFi_BluetoothStreamPerf.11b",
    "master_name": "ChromeOSWiFi",
    "dashboard_test_name": "network_WiFi_BluetoothStreamPerf"
  },
  {
    "autotest_name": "network_WiFi_Perf.11g",
    "master_name": "ChromeOSWiFi",
    "dashboard_test_name": "network_WiFi_Perf"
  },
  {
    "autotest_name": "network_WiFi_Perf.11g_aes",
    "master_name": "ChromeOSWiFi",
    "dashboard_test_name": "network_WiFi_Perf"
  },
  {
    "autotest_name": "network_WiFi_Perf.11g_tkip",
    "master_name": "ChromeOSWiFi",
    "dashboard_test_name": "network_WiFi_Perf"
  },
  {
    "autotest_name": "network_WiFi_Perf.11g_wep",
    "master_name": "ChromeOSWiFi",
    "dashboard_test_name": "network_WiFi_Perf"
  },
  {
    "autotest_name": "network_WiFi_Perf.ht20",
    "master_name": "ChromeOSWiFi",
    "dashboard_test_name": "network_WiFi_Perf"
  },
  {
    "autotest_name": "network_WiFi_Perf.ht20_aes",
    "master_name": "ChromeOSWiFi",
    "dashboard_test_name": "network_WiFi_Perf"
  },
  {
    "autotest_name": "network_WiFi_Perf.ht40",
    "master_name": "ChromeOSWiFi",
    "dashboard_test_name": "network_WiFi_Perf"
  },
  {
    "autotest_name": "network_WiFi_Perf.ht40_aes",
    "master_name": "ChromeOSWiFi",
    "dashboard_test_name": "network_WiFi_Perf"
  },
  {
    "autotest_name": "network_WiFi_Perf.vht80",
    "master_name": "ChromeOSWiFi",
    "dashboard_test_name": "network_WiFi_Perf"
  },
  {
    "autotest_name": "network_WiFi_PTK",
    "master_name": "ChromeOSWiFi"
  },
  {
    "autotest_name": "network_WiFi_SimpleConnect.wifi_check1x_PEAP",
    "master_name": "ChromeOSWiFi",
    "dashboard_test_name": "network_WiFi_SimpleConnect"
  },
  {
    "autotest_name": "network_WiFi_SimpleConnect.wifi_check1x_TTLS",
    "master_name": "ChromeOSWiFi",
    "dashboard_test_name": "network_WiFi_SimpleConnect"
  },
  {
    "autotest_name": "network_WiFi_SimpleConnect.wifi_check1x_WEP",
    "master_name": "ChromeOSWiFi",
    "dashboard_test_name": "network_WiFi_SimpleConnect"
  },
  {
    "autotest_name": "network_WiFi_SimpleConnect.wifi_check1x_WPA",
    "master_name": "ChromeOSWiFi",
    "dashboard_test_name": "network_WiFi_SimpleConnect"
  },
  {
    "autotest_name": "network_WiFi_SimpleConnect.wifi_check5HT20",
    "master_name": "ChromeOSWiFi",
    "dashboard_test_name": "network_WiFi_SimpleConnect"
  },
  {
    "autotest_name": "network_WiFi_SimpleConnect.wifi_check5HT40",
    "master_name": "ChromeOSWiFi",
    "dashboard_test_name": "network_WiFi_SimpleConnect"
  },
  {
    "autotest_name": "network_WiFi_SimpleConnect.wifi_check5VHT80_pure",
    "master_name": "ChromeOSWiFi",
    "dashboard_test_name": "network_WiFi_SimpleConnect"
  },
  {
    "autotest_name": "network_WiFi_SimpleConnect.wifi_check5VHT80_mixed",
    "master_name": "ChromeOSWiFi",
    "dashboard_test_name": "network_WiFi_SimpleConnect"
  },
  {
    "autotest_name": "network_WiFi_SimpleConnect.wifi_check11a",
    "master_name": "ChromeOSWiFi",
    "dashboard_test_name": "network_WiFi_SimpleConnect"
  },
  {
    "autotest_name": "network_WiFi_SimpleConnect.wifi_check11b",
    "master_name": "ChromeOSWiFi",
    "dashboard_test_name": "network_WiFi_SimpleConnect"
  },
  {
    "autotest_name": "network_WiFi_SimpleConnect.wifi_check11g",
    "master_name": "ChromeOSWiFi",
    "dashboard_test_name": "network_WiFi_SimpleConnect"
  },
  {
    "autotest_name": "network_WiFi_SimpleConnect.wifi_check24HT20",
    "master_name": "ChromeOSWiFi",
    "dashboard_test_name": "network_WiFi_SimpleConnect"
  },
  {
    "autotest_name": "network_WiFi_SimpleConnect.wifi_check24HT40",
    "master_name": "ChromeOSWiFi",
    "dashboard_test_name": "network_WiFi_SimpleConnect"
  },
  {
    "autotest_name": "network_WiFi_SimpleConnect.wifi_checkDFS",
    "master_name": "ChromeOSWiFi",
    "dashboard_test_name": "network_WiFi_SimpleConnect"
  },
  {
    "autotest_name": "network_WiFi_SimpleConnect.wifi_checkHidden",
    "master_name": "ChromeOSWiFi",
    "dashboard_test_name": "network_WiFi_SimpleConnect"
  },
  {
    "autotest_name": "network_WiFi_SimpleConnect.wifi_checkHiddenWEP",
    "master_name": "ChromeOSWiFi",
    "dashboard_test_name": "network_WiFi_SimpleConnect"
  },
  {
    "autotest_name": "network_WiFi_SimpleConnect.wifi_checkHiddenWPA",
    "master_name": "ChromeOSWiFi",
    "dashboard_test_name": "network_WiFi_SimpleConnect"
  },
  {
    "autotest_name": "network_WiFi_SimpleConnect.wifi_checkMixedWPA",
    "master_name": "ChromeOSWiFi",
    "dashboard_test_name": "network_WiFi_SimpleConnect"
  },
  {
    "autotest_name": "network_WiFi_SimpleConnect.wifi_checkWEP40",
    "master_name": "ChromeOSWiFi",
    "dashboard_test_name": "network_WiFi_SimpleConnect"
  },
  {
    "autotest_name": "network_WiFi_SimpleConnect.wifi_checkWEP104",
    "master_name": "ChromeOSWiFi",
    "dashboard_test_name": "network_WiFi_SimpleConnect"
  },
  {
    "autotest_name": "network_WiFi_SimpleConnect.wifi_checkWPA2",
    "master_name": "ChromeOSWiFi",
    "dashboard_test_name": "network_WiFi_SimpleConnect"
  },
  {
    "autotest_name": "network_WiFi_SimpleConnect.wifi_checkWPA2_PMF",
    "master_name": "ChromeOSWiFi",
    "dashboard_test_name": "network_WiFi_SimpleConnect"
  },
  {
    "autotest_name": "network_WiFi_SimpleConnect.wifi_checkWPA2_TKIP",
    "master_name": "ChromeOSWiFi",
    "dashboard_test_name": "network_WiFi_SimpleConnect"
  },
  {
    "autotest_name": "network_WiFi_SimpleConnect.wifi_checkWPA_CCMP",
    "master_name": "ChromeOSWiFi",
    "dashboard_test_name": "network_WiFi_SimpleConnect"
  },
  {
    "autotest_name": "network_WiFi_SimpleConnect.wifi_checkWPA_TKIP",
    "master_name": "ChromeOSWiFi",
    "dashboard_test_name": "network_WiFi_SimpleConnect"
  },
  {
    "autotest_name": "network_WiFi_SimpleConnect.wifi_checkWPA_multi",
    "master_name": "ChromeOSWiFi",
    "dashboard_test_name": "network_WiFi_SimpleConnect"
  },
  {
    "autotest_name": "network_WiFi_SuspendStress.5HT40",
    "master_name": "ChromeOSWiFi",
    "dashboard_test_name": "network_WiFi_SuspendStress"
  },
  {
    "autotest_name": "network_WiFi_SuspendStress.11a",
    "master_name": "ChromeOSWiFi",
    "dashboard_test_name": "network_WiFi_SuspendStress"
  },
  {
    "autotest_name": "network_WiFi_SuspendStress.11b",
    "master_name": "ChromeOSWiFi",
    "dashboard_test_name": "network_WiFi_SuspendStress"
  },
  {
    "autotest_name": "network_WiFi_SuspendStress.11g",
    "master_name": "ChromeOSWiFi",
    "dashboard_test_name": "network_WiFi_SuspendStress"
  },
  {
    "autotest_name": "network_WiFi_SuspendStress.24HT40",
    "master_name": "ChromeOSWiFi",
    "dashboard_test_name": "network_WiFi_SuspendStress"
  },
  {
    "autotest_name": "network_WiFi_SuspendStress.Hidden",
    "master_name": "ChromeOSWiFi",
    "dashboard_test_name": "network_WiFi_SuspendStress"
  },
  {
    "autotest_name": "network_WiFi_SuspendStress.WEP40",
    "master_name": "ChromeOSWiFi",
    "dashboard_test_name": "network_WiFi_SuspendStress"
  },
  {
    "autotest_name": "network_WiFi_SuspendStress.WPA2",
    "master_name": "ChromeOSWiFi",
    "dashboard_test_name": "network_WiFi_SuspendStress"
  },
  {
    "autotest_name": "performance_InboxInputLatency",
    "master_name": "ChromeOSPerf"
  },
  {
    "autotest_name": "platform_BootPerfServer",
    "master_name": "ChromeOSPerf"
  },
  {
    "autotest_name": "platform_GesturesRegressionTest",
    "master_name": "ChromeOSTouchpad"
  },
  {
    "autotest_name": "platform_CryptohomeFio.16k_write",
    "master_name": "ChromeOSPerf"
  },
  {
    "autotest_name": "platform_CryptohomeFio.dirty_setting",
    "master_name": "ChromeOSPerf"
  },
  {
    "autotest_name": "platform_CryptohomeFio.surfing",
    "master_name": "ChromeOSPerf"
  },
  {
    "autotest_name": "platform_InitLoginPerfServer",
    "master_name": "ChromeOSPerf"
  },
  {
    "autotest_name": "platform_LogoutPerf",
    "master_name": "ChromeOSPerf"
  },
  {
    "autotest_name": "platform_MemoryMonitor",
    "master_name": "ChromeOSPerf"
  },
  {
    "autotest_name": "platform_Pkcs11LoadPerf",
    "master_name": "ChromeOSPerf"
  },
  {
    "autotest_name": "power_Consumption",
    "master_name": "ChromeOSPower"
  },
  {
    "autotest_name": "power_Idle",
    "master_name": "ChromeOSPower"
  },
  {
    "autotest_name": "power_LoadTest.WIFI_1hr",
    "master_name": "ChromeOSPower"
  },
  {
    "autotest_name": "power_LoadTest.WIRED_1hr",
    "master_name": "ChromeOSPower"
  },
  {
    "autotest_name": "power_Resume",
    "master_name": "ChromeOSPower"
  },
  {
    "autotest_name": "power_UiResume",
    "master_name": "ChromeOSPower"
  },
  {
    "autotest_name": "tast.informational-chrome",
    "master_name": "ChromeOSTastInformationalChrome"
  },
  {
    "autotest_name": "telemetry_Benchmarks.blink_perf.image_decoder",
    "master_name": "ChromeOSPerf",
    "dashboard_test_name": "blink_perf.image_decoder"
  },
  {
    "autotest_name": "telemetry_Benchmarks.cros_tab_switching.typical_24",
    "master_name": "ChromeOSPerf",
    "dashboard_test_name": "cros_tab_switching.typical_24"
  },
  {
    "autotest_name": "telemetry_Benchmarks.cros_ui_smoothness",
    "master_name": "ChromeOSPerf",
    "dashboard_test_name": "cros_ui_smoothness"
  },
  {
    "autotest_name": "telemetry_Benchmarks.dromaeo",
    "master_name": "ChromeOSPerf",
    "dashboard_test_name": "dromaeo"
  },
  {
    "autotest_name": "telemetry_Benchmarks.jetstream",
    "master_name": "ChromeOSPerf",
    "dashboard_test_name": "jetstream"
  },
  {
    "autotest_name": "telemetry_Benchmarks.kraken",
    "master_name": "ChromeOSPerf",
    "dashboard_test_name": "kraken"
  },
  {
    "autotest_name": "telemetry_Benchmarks.loading.desktop",
    "master_name": "ChromeOSPerf",
    "dashboard_test_name": "loading.desktop"
  },
  {
    "autotest_name": "telemetry_Benchmarks.memory.desktop",
    "master_name": "ChromeOSPerf",
    "dashboard_test_name": "memory.desktop"
  },
  {
    "autotest_name": "telemetry_Benchmarks.octane",
    "master_name": "ChromeOSPerf",
    "dashboard_test_name": "octane"
  },
  {
    "autotest_name": "telemetry_Benchmarks.page_cycler_v2.typical_25",
    "master_name": "ChromeOSPerf",
    "dashboard_test_name": "page_cycler_v2.typical_25"
  },
  {
    "autotest_name": "telemetry_Benchmarks.rendering.desktop",
    "master_name": "ChromeOSPerf",
    "dashboard_test_name": "rendering.desktop"
  },
  {
    "autotest_name": "telemetry_Benchmarks.smoothness.tough_pinch_zoom_cases",
    "master_name": "ChromeOSPerf",
    "dashboard_test_name": "smoothness.tough_pinch_zoom_cases"
  },
  {
    "autotest_name": "telemetry_Benchmarks.speedometer",
    "master_name": "ChromeOSPerf",
    "dashboard_test_name": "speedometer"
  },
  {
    "autotest_name": "telemetry_Benchmarks.speedometer2",
    "master_name": "ChromeOSPerf",
    "dashboard_test_name": "speedometer2"
  },
  {
    "autotest_name": "telemetry_Benchmarks.tab_switching.typical_25",
    "master_name": "ChromeOSPerf",
    "dashboard_test_name": "tab_switching.typical_25"
  },
  {
    "autotest_name": "telemetry_Benchmarks.webrtc",
    "master_name": "ChromeOSPerf",
    "dashboard_test_name": "webrtc"
  },
  {
    "autotest_name": "video_HangoutHardwarePerf",
    "master_name": "ChromeOSVideo"
  },
  {
    "autotest_name": "video_JDAPerf.cpu",
    "master_name": "ChromeOSVideo"
  },
  {
    "autotest_name": "video_JDAPerf.power",
    "master_name": "ChromeOSVideo"
  },
  {
    "autotest_name": "video_MediaRecorderPerf",
    "master_name": "ChromeOSVideo"
  },
  {
    "autotest_name": "video_PlaybackPerf",
    "master_name": "ChromeOSVideo"
  },
  {
    "autotest_name": "video_VDAPerf",
    "master_name": "ChromeOSVideo"
  },
  {
    "autotest_name": "video_VDAPerf.cfm",
    "master_name": "ChromeOSVideo"
  },
  {
    "autotest_name": "video_VDAPerf.h264",
    "master_name": "ChromeOSVideo"
  },
  {
    "autotest_name": "video_VDAPerf.vp8",
    "master_name": "ChromeOSVideo"
  },
  {
    "autotest_name": "video_VDAPerf.vp9",
    "master_name": "ChromeOSVideo"
  },
  {
    "autotest_name": "video_VEAPerf.cfm",
    "master_name": "ChromeOSVideo"
  },
  {
    "autotest_name": "video_VEAPerf.h264",
    "master_name": "ChromeOSVideo"
  },
  {
    "autotest_name": "video_VEAPerf.vp8",
    "master_name": "ChromeOSVideo"
  },
  {
    "autotest_name": "video_VideoDecodeMemoryUsage.h264",
    "master_name": "ChromeOSVideo"
  },
  {
    "autotest_name": "video_VideoDecodeMemoryUsage.vp8",
    "master_name": "ChromeOSVideo"
  },
  {
    "autotest_name": "video_VideoDecodeMemoryUsage.vp9",
    "master_name": "ChromeOSVideo"
  },
  {
    "autotest_name": "video_YouTubeHTML5",
    "master_name": "ChromeOS_Graphics"
  },
  {
    "autotest_name": "video_WebRtcMainFeedSwitching.perf",
    "master_name": "ChromeOSWebRtcVideo"
  },
  {
    "autotest_name": "video_WebRtcPeerConnectionWithCamera.h264",
    "master_name": "ChromeOSWebRtcVideo"
  },
  {
    "autotest_name": "video_WebRtcPeerConnectionWithCamera.vp8",
    "master_name": "ChromeOSWebRtcVideo"
  },
  {
    "autotest_name": "video_WebRtcPerf",
    "master_name": "ChromeOSWebRtcVideo"
  },
  {
    "autotest_name": "video_WebRtcResolutionSwitching.perf",
    "master_name": "ChromeOSWebRtcVideo"
  },
  {
    "autotest_name": "video_WebRtcCamera",
    "master_name": "ChromeOSWebRtcVideo"
  },
  {
    "autotest_name": "webrtc_PausePlayPeerConnections.audio_perf",
    "master_name": "ChromeOSWebRtcVideo"
  },
  {
    "autotest_name": "webrtc_PausePlayPeerConnections.video_perf",
    "master_name": "ChromeOSWebRtcVideo"
  }
]
