{
  "version": 1,
  "title": "Top pages",
  "type": "DataTable",
  "data": {
    "type": "cube_analytics",
    "query": {
      "measures": [
        "TrackedEvents.pageViewsCount"
      ],
      "dimensions": [
        "TrackedEvents.docPath",
        "TrackedEvents.url"
      ],
      "limit": 100,
      "timezone": "UTC",
      "filters": [

      ],
      "timeDimensions": [

      ]
    }
  },
  "options": {
    "links": [
      {
        "text": "TrackedEvents.docPath",
        "href": "TrackedEvents.url"
      }
    ]
  }
}
