<svg width="268" height="224" viewBox="0 0 268 224" fill="none" xmlns="http://www.w3.org/2000/svg">
<g clip-path="url(#clip0)">
<path opacity="0.1" d="M85.6844 8.36795C93.9265 1.02698 106.868 -0.463699 118.645 0.114373C155.64 1.95296 189.034 19.8009 217.918 39.9906C228.375 47.2994 238.671 55.1757 245.459 65.2411C259.276 85.7332 255.179 114.118 235.964 130.997C229.427 136.74 221.504 141.145 213.366 145.047C198.907 151.987 183.293 157.556 166.876 159.143C155.166 160.272 143.312 159.354 131.674 157.775C99.1561 153.368 67.2349 143.621 40.4818 126.945C28.748 119.631 17.6863 110.539 12.8503 98.7076C8.01435 86.8759 11.1098 71.8809 23.0899 64.8771C28.0464 61.9814 33.9722 60.6727 39.7722 59.4443C48.3114 57.6351 56.9873 55.8528 64.6911 52.1783C72.6493 48.3807 82.0749 41.037 80.4896 32.6416C78.808 23.6199 77.4504 15.7009 85.6844 8.36795Z" fill="#7319D5"/>
<path opacity="0.1" d="M259.048 224.001C263.991 224.001 267.997 223.324 267.997 222.489C267.997 221.654 263.991 220.977 259.048 220.977C254.106 220.977 250.099 221.654 250.099 222.489C250.099 223.324 254.106 224.001 259.048 224.001Z" fill="#7319D5"/>
<path opacity="0.1" d="M105.352 210.892C127.346 210.892 145.176 207.737 145.176 203.845C145.176 199.954 127.346 196.799 105.352 196.799C83.3587 196.799 65.5293 199.954 65.5293 203.845C65.5293 207.737 83.3587 210.892 105.352 210.892Z" fill="#7319D5"/>
<path opacity="0.1" d="M212.293 206.906C223.471 206.906 232.534 204.911 232.534 202.45C232.534 199.989 223.471 197.994 212.293 197.994C201.114 197.994 192.052 199.989 192.052 202.45C192.052 204.911 201.114 206.906 212.293 206.906Z" fill="#7319D5"/>
<path d="M260.896 203.393C260.896 203.393 262.54 205.534 260.138 208.783C257.736 212.032 255.757 214.764 256.558 216.785C256.558 216.785 260.181 210.763 263.129 210.677C266.077 210.592 264.136 207.008 260.896 203.393Z" fill="#16C62E"/>
<path opacity="0.1" d="M260.896 203.393C261.04 203.6 261.153 203.827 261.233 204.067C264.109 207.447 265.644 210.6 262.878 210.677C260.302 210.752 257.209 215.358 256.47 216.52C256.493 216.611 256.523 216.7 256.558 216.787C256.558 216.787 260.181 210.766 263.129 210.68C266.077 210.594 264.136 207.008 260.896 203.393Z" fill="black"/>
<path d="M263.951 206.13C263.951 206.887 263.866 207.498 263.761 207.498C263.657 207.498 263.571 206.887 263.571 206.13C263.571 205.373 263.678 205.731 263.783 205.731C263.887 205.731 263.951 205.375 263.951 206.13Z" fill="#FFD037"/>
<path d="M265.001 207.032C264.337 207.394 263.756 207.613 263.708 207.522C263.659 207.431 264.155 207.062 264.819 206.701C265.483 206.339 265.22 206.602 265.271 206.701C265.322 206.8 265.665 206.671 265.001 207.032Z" fill="#FFD037"/>
<path d="M252.218 203.393C252.218 203.393 250.573 205.534 252.975 208.783C255.377 212.032 257.359 214.764 256.558 216.785C256.558 216.785 252.932 210.763 249.984 210.677C247.036 210.592 248.972 207.008 252.218 203.393Z" fill="#16C62E"/>
<path opacity="0.1" d="M252.217 203.393C252.074 203.6 251.961 203.827 251.883 204.067C249.004 207.447 247.47 210.6 250.236 210.677C252.815 210.752 255.905 215.358 256.644 216.52C256.62 216.611 256.59 216.699 256.558 216.787C256.558 216.787 252.932 210.766 249.984 210.68C247.036 210.594 248.972 207.008 252.217 203.393Z" fill="black"/>
<path d="M249.162 206.13C249.162 206.887 249.248 207.498 249.352 207.498C249.457 207.498 249.542 206.887 249.542 206.13C249.542 205.373 249.435 205.731 249.331 205.731C249.226 205.731 249.162 205.375 249.162 206.13Z" fill="#FFD037"/>
<path d="M248.115 207.032C248.779 207.394 249.358 207.613 249.409 207.522C249.459 207.431 248.959 207.062 248.295 206.701C247.631 206.339 247.893 206.602 247.845 206.701C247.797 206.8 247.451 206.671 248.115 207.032Z" fill="#FFD037"/>
<path d="M249.676 216.504C249.676 216.504 254.269 216.362 255.653 215.378C257.037 214.393 262.722 213.215 263.065 214.797C263.408 216.378 269.968 222.657 264.781 222.697C259.595 222.737 252.732 221.894 251.347 221.049C249.963 220.203 249.676 216.504 249.676 216.504Z" fill="#A8A8A8"/>
<path opacity="0.2" d="M264.886 222.148C259.699 222.188 252.836 221.345 251.452 220.499C250.399 219.857 249.979 217.555 249.845 216.498H249.692C249.692 216.498 249.982 220.202 251.363 221.048C252.745 221.893 259.611 222.739 264.797 222.696C266.294 222.696 266.811 222.161 266.784 221.358C266.57 221.84 266.01 222.137 264.886 222.148Z" fill="black"/>
<path opacity="0.1" d="M8.94895 212.76C13.8913 212.76 17.8979 212.083 17.8979 211.248C17.8979 210.413 13.8913 209.736 8.94895 209.736C4.00658 209.736 0 210.413 0 211.248C0 212.083 4.00658 212.76 8.94895 212.76Z" fill="#7319D5"/>
<path d="M2.9375 204.223C2.9375 204.223 8.04392 204.065 9.58093 202.97C11.1179 201.875 17.4347 200.561 17.8176 202.325C18.2005 204.089 25.4893 211.058 19.7268 211.106C13.9644 211.154 6.33821 210.207 4.79852 209.273C3.25883 208.339 2.9375 204.223 2.9375 204.223Z" fill="#A8A8A8"/>
<path opacity="0.2" d="M19.8286 210.488C14.0634 210.533 6.43996 209.591 4.90027 208.654C3.7301 207.942 3.26418 205.389 3.10887 204.209H2.9375C2.9375 204.209 3.2615 208.325 4.81191 209.259C6.36231 210.193 13.9751 211.132 19.7402 211.092C21.4031 211.092 21.9788 210.485 21.9467 209.61C21.7003 210.153 21.0657 210.488 19.8286 210.488Z" fill="black"/>
<path d="M41.8529 218.569C47.2374 218.569 51.6025 217.831 51.6025 216.92C51.6025 216.01 47.2374 215.271 41.8529 215.271C36.4683 215.271 32.1033 216.01 32.1033 216.92C32.1033 217.831 36.4683 218.569 41.8529 218.569Z" fill="#7319D5"/>
<path d="M45.8829 214.235C46.3283 213.872 46.6532 213.383 46.8147 212.832C46.9326 212.276 46.6969 211.607 46.164 211.403C45.5669 211.176 44.9296 211.591 44.4476 212.008C43.9656 212.426 43.4087 212.902 42.7767 212.811C43.1021 212.516 43.3457 212.142 43.4836 211.725C43.6216 211.308 43.6492 210.862 43.564 210.432C43.5363 210.254 43.4603 210.087 43.3444 209.95C43.0124 209.594 42.4126 209.747 42.0055 210.025C40.7443 210.913 40.3989 212.624 40.3855 214.165C40.2597 213.608 40.3668 213.03 40.3614 212.46C40.3561 211.89 40.2034 211.259 39.7214 210.951C39.4216 210.79 39.0844 210.71 38.7441 210.721C38.1791 210.702 37.5471 210.758 37.1589 211.173C36.6795 211.687 36.8027 212.551 37.2204 213.119C37.6382 213.686 38.2755 214.039 38.8619 214.43C39.3321 214.71 39.7331 215.092 40.0347 215.549C40.07 215.613 40.0995 215.68 40.1231 215.749H43.6764C44.4773 215.347 45.2196 214.837 45.8829 214.235Z" fill="#16C62E"/>
<path d="M110.451 125.66L108.801 125.17L108.879 126.369L112.571 127.779L111.902 125.793L110.451 125.66Z" fill="#7319D5"/>
<path opacity="0.03" d="M110.451 125.66L108.801 125.17L108.879 126.369L112.571 127.779L111.902 125.793L110.451 125.66Z" fill="black"/>
<path d="M162.974 179.242C177.034 165.015 184.904 145.815 184.875 125.819C184.875 125.605 184.875 125.391 184.875 125.174H108.876L162.974 179.242Z" fill="#7319D5"/>
<path opacity="0.03" d="M163.098 179.068C177.157 164.841 185.028 145.642 184.999 125.645C184.999 125.431 184.999 125.217 184.999 125H109L163.098 179.068Z" fill="black"/>
<path d="M162.974 180.439C177.034 166.212 184.904 147.013 184.875 127.016C184.875 126.799 184.875 126.585 184.875 126.371H108.876L162.974 180.439Z" fill="#9652DF"/>
<path opacity="0.15" d="M162.974 180.439C177.034 166.212 184.904 147.013 184.875 127.016C184.875 126.799 184.875 126.585 184.875 126.371H108.876L162.974 180.439Z" fill="white"/>
<path d="M232.105 113.607L230.932 103.028C230.932 103.028 228.809 93.5034 228.506 88.7424C228.204 83.9813 225.909 83.6334 225.89 83.6334C225.89 83.6334 223.06 81.9795 222.808 81.4282C222.612 81.0053 221.041 80.1061 220.328 79.71L219.98 79.5253C219.98 79.5253 219.097 75.8455 218.044 76.3727L217.959 76.1238C217.682 75.3321 217.516 74.5064 217.463 73.6697C217.463 73.5653 217.463 73.4636 217.463 73.3619C218.621 72.2357 219.453 70.8184 219.873 69.2592C220.016 68.7106 220.105 68.1496 220.141 67.5839C220.141 67.4795 220.141 67.3725 220.141 67.2654C220.658 66.9041 220.743 66.1387 220.88 65.4991C221.132 64.3269 221.79 63.2778 222.104 62.1216C222.131 62.0226 222.152 61.9209 222.171 61.8165C222.171 61.7951 222.171 61.7737 222.171 61.7496C222.209 61.5376 222.229 61.3228 222.232 61.1073C222.232 61.0913 222.232 61.0779 222.232 61.0618C222.232 60.1894 221.964 59.333 221.242 58.8673C221.075 58.7809 220.92 58.6729 220.781 58.5462C220.678 58.4194 220.598 58.2753 220.545 58.1206L220.01 56.8467C219.952 56.6796 219.861 56.5257 219.742 56.3944C219.53 56.2333 219.286 56.1176 219.027 56.0546C218.224 55.7468 217.688 55.0001 217.295 54.2561C216.901 53.5121 216.539 52.7092 215.926 52.1151C214.93 51.165 213.452 50.9643 212.081 50.8145C211.98 51.2428 211.947 51.6846 211.985 52.1231C209.808 51.6468 207.432 51.1891 205.427 52.1499C205.07 52.2972 204.783 52.5747 204.624 52.926C204.61 52.9673 204.6 53.0093 204.591 53.0518C204.586 53.1061 204.586 53.1608 204.591 53.2151C204.617 53.3319 204.629 53.4514 204.626 53.571C204.603 53.6531 204.561 53.7285 204.502 53.7909C204.444 53.8533 204.372 53.9008 204.292 53.9296C203.633 54.2213 202.838 53.844 202.149 54.0768C201.52 54.2909 201.172 54.9519 200.977 55.5835C200.781 56.2151 200.655 56.8922 200.229 57.398C200.015 57.6657 199.734 57.845 199.512 58.0939C199.311 58.3249 199.161 58.5964 199.074 58.89C198.987 59.1836 198.963 59.4926 199.006 59.796C199.004 59.812 199.004 59.8281 199.006 59.8441C199.006 59.9244 199.035 60.0047 199.057 60.085C199.085 60.1764 199.119 60.2658 199.158 60.3526C199.196 60.4302 199.236 60.5052 199.279 60.5801C199.579 61.0859 200.026 61.5248 200.138 62.0976C200.138 62.0976 200.138 62.1136 200.138 62.119C200.27 62.8549 199.801 63.5561 199.683 64.2894C199.683 64.3483 199.667 64.4045 199.664 64.4634C199.664 64.4634 199.664 64.4634 199.664 64.4794C199.664 64.5383 199.664 64.5998 199.664 64.6614C199.705 65.7319 200.687 66.4411 201.271 67.2279C201.426 67.4367 201.716 68.0442 202.026 68.2717C202.042 68.3868 202.061 68.4992 202.085 68.6089C202.248 69.4779 202.543 70.3171 202.958 71.0978C203.972 73.0023 205.63 74.4848 207.636 75.2808C207.636 75.3852 207.657 75.4922 207.668 75.5993C207.668 75.7973 207.695 76.0007 207.695 76.1987C207.695 76.2951 207.695 76.3914 207.695 76.4878L207.607 75.808C207.275 75.7388 206.933 75.7343 206.6 75.7946C192.274 62.2943 173.329 54.7743 153.64 54.7726V91.7291C151.428 91.0654 149.623 90.9904 149.757 92.5533C149.88 94.1591 151.631 95.7863 153.64 97.1324V132.215H192.263C192.303 133.109 192.384 133.912 192.531 134.108C192.946 134.611 192.909 140.638 192.909 140.638C192.909 140.638 193.112 141.743 193.163 141.941C193.214 142.139 193.819 147.256 193.819 147.505C193.819 147.754 194.376 149.512 194.325 150.213C194.274 150.914 195.235 153.219 195.235 153.219L195.385 157.431C195.385 157.431 196.952 159.789 197.054 159.939C197.155 160.089 197.105 163.046 198.821 164.451C199.092 164.709 199.285 165.038 199.378 165.401C199.506 165.91 203.818 173.146 205.151 175.378L204.99 176.136L203.919 181.143L203.868 183.249C203.868 183.249 203.21 185.053 203.413 185.805C203.536 186.194 203.571 186.605 203.515 187.009C203.515 187.009 202.808 188.109 203.263 188.813C203.718 189.517 203.464 189.916 202.808 191.719C202.519 192.522 202.768 192.996 203.137 193.29C203.137 193.379 203.116 193.472 203.105 193.558C203.012 194.361 202.907 195.279 202.907 195.522C202.907 195.766 202.813 196.86 202.808 197.824C202.808 198.587 202.856 199.272 203.06 199.384C203.515 199.633 206.043 199.919 206.091 200.787C206.139 201.654 207.103 202.89 209.122 202.89C211.141 202.89 214.63 202.189 215.487 202.288C215.629 202.307 215.712 202.213 215.755 202.047C215.763 202.019 215.769 201.99 215.774 201.961C216.078 202.306 216.496 202.529 216.952 202.59C219.983 203.144 223.67 201.787 224.38 200.436C224.468 200.266 224.536 200.086 224.583 199.901C224.921 198.563 224.38 196.879 224.38 196.879C224.218 196.2 224.196 195.495 224.316 194.808C224.377 194.498 224.52 194.211 224.731 193.975C225.215 193.467 225.684 192.07 226 190.946C226.243 190.071 226.399 189.359 226.399 189.359C226.399 189.359 226.08 188.872 225.595 188.203C224.623 186.841 222.982 184.724 221.956 184.362C221.906 184.263 221.87 184.156 221.849 184.047C221.801 183.546 220.738 181.906 220.738 181.906C220.738 181.906 219.273 179.548 219.273 179.35C219.273 179.152 217.254 176.09 217.254 176.09C217.254 176.09 216.478 174.407 215.966 173.494C216.025 173.333 216.084 173.13 216.146 172.889C216.681 170.78 217.217 165.966 217.102 165.313C216.949 164.51 216.834 163.659 217.605 162.505C218.376 161.352 218.315 159.5 218.315 159.5C218.315 159.5 218.264 153.832 218.818 152.681C219.372 151.53 220.939 142.305 220.891 142.102C220.843 141.898 221.292 140.638 221.292 140.638L221.386 137.001V136.778C221.386 136.778 221.74 133.621 222.189 132.917C222.284 132.7 222.331 132.465 222.329 132.229H230.664C230.664 131.726 230.646 131.225 230.632 130.725H230.664C230.637 127.216 230.369 123.714 229.861 120.242C230.643 119.295 231.588 118.636 231.618 118.433C231.751 117.816 231.936 117.212 232.172 116.626C232.509 115.612 232.105 113.607 232.105 113.607ZM215.281 192.057C215.281 192.057 215.495 191.928 215.843 191.749C215.865 191.834 215.886 191.925 215.907 192.016C216.132 192.985 216.403 194.329 216.341 194.96C216.237 196.012 216.074 197.669 216.074 197.669C215.79 198.267 215.575 198.895 215.434 199.542C215.273 198.881 215.115 198.359 215.115 198.359C215.115 198.359 211.677 196.058 211.677 194.901C211.653 194.322 211.575 193.745 211.441 193.181C211.412 193.036 211.379 192.897 211.347 192.76C211.497 192.942 211.624 193.141 211.728 193.352C211.728 193.352 212.753 190.866 212.999 189.873C213.044 189.751 213.059 189.621 213.042 189.493C212.967 189.156 212.946 188.809 212.981 188.465C213.222 188.733 213.406 189 213.345 189.193C213.206 189.651 215.281 192.057 215.281 192.057Z" fill="url(#paint0_linear)"/>
<path d="M215.559 202.552C214.713 202.453 211.275 203.149 209.278 203.149C207.28 203.149 206.332 201.907 206.287 201.056C206.241 200.205 203.745 199.913 203.296 199.664C203.097 199.552 203.046 198.861 203.049 198.112C203.049 197.157 203.146 196.075 203.146 195.824C203.146 195.572 203.247 194.668 203.341 193.873C203.421 193.185 203.496 192.588 203.496 192.588C205.839 189.749 211.176 191.839 211.176 191.839C211.176 191.839 211.404 192.628 211.588 193.512C211.72 194.073 211.798 194.646 211.821 195.222C211.821 196.37 215.214 198.661 215.214 198.661C215.444 199.438 215.631 200.227 215.776 201.024C215.913 201.867 215.937 202.597 215.559 202.552Z" fill="#53517C"/>
<path opacity="0.1" d="M215.559 202.551C214.713 202.454 211.275 203.15 209.28 203.15C207.285 203.15 206.335 201.906 206.289 201.057C206.244 200.209 203.745 199.912 203.296 199.663C203.097 199.553 203.046 198.86 203.049 198.113C204.002 198.402 205.331 198.876 205.791 199.366C206.538 200.169 206.736 201.057 207.237 201.159C207.738 201.261 208.233 201.962 210.624 201.357C212.119 200.982 214.325 200.98 215.776 201.03C215.913 201.868 215.937 202.596 215.559 202.551Z" fill="black"/>
<path d="M224.682 194.283C223.836 195.179 224.337 197.17 224.337 197.17C224.337 197.17 225.033 199.365 224.337 200.711C223.641 202.057 219.999 203.387 217.008 202.852C216.723 202.82 216.449 202.718 216.212 202.555C215.975 202.393 215.781 202.175 215.648 201.921C214.917 200.481 216.159 197.968 216.159 197.968C216.159 197.968 216.309 196.325 216.411 195.278C216.47 194.646 216.202 193.311 215.983 192.348C215.835 191.716 215.715 191.242 215.715 191.242C215.715 191.242 220.267 184.715 221.649 184.667C221.714 184.664 221.78 184.671 221.844 184.688C222.846 184.934 224.551 187.145 225.545 188.545C226.019 189.214 226.335 189.698 226.335 189.698C226.335 189.698 225.534 193.386 224.682 194.283Z" fill="#53517C"/>
<path opacity="0.1" d="M224.683 194.283C223.836 195.179 224.337 197.17 224.337 197.17C224.337 197.17 225.033 199.365 224.337 200.709C223.641 202.052 219.999 203.401 217.008 202.85C216.723 202.817 216.45 202.716 216.213 202.554C215.976 202.392 215.782 202.175 215.648 201.921C216.51 201.739 217.868 201.506 219.999 201.257C225.132 200.658 223.785 197.272 223.785 197.272C223.785 197.272 223.188 194.88 223.935 193.683C224.471 192.835 225.175 190.07 225.542 188.545C226.019 189.211 226.332 189.696 226.332 189.696C226.332 189.696 225.534 193.386 224.683 194.283Z" fill="black"/>
<path opacity="0.1" d="M211.588 193.512C210.873 192.535 208.758 190.653 204.492 194.33C204.075 194.281 203.678 194.123 203.341 193.873C203.421 193.185 203.496 192.588 203.496 192.588C205.839 189.749 211.176 191.839 211.176 191.839C211.176 191.839 211.404 192.628 211.588 193.512Z" fill="black"/>
<path d="M221.394 137.426V137.645L221.292 141.266C221.292 141.266 220.843 142.513 220.893 142.712C220.944 142.91 219.399 152.078 218.848 153.224C218.296 154.369 218.347 160.003 218.347 160.003C218.347 160.003 218.395 161.844 217.645 162.992C216.896 164.14 217.008 164.991 217.158 165.794C217.281 166.442 216.743 171.23 216.215 173.325C216.158 173.658 216.038 173.977 215.859 174.265C215.806 174.334 215.765 174.412 215.739 174.495C215.021 176.344 213.168 187.766 213.168 187.766C213.168 187.766 213.149 187.986 213.131 188.285C213.099 188.837 213.069 189.666 213.168 189.859C213.184 189.986 213.17 190.116 213.125 190.236C212.884 191.224 211.872 193.697 211.872 193.697C211.872 193.697 209.928 189.361 204.492 194.045C204.492 194.045 202.398 193.844 203.049 192.051C203.7 190.258 203.946 189.859 203.496 189.163C203.046 188.467 203.745 187.37 203.745 187.37C203.802 186.969 203.768 186.56 203.646 186.174C203.445 185.427 204.096 183.634 204.096 183.634L204.147 181.541L205.197 176.563L205.513 175.065L205.839 173.515L207.58 143.314L207.647 142.19L208.134 133.709L219.897 131.766L220.299 134.851L220.936 136.366L221.394 137.426Z" fill="#B3D7F7"/>
<path opacity="0.1" d="M215.827 136.965L208.622 141.708L208.889 145.859C208.889 145.859 209.636 152.536 209.636 153.232C209.636 153.927 209.286 159.609 209.286 159.609C209.286 159.609 211.082 162.285 210.892 162.949C210.702 163.613 212.435 165.438 212.435 165.438L215.402 171.112C215.402 171.112 215.902 172.964 216.205 173.312C216.148 173.645 216.027 173.964 215.849 174.251C215.252 174.848 213.158 187.753 213.158 187.753C213.158 187.753 213.139 187.972 213.12 188.272C212.967 188.135 212.852 188.052 212.852 188.052C212.852 188.052 211.406 185.66 211.406 185.414C211.406 185.167 209.861 183.171 209.861 183.171L206.337 176.445L205.513 175.051L205.839 173.502L208.134 133.695L219.897 131.752L220.299 134.838L209.588 137.565L215.827 136.965Z" fill="black"/>
<path opacity="0.1" d="M220.794 137.426L207.636 142.176L208.123 133.695L219.887 131.752L220.288 134.838L220.926 136.352C220.845 136.965 220.794 137.426 220.794 137.426Z" fill="black"/>
<path opacity="0.1" d="M213.168 189.847C213.184 189.974 213.17 190.103 213.125 190.224C212.941 189.916 212.828 189.665 212.858 189.549C213.008 189.1 211.661 188.053 211.661 188.053C211.661 188.053 210.217 185.661 210.217 185.415C210.217 185.168 208.67 183.172 208.67 183.172L205.189 176.551L205.505 175.052L205.831 173.503L207.58 143.314L207.684 145.865C207.684 145.865 208.439 152.529 208.439 153.217C208.439 153.904 208.091 159.594 208.091 159.594C208.091 159.594 209.885 162.27 209.698 162.934C209.51 163.598 211.243 165.423 211.243 165.423L214.234 171.105C214.234 171.105 214.769 173.149 215.083 173.347C215.354 173.693 215.581 174.072 215.758 174.474C215.04 176.323 213.187 187.746 213.187 187.746C213.187 187.746 213.168 187.965 213.149 188.265C213.099 188.824 213.069 189.654 213.168 189.847Z" fill="black"/>
<path opacity="0.1" d="M223.239 187.105C223.239 187.105 220.995 191.141 219.3 191.242C218.157 191.309 216.765 191.941 215.983 192.348C215.835 191.716 215.715 191.242 215.715 191.242C215.715 191.242 220.267 184.715 221.649 184.667C221.715 184.664 221.781 184.671 221.844 184.688C221.844 184.688 221.844 184.707 221.844 184.712C221.892 185.213 223.239 187.105 223.239 187.105Z" fill="black"/>
<path d="M223.239 186.805C223.239 186.805 220.995 190.841 219.3 190.943C217.605 191.044 215.364 192.388 215.364 192.388C215.364 192.388 213.318 189.995 213.466 189.548C213.613 189.102 212.271 188.052 212.271 188.052C212.271 188.052 210.825 185.66 210.825 185.414C210.825 185.167 209.278 183.171 209.278 183.171L205.74 176.445C205.74 176.445 199.809 166.476 199.659 165.88C199.568 165.519 199.377 165.192 199.108 164.935C197.415 163.538 197.463 160.599 197.364 160.45L195.72 157.958L195.57 153.772C195.57 153.772 194.622 151.481 194.673 150.783C194.724 150.084 194.173 148.342 194.173 148.091C194.173 147.839 193.575 142.762 193.527 142.561C193.479 142.361 193.276 141.266 193.276 141.266C193.276 141.266 193.326 135.287 192.93 134.787C192.711 134.519 192.641 133.109 192.625 131.883C192.609 130.858 192.625 129.956 192.625 129.956L221.986 126.916C221.986 126.916 222.168 128.589 222.273 130.264C222.366 131.76 222.398 133.264 222.187 133.593C221.737 134.292 221.384 137.431 221.384 137.431L208.123 142.213L208.271 145.851C208.271 145.851 209.021 152.528 209.021 153.224C209.021 153.919 208.67 159.601 208.67 159.601C208.67 159.601 210.464 162.277 210.276 162.941C210.089 163.605 211.819 165.43 211.819 165.43L214.81 171.112C214.81 171.112 215.361 173.156 215.659 173.354C215.956 173.552 217.308 176.499 217.308 176.499C217.308 176.499 219.3 179.542 219.3 179.74C219.3 179.938 220.746 182.282 220.746 182.282C220.746 182.282 221.793 183.926 221.841 184.423C221.89 184.921 223.239 186.805 223.239 186.805Z" fill="#B3D7F7"/>
<path opacity="0.1" d="M205.293 161.693C205.293 161.693 207.735 164.485 208.98 164.536C210.225 164.586 205.293 161.693 205.293 161.693Z" fill="black"/>
<path opacity="0.1" d="M214.614 189.099C214.614 189.099 221.991 185.312 221.041 187.057C220.09 188.802 217.402 189.733 217.402 189.733L214.614 189.099Z" fill="black"/>
<path opacity="0.1" d="M204.993 188.254C204.993 188.254 209.529 188.551 210.126 189.3C210.126 189.3 205.293 188.302 204.993 188.254Z" fill="black"/>
<path opacity="0.1" d="M205.041 189.797C205.041 189.797 209.181 189.947 210.525 190.544C210.525 190.544 206.139 190.394 205.041 189.797Z" fill="black"/>
<path d="M164.257 102.902L162.945 102.302L160.867 101.355C160.867 101.355 150.997 97.4182 150.692 93.4841C150.386 89.55 162.206 96.0747 162.206 96.0747C162.531 96.594 162.897 97.0863 163.301 97.5466C163.679 97.9695 164.104 98.3281 164.45 98.3656C165.36 98.4646 164.257 102.902 164.257 102.902Z" fill="#C37871"/>
<path d="M219.15 81.5749L215.91 85.3216L208.035 82.7337L206.091 81.1868L207.334 79.5436C207.759 78.9816 207.888 78.1252 207.869 77.242C207.869 77.044 207.869 76.8406 207.842 76.6425C207.752 75.6508 207.566 74.6702 207.285 73.7147C207.285 73.7147 218.5 70.8725 217.702 73.2142C217.547 73.7008 217.484 74.2115 217.514 74.721C217.565 75.5531 217.73 76.3743 218.004 77.1617C218.232 77.8596 218.514 78.5387 218.848 79.193L219.15 81.5749Z" fill="#C37871"/>
<path opacity="0.1" d="M217.704 73.1951C217.55 73.6816 217.486 74.1923 217.517 74.7018C216.269 75.9311 214.687 76.7681 212.969 77.1095C211.25 77.451 209.469 77.282 207.845 76.6234C207.755 75.6316 207.569 74.651 207.288 73.6955C207.288 73.6955 218.502 70.8614 217.704 73.1951Z" fill="black"/>
<path d="M220.197 68.0218C220.197 68.2359 220.197 68.45 220.173 68.6614C220.035 70.6082 219.264 72.4566 217.979 73.9262C216.694 75.3957 214.965 76.4062 213.053 76.8043C211.141 77.2024 209.152 76.9662 207.386 76.1318C205.621 75.2974 204.176 73.9101 203.271 72.1807C202.863 71.4038 202.573 70.5703 202.412 69.7078C202.302 69.1526 202.247 68.5878 202.249 68.0218C202.249 67.5294 202.29 67.038 202.372 66.5525C202.736 64.3582 203.903 62.3774 205.646 60.9949C207.389 59.6124 209.585 58.927 211.805 59.0718C214.026 59.2166 216.114 60.1812 217.663 61.7783C219.212 63.3755 220.111 65.491 220.187 67.714C220.195 67.8157 220.197 67.9201 220.197 68.0218Z" fill="#C37871"/>
<path opacity="0.1" d="M219.15 81.5745L215.91 85.3213L208.035 82.7334L206.091 81.1865L207.334 79.5433C207.759 78.9812 207.888 78.1248 207.869 77.2417L208.228 79.9902L208.314 80.0758L208.828 80.5897H209.476L210.724 82.2837C210.724 82.2837 212.518 80.8412 212.668 81.1865C212.818 81.5317 215.26 80.5897 215.26 80.5897H215.353C217.565 80.496 217.951 77.2042 217.951 77.2042C217.951 77.2042 217.986 77.1748 218.004 77.1641C218.232 77.862 218.514 78.5411 218.848 79.1953L219.15 81.5745Z" fill="black"/>
<path opacity="0.1" d="M222.278 130.264C222.222 130.481 222.16 130.692 222.093 130.904C220.149 137.08 206.139 137.23 206.139 137.23L205.74 133.395L204.401 135.986C204.401 135.986 195.731 133.593 192.633 131.883C192.617 130.858 192.633 129.956 192.633 129.956L221.994 126.916C221.994 126.916 222.173 128.594 222.278 130.264Z" fill="black"/>
<path opacity="0.1" d="M164.257 102.902L162.945 102.303C163.247 100.879 163.301 98.0527 163.309 97.5469C163.687 97.9697 164.112 98.3283 164.458 98.3658C165.36 98.4648 164.257 102.902 164.257 102.902Z" fill="black"/>
<path d="M221.841 116.254C221.841 116.254 224.037 124.128 222.093 130.307C220.149 136.487 206.139 136.623 206.139 136.623L205.74 132.788L204.401 135.382C204.401 135.382 193.934 132.489 191.891 130.795C189.848 129.1 190.892 126.561 190.892 126.561C190.892 126.561 191.591 123.274 192.188 122.573C192.785 121.872 192.887 119.434 192.686 119.094C192.486 118.754 193.385 115.454 193.685 114.956C193.985 114.459 193.634 101.155 193.634 101.155C193.634 101.155 189.197 103.146 188.948 103.746C188.699 104.345 183.464 107.225 183.464 107.225C183.464 107.225 178.529 107.824 177.632 107.824C176.735 107.824 171.797 107.225 171.797 107.225C171.797 107.225 170.459 107.174 170.054 106.877C169.649 106.635 169.212 106.451 168.756 106.328C168.756 106.328 167.363 106.028 166.961 105.482C166.56 104.937 163.213 103.09 163.213 103.09C163.861 102.691 163.912 97.4698 163.912 97.4698L170.242 99.014C170.242 99.014 170.643 98.1683 171.24 98.5162C171.838 98.8641 175.479 99.1558 175.479 99.1558C175.479 99.1558 178.521 98.559 178.671 98.8052C178.821 99.0514 179.268 99.006 179.268 99.006C179.268 99.006 179.868 98.9551 179.868 98.7597C179.868 98.5644 180.404 98.8052 180.404 98.8052L181.402 98.9551C181.402 98.9551 181.252 97.6625 181.702 97.5634C181.83 97.532 181.946 97.463 182.034 97.3652C182.123 97.2673 182.18 97.1453 182.198 97.0148C182.198 97.0148 183.537 95.2217 184.193 95.2217C184.849 95.2217 185.29 93.4286 185.29 93.4286L187.684 90.9879C187.684 90.9879 187.384 89.7407 187.684 89.6899C187.984 89.6391 188.03 89.0931 188.03 89.0931C188.03 89.0931 188.132 87.9985 188.68 87.755C189.229 87.5114 189.527 86.0636 189.527 86.0636C189.527 86.0636 192.068 83.2241 192.269 82.2258C192.469 81.2276 193.516 81.0295 193.516 81.0295C194.082 80.6629 194.705 80.3917 195.359 80.2266C196.208 80.0768 198.451 79.8252 198.451 79.8252C198.451 79.8252 202.538 79.48 202.939 79.0223C203.341 78.5647 204.035 78.6209 204.482 78.6209C204.579 78.614 204.671 78.5796 204.749 78.5219C205.154 78.2703 205.636 77.5691 206.118 77.1275C206.715 76.5789 207.762 76.8278 207.762 76.8278L208.212 80.2668L208.295 80.3498L208.809 80.8636H209.457L210.705 82.5603C210.705 82.5603 212.499 81.1152 212.649 81.4631C212.799 81.811 215.241 80.8636 215.241 80.8636H215.335C217.546 80.7699 217.932 77.4808 217.932 77.4808C219.03 76.5307 219.978 80.521 219.978 80.521L220.323 80.7057C221.025 81.0964 222.578 81.9903 222.768 82.4132C223.017 82.9484 225.81 84.6023 225.81 84.6023L221.841 116.254Z" fill="#53517C"/>
<path d="M223.14 128.211L221.667 129.397L219.999 130.735C219.999 130.735 216.906 137.961 212.67 135.919C208.434 133.877 218.347 126.319 218.347 126.319L219.718 125.655L221.236 124.922L223.14 128.211Z" fill="#C37871"/>
<path opacity="0.1" d="M208.016 80.9569C206.477 81.5965 204.535 83.1166 204.535 83.1166L204.463 79.1316C204.867 78.8774 205.349 78.1789 205.831 77.7346C206.428 77.1994 207.475 77.4376 207.475 77.4376L207.925 80.8739L208.016 80.9569Z" fill="black"/>
<path d="M208.316 80.3637C206.776 81.0034 204.835 82.5235 204.835 82.5235L204.771 78.5492C205.175 78.2977 205.657 77.5965 206.139 77.1549C206.736 76.6063 207.783 76.8552 207.783 76.8552L208.233 80.2941L208.316 80.3637Z" fill="#E6EAED"/>
<path opacity="0.1" d="M220.345 81.6126C219.579 83.6627 218.625 85.9321 218.454 85.0623C218.248 84.032 216.451 82.5761 215.356 81.7705C217.568 81.6795 217.953 78.3877 217.953 78.3877C219.051 77.4403 219.999 81.428 219.999 81.428L220.345 81.6126Z" fill="black"/>
<path d="M220.345 80.7149C219.579 82.7649 218.625 85.0344 218.454 84.1646C218.248 83.1342 216.451 81.6783 215.356 80.8728C217.568 80.7791 217.953 77.49 217.953 77.49C219.051 76.5399 219.999 80.5302 219.999 80.5302L220.345 80.7149Z" fill="#E6EAED"/>
<path opacity="0.1" d="M210.177 159.403C210.177 159.403 215.859 158.6 215.61 159.802C215.361 161.004 210.177 159.403 210.177 159.403Z" fill="black"/>
<path opacity="0.1" d="M201.003 139.834C201.003 139.834 203.247 138.638 205.242 139.138L201.003 139.834Z" fill="black"/>
<path opacity="0.1" d="M197.364 136.583C197.364 136.583 200.955 136.034 202.299 136.634L197.364 136.583Z" fill="black"/>
<path opacity="0.1" d="M213.069 144.805C213.069 144.805 209.928 148.142 210.124 149.039L213.069 144.805Z" fill="black"/>
<path opacity="0.1" d="M182.409 100.012C182.409 100.012 181.911 101.805 184.953 102.551L182.409 100.012Z" fill="black"/>
<path opacity="0.1" d="M181.512 103.1C181.512 103.1 185.261 106.437 183.507 106.539C181.753 106.64 181.512 103.1 181.512 103.1Z" fill="black"/>
<path opacity="0.1" d="M189.837 89.6973C189.837 89.6973 194.424 92.8847 194.122 93.634C193.819 94.3834 189.837 89.6973 189.837 89.6973Z" fill="black"/>
<path opacity="0.1" d="M223.14 128.212L221.667 129.398C221.359 128.344 220.722 126.577 219.726 125.651L221.244 124.918L223.14 128.212Z" fill="black"/>
<path d="M223.836 85.8597L225.831 84.6152C225.831 84.6152 228.123 84.9631 228.423 89.7001C228.723 94.4371 230.817 103.9 230.817 103.9L231.963 114.41C231.963 114.41 232.362 116.404 232.014 117.399C231.784 117.981 231.605 118.581 231.478 119.192C231.428 119.543 228.686 121.237 228.737 123.429C228.787 125.621 225.255 127.663 225.255 127.663C225.255 127.663 222.961 129.001 222.214 129.956C222.214 129.956 221.365 125.969 219.522 124.973C217.68 123.978 223.411 116.056 223.411 116.056L223.836 85.8597Z" fill="#53517C"/>
<path opacity="0.1" d="M220.387 116.189C220.387 116.189 214.405 118.681 214.903 119.479C215.401 120.276 220.387 116.189 220.387 116.189Z" fill="black"/>
<path opacity="0.1" d="M220.387 119.377C220.387 119.377 217.9 120.477 218.106 120.828C218.312 121.178 220.387 119.377 220.387 119.377Z" fill="black"/>
<path opacity="0.1" d="M218.992 121.471C218.992 121.471 216.505 122.571 216.711 122.921C216.917 123.272 218.992 121.471 218.992 121.471Z" fill="black"/>
<path d="M154.531 57.4277V132.898H230.533C230.188 91.2155 196.312 57.5134 154.531 57.4277Z" fill="#7319D5"/>
<path opacity="0.1" d="M154.531 57.4277V132.898H230.533C230.188 91.2155 196.312 57.5134 154.531 57.4277Z" fill="black"/>
<path d="M154.531 55.9336V131.404H230.533C230.188 89.7187 196.312 56.0166 154.531 55.9336Z" fill="#7319D5"/>
<path d="M213.083 133.516C213.076 133.104 213.2 132.699 213.436 132.36C213.673 132.13 213.967 131.965 214.288 131.884C214.571 131.79 214.858 131.702 215.144 131.616C215.367 131.542 215.6 131.504 215.835 131.504C216.312 131.523 216.724 131.817 217.107 132.098C217.183 132.145 217.245 132.211 217.289 132.288C217.375 132.486 217.19 132.692 217.021 132.823C216.432 133.348 215.794 133.816 215.118 134.223C214.641 134.491 214.009 134.793 213.449 134.798C212.761 134.817 213.037 134.014 213.083 133.516Z" fill="#C37871"/>
<path opacity="0.1" d="M220.197 68.0232C220.197 68.2373 220.197 68.4514 220.173 68.6628C220.135 68.6882 220.096 68.7114 220.055 68.7324C219.904 68.7872 219.756 68.8524 219.614 68.9278C219.177 69.2249 219.276 69.8725 219.316 70.3971C219.379 71.1562 219.221 71.9173 218.861 72.5889C218.69 72.5712 218.529 72.4977 218.404 72.3797C218.279 72.2617 218.196 72.1057 218.168 71.9359C218.12 71.5965 218.106 71.2531 218.125 70.9109C218.082 69.9956 217.589 69.1794 217.268 68.3176C216.673 66.6663 216.805 64.8385 216.408 63.1337C216.293 62.6306 216.106 62.0953 215.677 61.7956C215.11 61.4048 214.322 61.5761 213.712 61.8946C213.101 62.2131 212.555 62.6787 211.894 62.8794C210.874 63.1872 209.789 62.8152 208.774 62.4994C207.759 62.1836 206.611 61.916 205.663 62.4004C204.667 62.9116 204.219 64.0757 203.914 65.1569C203.814 65.4533 203.766 65.7648 203.772 66.0776C203.791 66.3452 203.895 66.6262 203.887 66.9072C203.887 67.5067 203.376 67.9777 203.178 68.5451C203.055 68.8957 203.084 69.7601 202.575 69.7548C202.517 69.7527 202.461 69.7352 202.412 69.7039C202.302 69.1487 202.247 68.5839 202.249 68.0179C202.249 67.5255 202.29 67.0341 202.372 66.5486C202.736 64.3543 203.903 62.3735 205.646 60.991C207.389 59.6085 209.585 58.9231 211.805 59.0679C214.026 59.2126 216.114 60.1773 217.663 61.7744C219.212 63.3716 220.111 65.4871 220.187 67.7101C220.195 67.8171 220.197 67.9215 220.197 68.0232Z" fill="black"/>
<path d="M200.018 65.782C199.986 64.9176 200.642 64.1093 200.492 63.2583C200.374 62.5919 199.796 62.1075 199.515 61.492C199.353 61.1221 199.299 60.7141 199.359 60.3149C199.419 59.9157 199.591 59.5416 199.855 59.2359C200.074 58.9897 200.35 58.797 200.562 58.5454C200.982 58.0423 201.097 57.3652 201.298 56.7389C201.499 56.1127 201.833 55.457 202.457 55.2429C203.129 55.0127 203.917 55.3874 204.565 55.0957C204.644 55.0667 204.714 55.0197 204.772 54.9583C204.829 54.8969 204.871 54.823 204.894 54.7424C204.9 54.6227 204.888 54.5029 204.859 54.3865C204.814 53.9101 205.266 53.5381 205.7 53.3294C207.682 52.374 210.022 52.8289 212.169 53.3026C212.134 52.8668 212.165 52.4281 212.263 52.002C213.618 52.1518 215.077 52.3499 216.058 53.2919C216.665 53.878 217.005 54.6755 217.396 55.4142C217.787 56.1528 218.323 56.8942 219.107 57.2019C219.364 57.2641 219.605 57.3789 219.814 57.5391C219.932 57.6699 220.023 57.8227 220.082 57.9887L220.596 59.2546C220.65 59.409 220.729 59.553 220.832 59.6801C220.969 59.8051 221.121 59.9121 221.284 59.9986C222.281 60.6489 222.428 62.0807 222.117 63.2315C221.807 64.3823 221.159 65.4234 220.912 66.5902C220.768 67.278 220.685 68.1184 220.055 68.4315C219.904 68.4876 219.756 68.5538 219.614 68.6295C219.177 68.9239 219.273 69.5716 219.316 70.0961C219.379 70.855 219.222 71.6159 218.864 72.288C218.692 72.2707 218.531 72.1973 218.406 72.0792C218.281 71.9612 218.198 71.805 218.17 71.635C218.121 71.2956 218.106 70.9523 218.125 70.61C218.082 69.6947 217.589 68.8784 217.268 68.0167C216.673 66.3654 216.805 64.5375 216.411 62.8328C216.293 62.3269 216.103 61.7944 215.675 61.4946C215.107 61.1012 214.32 61.2698 213.709 61.5937C213.099 61.9175 212.555 62.3751 211.894 62.5758C210.873 62.8809 209.789 62.5143 208.771 62.1931C207.754 61.872 206.611 61.6124 205.663 62.0968C204.667 62.608 204.222 63.7748 203.917 64.8533C203.815 65.1494 203.765 65.4609 203.769 65.774C203.791 66.0416 203.893 66.3253 203.887 66.6036C203.887 67.2058 203.376 67.6741 203.178 68.2442C203.055 68.5947 203.084 69.4565 202.575 69.4538C202.19 69.4538 201.799 68.5814 201.609 68.3271C201.027 67.5537 200.058 66.8391 200.018 65.782Z" fill="#4B3E3C"/>
<g opacity="0.1">
<path opacity="0.1" d="M200.492 62.6587C200.374 61.9923 199.796 61.5106 199.515 60.8951C199.436 60.7198 199.382 60.5342 199.357 60.3438C199.3 60.7337 199.354 61.1318 199.515 61.4919C199.782 62.102 200.358 62.5811 200.487 63.2341C200.521 63.0439 200.522 62.8495 200.492 62.6587Z" fill="black"/>
<path opacity="0.1" d="M204.894 54.1444C204.895 54.1301 204.895 54.1158 204.894 54.1016C204.879 54.1423 204.869 54.1845 204.862 54.2274C204.877 54.2014 204.887 54.1735 204.894 54.1444Z" fill="black"/>
<path opacity="0.1" d="M212.169 52.7066C212.168 52.686 212.168 52.6652 212.169 52.6445C212.169 52.6634 212.169 52.685 212.169 52.7039V52.7066Z" fill="black"/>
<path opacity="0.1" d="M222.117 62.6318C221.809 63.7826 221.159 64.8263 220.912 65.9905C220.768 66.681 220.685 67.5186 220.055 67.8344C219.904 67.8908 219.757 67.956 219.614 68.0298C219.252 68.276 219.257 68.7631 219.295 69.2234C219.3 69.1069 219.332 68.9931 219.387 68.8902C219.442 68.7874 219.519 68.6983 219.614 68.6293C219.756 68.5535 219.904 68.4874 220.055 68.4312C220.685 68.1181 220.768 67.2778 220.912 66.59C221.159 65.4231 221.809 64.3821 222.117 63.2313C222.241 62.7812 222.286 62.3131 222.251 61.8477C222.231 62.1127 222.187 62.3752 222.117 62.6318Z" fill="black"/>
<path opacity="0.1" d="M218.864 71.6918C218.692 71.6745 218.531 71.6011 218.406 71.4831C218.281 71.365 218.198 71.2088 218.17 71.0388C218.122 70.6985 218.106 70.3543 218.125 70.0111C218.082 69.0985 217.589 68.2796 217.268 67.4205C216.673 65.7692 216.805 63.9413 216.411 62.2366C216.293 61.7308 216.103 61.1982 215.675 60.8984C215.107 60.5077 214.32 60.6763 213.709 60.9975C213.099 61.3186 212.555 61.7816 211.894 61.9796C210.873 62.2874 209.789 61.9181 208.771 61.5996C207.754 61.2811 206.61 61.0162 205.663 61.5033C204.666 62.0144 204.222 63.1813 203.917 64.2571C203.815 64.5542 203.765 64.8665 203.769 65.1804C203.769 65.242 203.785 65.3062 203.796 65.3678C203.825 65.195 203.866 65.0242 203.917 64.8566C204.222 63.7861 204.666 62.6112 205.663 62.1001C206.61 61.6157 207.757 61.8779 208.771 62.1964C209.786 62.5149 210.873 62.8842 211.894 62.5791C212.555 62.3784 213.099 61.9181 213.709 61.5969C214.32 61.2758 215.107 61.1045 215.675 61.4979C216.103 61.7896 216.293 62.3222 216.411 62.8361C216.805 64.5462 216.679 66.3687 217.268 68.02C217.576 68.8817 218.071 69.698 218.125 70.6133C218.106 70.9556 218.121 71.2989 218.17 71.6383C218.198 71.8083 218.281 71.9644 218.406 72.0825C218.531 72.2006 218.692 72.274 218.864 72.2913C219.219 71.6247 219.376 70.871 219.319 70.1181C219.277 70.6684 219.122 71.2041 218.864 71.6918Z" fill="black"/>
<path opacity="0.1" d="M203.178 67.6521C203.055 68.0027 203.084 68.8645 202.575 68.8618C202.19 68.8618 201.799 67.992 201.609 67.7378C201.073 67.0125 200.2 66.3461 200.042 65.4121C200.022 65.5341 200.014 65.6578 200.018 65.7814C200.058 66.8385 201.027 67.5531 201.609 68.3346C201.799 68.6022 202.19 69.4586 202.575 69.4613C203.084 69.4613 203.055 68.6022 203.178 68.2516C203.376 67.6842 203.874 67.2132 203.887 66.6111C203.887 66.4959 203.874 66.3811 203.85 66.2685C203.735 66.7529 203.352 67.1677 203.178 67.6521Z" fill="black"/>
</g>
<path d="M27.61 119.521H26.7103V120.437H27.61V119.521Z" fill="#7319D5"/>
<path opacity="0.25" d="M27.61 119.521H26.7103V120.437H27.61V119.521Z" fill="#4A148C"/>
<path d="M103.823 44.1426H102.945V45.1622H103.823V44.1426Z" fill="#7319D5"/>
<path opacity="0.25" d="M103.823 44.1426H102.945V45.1622H103.823V44.1426Z" fill="black"/>
<path opacity="0.2" d="M103.831 120.439V44.9688H103.673C61.8179 44.9688 27.8536 78.711 27.5135 120.463L103.831 120.439Z" fill="white"/>
<path d="M103.831 120.439V44.9688H103.673C61.8179 44.9688 27.8536 78.711 27.5135 120.463L103.831 120.439Z" fill="#7319D5"/>
<path opacity="0.25" d="M103.831 120.439V44.9688H103.673C61.8179 44.9688 27.8536 78.711 27.5135 120.463L103.831 120.439Z" fill="#4A148C"/>
<path d="M103.028 119.636V44.166H102.87C61.0146 44.166 27.0504 77.9083 26.7103 119.661L103.028 119.636Z" fill="#7319D5"/>
<path d="M159.204 181.281L160.326 181.985V183.323L158.802 183.088L159.204 181.281Z" fill="#7319D5"/>
<path opacity="0.1" d="M159.204 181.281L160.326 181.985V183.323L158.802 183.088L159.204 181.281Z" fill="#4A148C"/>
<path d="M52.1942 181.816L51.7738 181.942V183.28L53.1983 182.969L52.8476 181.666L52.1942 181.816Z" fill="#7319D5"/>
<path opacity="0.1" d="M52.1942 181.816L51.7738 181.942V183.28L53.1983 182.969L52.8476 181.666L52.1942 181.816Z" fill="black"/>
<path d="M107.026 130.055L51.7738 183.28C58.8572 190.479 67.3031 196.198 76.6196 200.103C85.9362 204.008 95.937 206.021 106.04 206.025C116.142 206.029 126.145 204.024 135.464 200.126C144.784 196.229 153.234 190.517 160.323 183.323L107.026 130.055Z" fill="#7319D5"/>
<path d="M107.026 128.717L51.7738 181.942C58.8572 189.142 67.3031 194.86 76.6196 198.765C85.9362 202.67 95.937 204.683 106.04 204.687C116.142 204.691 126.145 202.686 135.464 198.789C144.784 194.891 153.234 189.179 160.323 181.985L107.026 128.717Z" fill="#7319D5"/>
<path opacity="0.1" d="M107.026 128.717L51.7738 181.942C58.8572 189.142 67.3031 194.86 76.6196 198.765C85.9362 202.67 95.937 204.683 106.04 204.687C116.142 204.691 126.145 202.686 135.464 198.789C144.784 194.891 153.234 189.179 160.323 181.985L107.026 128.717Z" fill="#333333"/>
<path d="M107.026 130.055L51.7738 183.28C58.8572 190.479 67.3031 196.198 76.6196 200.103C85.9362 204.008 95.937 206.021 106.04 206.025C116.142 206.029 126.145 204.024 135.464 200.126C144.784 196.229 153.234 190.517 160.323 183.323L107.026 130.055Z" fill="#7319D5"/>
<path d="M102.554 127.139L104.394 125.881L104.662 126.416L102.562 127.95L102.554 127.139Z" fill="#3ACC6C"/>
<path opacity="0.1" d="M102.554 127.139L104.394 125.881L104.662 126.416L102.562 127.95L102.554 127.139Z" fill="black"/>
<path d="M101.247 125.258L103.189 124.543L103.456 125.078L100.144 126.194L101.247 125.258Z" fill="#16C62E"/>
<path opacity="0.1" d="M101.247 125.258L103.189 124.543L103.456 125.078L100.144 126.194L101.247 125.258Z" fill="black"/>
<path d="M101.004 122.915L103.055 122.803V123.338L99.6086 123.699L99.9166 123.006L101.004 122.915Z" fill="#AEEA00"/>
<path opacity="0.1" d="M101.004 122.915L103.055 122.803V123.338L99.6086 123.699L99.9166 123.006L101.004 122.915Z" fill="#16C62E"/>
<path d="M103.055 122.803L28.7883 139.706C27.6268 134.365 27.0423 128.914 27.0451 123.448C27.0451 123.231 27.0451 123.017 27.0451 122.803H103.055Z" fill="#AEEA00"/>
<path opacity="0.1" d="M103.055 122.803L28.7883 139.706C27.6268 134.365 27.0423 128.914 27.0451 123.448C27.0451 123.231 27.0451 123.017 27.0451 122.803H103.055Z" fill="#16C62E"/>
<path d="M103.055 123.338L28.7883 140.241C27.6268 134.9 27.0423 129.449 27.0451 123.983C27.0451 123.766 27.0451 123.552 27.0451 123.338H103.055Z" fill="#D6F480"/>
<path d="M28.9221 141.441C30.4867 148.63 33.0957 155.552 36.6661 161.987L103.189 124.543L28.9221 141.441Z" fill="#AEEA00"/>
<path opacity="0.1" d="M28.9221 141.441C30.4867 148.63 33.0957 155.552 36.6661 161.987L103.189 124.543L28.9221 141.441Z" fill="black"/>
<path d="M29.1898 141.976C30.7544 149.165 33.3634 156.087 36.9338 162.522L103.457 125.078L29.1898 141.976Z" fill="#AEEA00"/>
<path d="M104.246 125.885L37.8389 163.269L37.871 163.328C41.2343 169.408 45.4147 174.999 50.2956 179.945L104.386 125.885H104.246Z" fill="#3ACC6C"/>
<path opacity="0.1" d="M104.246 125.885L37.8389 163.269L37.871 163.328C41.2343 169.408 45.4147 174.999 50.2956 179.945L104.386 125.885H104.246Z" fill="black"/>
<path d="M104.514 126.42L38.1067 163.805L38.1388 163.863C41.5021 169.943 45.6825 175.534 50.5635 180.48L104.653 126.42H104.514Z" fill="#16C62E"/>
</g>
<defs>
<linearGradient id="paint0_linear" x1="191.021" y1="202.885" x2="191.021" y2="50.8171" gradientUnits="userSpaceOnUse">
<stop stop-color="#808080" stop-opacity="0.25"/>
<stop offset="0.54" stop-color="#808080" stop-opacity="0.12"/>
<stop offset="1" stop-color="#808080" stop-opacity="0.1"/>
</linearGradient>
<clipPath id="clip0">
<rect width="268" height="224" fill="white"/>
</clipPath>
</defs>
</svg>
