<svg width="117" height="160" viewBox="0 0 117 160" fill="none" xmlns="http://www.w3.org/2000/svg">
<g opacity="0.1">
<path d="M87 20H67V10H57V20H17V10H7V20H-13C-18.5 20 -23 24.5 -23 30V130C-23 135.5 -18.5 140 -13 140H87C92.5 140 97 135.5 97 130V30C97 24.5 92.5 20 87 20ZM87 130H-13V60H87V130ZM87 50H-13V30H7V40H17V30H57V40H67V30H87V50Z" fill="#7319D5"/>
</g>
</svg>
