<svg width="89" height="89" viewBox="0 0 89 89" fill="none" xmlns="http://www.w3.org/2000/svg">
<g clip-path="url(#clip0)">
<path d="M6.79668 19.2095C9.04184 16.7599 11.3948 14.5556 13.9853 12.5092C14.29 12.2686 14.7286 12.5566 14.6266 12.9312C13.1746 18.2682 10.6376 23.5425 6.72645 27.4634C6.55089 24.7185 6.54828 21.9506 6.79668 19.2095Z" fill="#CCCCCC"/>
<path d="M6.72632 27.4649C4.4683 24.74 2.52803 21.9227 0.779497 18.8811C0.579595 18.5333 0.0478561 18.6574 0.0275182 19.0581C-0.287805 25.2886 2.09277 32.5787 7.89253 35.519C7.31455 32.8694 6.89806 30.1731 6.72632 27.4649Z" fill="#CCCCCC"/>
<path d="M7.8916 35.5175C9.31264 32.5937 10.9033 29.8733 12.7676 27.2364C12.9889 26.9235 13.4849 27.0669 13.501 27.4497C13.7282 32.8317 12.8047 38.5211 10.2258 43.2456C9.27006 40.731 8.4635 38.1481 7.8916 35.5175Z" fill="#CCCCCC"/>
<path d="M10.2275 43.2474C7.29558 41.3631 4.61707 39.3026 2.04789 36.9884C1.75152 36.7214 1.28653 37.0002 1.387 37.3861C2.93476 43.3373 7.36094 49.4444 13.6627 50.523C12.3528 48.1836 11.1792 45.7557 10.2275 43.2474Z" fill="#CCCCCC"/>
<path d="M13.6611 50.5218C14.1748 47.3319 14.9094 44.289 15.932 41.2469C16.0537 40.885 16.5674 40.878 16.6948 41.2378C18.4833 46.2872 19.2078 51.9837 18.1287 57.2189C16.4886 55.0961 14.9711 52.865 13.6611 50.5218Z" fill="#CCCCCC"/>
<path d="M18.13 57.2206C14.7876 56.2737 11.6302 55.0895 8.5029 53.638C8.14169 53.4703 7.7796 53.8721 7.98785 54.2118C11.2031 59.4551 17.2228 63.995 23.5632 63.2126C21.6168 61.3479 19.7775 59.3561 18.13 57.2206Z" fill="#CCCCCC"/>
<path d="M23.562 63.2113C23.1059 59.9974 22.9123 56.863 23.0018 53.6409C23.0124 53.259 23.5024 53.1024 23.7291 53.4099C26.9315 57.7516 29.3204 63.0255 29.8921 68.3725C27.6654 66.8077 25.5273 65.097 23.562 63.2113Z" fill="#CCCCCC"/>
<path d="M82.2044 19.2095C79.9592 16.7599 77.6063 14.5556 75.0157 12.5092C74.711 12.2686 74.2724 12.5566 74.3744 12.9312C75.8264 18.2682 78.3634 23.5425 82.2746 27.4634C82.4501 24.7185 82.4528 21.9506 82.2044 19.2095Z" fill="#CCCCCC"/>
<path d="M82.2736 27.4649C84.5317 24.74 86.4719 21.9227 88.2204 18.8811C88.4203 18.5333 88.9521 18.6574 88.9724 19.0581C89.2878 25.2886 86.9072 32.5787 81.1074 35.519C81.6854 32.8694 82.1019 30.1731 82.2736 27.4649Z" fill="#CCCCCC"/>
<path d="M81.1084 35.5175C79.6874 32.5937 78.0967 29.8733 76.2324 27.2364C76.0111 26.9235 75.5152 27.0669 75.499 27.4497C75.2718 32.8317 76.1953 38.5211 78.7743 43.2456C79.73 40.731 80.5365 38.1481 81.1084 35.5175Z" fill="#CCCCCC"/>
<path d="M78.7731 43.2474C81.705 41.3631 84.3835 39.3026 86.9527 36.9884C87.2491 36.7214 87.7141 37.0002 87.6136 37.3861C86.0658 43.3373 81.6397 49.4444 75.3379 50.523C76.6479 48.1836 77.8214 45.7557 78.7731 43.2474Z" fill="#CCCCCC"/>
<path d="M75.3389 50.5218C74.8252 47.3319 74.0906 44.289 73.068 41.2469C72.9463 40.885 72.4327 40.878 72.3053 41.2378C70.5167 46.2872 69.7922 51.9837 70.8714 57.2189C72.5114 55.0961 74.0289 52.865 75.3389 50.5218Z" fill="#CCCCCC"/>
<path d="M70.8695 57.2206C74.2119 56.2737 77.3693 55.0895 80.4966 53.638C80.858 53.4703 81.2199 53.8721 81.0119 54.2118C77.7966 59.4551 71.7769 63.995 65.4365 63.2126C67.3827 61.3479 69.222 59.3561 70.8695 57.2206Z" fill="#CCCCCC"/>
<path d="M65.4385 63.2113C65.8946 59.9974 66.0883 56.863 65.9988 53.6409C65.9882 53.259 65.4981 53.1024 65.2715 53.4099C62.069 57.7516 59.6801 63.0255 59.1084 68.3725C61.3351 66.8077 63.4732 65.097 65.4385 63.2113Z" fill="#CCCCCC"/>
<path d="M83.497 19.3199C83.4965 19.2935 83.497 19.2673 83.4951 19.2407C83.1881 15.1545 82.4349 11.0582 81.2564 7.06593C81.0464 6.35445 80.2989 5.94787 79.588 6.15803C78.8765 6.36801 78.4699 7.11495 78.6799 7.82642C79.7934 11.5983 80.5077 15.466 80.806 19.3239C80.8067 19.3528 80.8069 19.3816 80.8095 19.4108C81.0358 21.9051 81.0584 24.6079 80.8769 27.4446C80.8767 27.4457 80.8766 27.4469 80.8766 27.4479C80.7205 29.9109 80.3382 32.5482 79.7408 35.2867C79.7408 35.2869 79.7406 35.2872 79.7406 35.2874C79.2205 37.6798 78.4553 40.2114 77.4669 42.8121C77.4666 42.8129 77.4664 42.8136 77.4661 42.8145V42.8147C76.5995 45.0984 75.4738 47.4818 74.1204 49.8987C72.9271 52.0331 71.4633 54.2272 69.7691 56.42C69.7688 56.4203 69.7686 56.4209 69.7683 56.4212C69.7679 56.4216 69.7676 56.4219 69.7674 56.4223C68.2659 58.3683 66.4862 60.3306 64.4777 62.2552L64.4775 62.2554C62.6876 63.9728 60.6142 65.6628 58.3144 67.2788C58.3061 67.2848 58.2988 67.2915 58.2906 67.2974C58.2828 67.3032 58.2744 67.308 58.2668 67.314C54.3981 70.2864 52.4376 71.0278 50.3621 71.8123C48.7183 72.4339 47.0401 73.0699 44.5008 74.7626C41.9616 73.0699 40.2834 72.4339 38.6395 71.8123C36.564 71.0276 34.6036 70.2864 30.7349 67.314C30.7272 67.308 30.7189 67.3034 30.7111 67.2976C30.7029 67.2915 30.6954 67.2848 30.6871 67.2788C28.3874 65.6629 26.3139 63.9728 24.524 62.2554L24.5239 62.2552C22.5153 60.3308 20.7356 58.3683 19.2341 56.4223C19.2338 56.4219 19.2334 56.4216 19.2332 56.4212C19.2329 56.4209 19.2327 56.4203 19.2324 56.42C17.5382 54.2272 16.0743 52.0331 14.8811 49.8987C13.5275 47.4818 12.402 45.0984 11.5354 42.8147C11.5354 42.8145 11.5354 42.8145 11.5353 42.8145C11.5349 42.8136 11.5347 42.8129 11.5344 42.8121C10.5457 40.2114 9.78065 37.6798 9.26038 35.2874C9.26038 35.2871 9.26021 35.2869 9.26021 35.2867C8.66259 32.5482 8.28052 29.9107 8.12442 27.4479C8.12425 27.4467 8.12407 27.4457 8.12407 27.4446C7.9426 24.6081 7.96519 21.9051 8.19152 19.4108C8.19412 19.3816 8.1943 19.3528 8.19499 19.3239C8.49328 15.466 9.20754 11.5985 10.3211 7.82642C10.5311 7.11495 10.1245 6.36801 9.41301 6.15803C8.70222 5.94752 7.95459 6.35445 7.74461 7.06593C6.56605 11.0582 5.81286 15.1545 5.50588 19.2407C5.50379 19.2673 5.50431 19.2935 5.50397 19.3199C5.27799 21.9091 5.25661 24.6987 5.44347 27.6162C5.44347 27.6169 5.44347 27.6174 5.44347 27.6181C5.60826 30.2139 6.00911 32.9844 6.63454 35.8527C6.63489 35.8546 6.63506 35.8565 6.63541 35.8584C7.18401 38.3805 7.9871 41.0409 9.02276 43.7657C9.02311 43.7664 9.02328 43.7671 9.02346 43.7678C9.93657 46.1737 11.1179 48.677 12.5351 51.2079C12.5355 51.2085 12.5356 51.209 12.536 51.2095C13.7938 53.4594 15.3315 55.765 17.1066 58.0623C17.1068 58.0625 17.107 58.0627 17.1071 58.0628C17.1073 58.063 17.1073 58.063 17.1073 58.0632C18.6905 60.1152 20.5608 62.1784 22.6662 64.1957C22.6667 64.1962 22.6674 64.1967 22.6679 64.1972C24.5492 66.0019 26.7202 67.7727 29.1206 69.4609C33.2893 72.6612 35.5263 73.5071 37.6892 74.325C39.0355 74.8339 40.346 75.3304 42.1603 76.4462C40.7714 77.5107 39.1628 78.8464 37.2541 80.5541C36.7014 81.0486 36.6541 81.8978 37.1488 82.4505C37.4141 82.7471 37.7814 82.8981 38.1502 82.8981C38.469 82.8981 38.789 82.7853 39.0453 82.5559C41.2584 80.5755 43.0273 79.1282 44.5005 78.0397C45.9735 79.1282 47.7424 80.5755 49.9557 82.5559C50.212 82.7852 50.532 82.8981 50.8508 82.8981C51.2196 82.8981 51.5869 82.7471 51.8522 82.4505C52.3469 81.8978 52.2998 81.0486 51.7469 80.5541C49.8384 78.8462 48.2296 77.5105 46.8407 76.4462C48.6548 75.3304 49.9655 74.8339 51.3118 74.325C53.4749 73.5073 55.7117 72.6612 59.8804 69.4609C62.2808 67.7727 64.4518 66.0019 66.3331 64.1972C66.3336 64.1967 66.3343 64.1962 66.3348 64.1957C68.4402 62.1784 70.3104 60.1152 71.8937 58.0632C71.8937 58.063 71.8938 58.063 71.8938 58.0628C71.894 58.0627 71.8942 58.0625 71.8944 58.0623C73.6695 55.765 75.2072 53.4594 76.465 51.2095C76.4653 51.209 76.4655 51.2085 76.4659 51.2079C77.8829 48.677 79.0644 46.1737 79.9775 43.7678C79.9777 43.7671 79.9781 43.7664 79.9782 43.7657C81.0139 41.0409 81.817 38.3805 82.3656 35.8584C82.3659 35.8565 82.3661 35.8546 82.3664 35.8527C82.9921 32.9844 83.3927 30.2139 83.5575 27.6181C83.5575 27.6174 83.5575 27.6169 83.5575 27.6162C83.7444 24.6987 83.7232 21.9091 83.497 19.3199Z" fill="white"/>
</g>
<path d="M41.9698 33.6707C41.686 33.6707 41.4377 33.5658 41.2249 33.356C41.0121 33.1461 40.9057 32.9013 40.9057 32.6216V30.9429C41.083 29.2993 41.5974 27.8655 42.4487 26.6415C43.3354 25.3825 44.5769 23.9487 46.1731 22.34C47.3437 21.2209 48.2304 20.2592 48.8334 19.4548C49.4365 18.6505 49.7912 17.8287 49.8976 16.9893C50.0395 15.5555 49.5606 14.4189 48.461 13.5796C47.3614 12.7053 46.0312 12.2682 44.4705 12.2682C40.9944 12.2682 38.9016 13.9643 38.1921 17.3565C37.9438 18.1609 37.4295 18.5631 36.6492 18.5631H32.1266C31.7719 18.5631 31.4881 18.4581 31.2753 18.2483C31.0625 18.0035 30.9561 17.6888 30.9561 17.3041C31.027 15.3807 31.6123 13.5796 32.7119 11.901C33.8115 10.2224 35.4077 8.87597 37.5005 7.8618C39.5932 6.81266 42.0407 6.28809 44.843 6.28809C47.7871 6.28809 50.1991 6.7602 52.079 7.70443C53.9945 8.61369 55.3778 9.78523 56.2292 11.2191C57.1159 12.6529 57.5593 14.1392 57.5593 15.6779C57.5593 17.4615 57.1514 19.0002 56.3356 20.2941C55.5552 21.5531 54.3669 23.0219 52.7707 24.7005C51.6357 25.9245 50.7489 26.9737 50.1104 27.848C49.5074 28.6873 49.0995 29.5965 48.8867 30.5757C48.7448 31.45 48.6561 32.0445 48.6206 32.3593C48.3369 33.2336 47.858 33.6707 47.184 33.6707H41.9698ZM41.8102 43.5326C41.4555 43.5326 41.154 43.4103 40.9057 43.1655C40.6574 42.9207 40.5332 42.6234 40.5332 42.2737V37.7099C40.5332 37.3602 40.6574 37.0629 40.9057 36.8181C41.154 36.5384 41.4555 36.3985 41.8102 36.3985H46.9712C47.3614 36.3985 47.6806 36.5209 47.9289 36.7657C48.1772 37.0105 48.3014 37.3252 48.3014 37.7099V42.2737C48.3014 42.6234 48.1772 42.9207 47.9289 43.1655C47.6806 43.4103 47.3614 43.5326 46.9712 43.5326H41.8102Z" fill="white"/>
<defs>
<clipPath id="clip0">
<rect width="89" height="89" fill="white"/>
</clipPath>
</defs>
</svg>
