<svg width="1500" height="1024" viewBox="0 0 1500 1024" fill="none" xmlns="http://www.w3.org/2000/svg">
<mask id="mask0" mask-type="alpha" maskUnits="userSpaceOnUse" x="0" y="0" width="1500" height="1024">
<path d="M0 0H1500V1024H0V0Z" fill="white"/>
</mask>
<g mask="url(#mask0)">
<path d="M645.001 812.5C1309.5 1144.5 634.266 1191 407.001 1191C179.736 1191 -154.748 1082.5 -129.5 812.5C-98.5001 481 -68.2644 -207.5 159.001 -207.5C386.266 -207.5 645.001 585.235 645.001 812.5Z" fill="#CB9EFA"/>
<path d="M1600.54 752.5C1600.54 854.825 1621.09 1018.25 1588.04 1084C1547.68 1164.28 506.04 1184 378.54 1067.5C255.999 955.531 204.168 866 162.5 734C94.0003 517 172 -87.5 413.5 -156C640.765 -156 1600.54 525.235 1600.54 752.5Z" fill="#B98CEA"/>
<path d="M1716.5 851.5C1716.5 999.211 1468.12 1098.7 1232.5 1067C1105.6 1049.93 981 1067 761 851.5C540.974 635.975 607.306 97.6138 668 -59.9998C767.501 -318.386 1005.23 -155 1232.5 -155C1459.77 -155 1716.5 624.235 1716.5 851.5Z" fill="#9652DF"/>
<path d="M2160.86 -56.5952C2160.86 170.67 1949.77 391.904 1722.5 391.904C1488 380.904 1410.5 368.404 1288 262.904C1233.04 215.575 1083.55 -36.264 1229.37 -242.596C1409.37 -497.295 1469.59 -549.596 1696.86 -549.596C1924.12 -549.596 2160.86 -283.86 2160.86 -56.5952Z" fill="#7319D5"/>
</g>
<path d="M69.0783 88.7855C67.6972 88.7838 66.3732 88.2191 65.3966 87.2151C64.42 86.2112 63.8706 84.85 63.869 83.4302V65.2186H74.231V54.3154H63.869V44H53.2629V54.3154H47V65.2186H53.2629V83.4302C53.2632 87.7421 54.9296 91.8773 57.8955 94.9262C60.8614 97.9752 64.8839 99.6882 69.0783 99.6884H74.2563V88.7724L69.0783 88.7855Z" fill="white"/>
<path d="M192.785 54.4203L192.574 58.1154C191.816 57.4885 191.02 56.912 190.191 56.3897C186.847 54.2813 183.284 53.2122 179.599 53.2122C175.15 53.2122 171.076 54.1754 167.49 56.0745C163.883 57.9593 160.878 60.8669 158.829 64.4531C156.762 68.0436 155.715 72.3188 155.715 77.1603C155.715 81.7148 156.722 85.8408 158.707 89.4199C160.632 92.9509 163.471 95.8656 166.908 97.8414C170.321 99.8085 174.163 100.806 178.327 100.806C182.346 100.828 186.302 99.7702 189.801 97.7379C190.6 97.2763 191.375 96.7722 192.124 96.2278V100.001H202.799V54.4203H192.785ZM192.122 73.6923V78.8698C191.892 82.343 190.659 84.9926 188.245 87.2054C185.797 89.4485 182.873 90.5388 179.304 90.5388C177.044 90.5499 174.825 89.9206 172.89 88.72C170.915 87.5088 169.277 85.7957 168.132 83.7453C166.973 81.6837 166.371 79.3411 166.388 76.9599C166.388 74.2392 166.961 71.8339 168.09 69.8098C169.163 67.8535 170.742 66.2416 172.652 65.1534C174.662 64.0286 176.918 63.453 179.206 63.482C182.256 63.4568 185.218 64.53 187.579 66.5155C189.927 68.4567 191.454 70.8706 192.122 73.6923V73.6923Z" fill="white"/>
<path d="M244.884 54.4204L232.429 83.4229L219.551 54.4204H207.638L226.793 96.5227L217.261 118.92H228.692L256 54.4204H244.884Z" fill="white"/>
<path d="M140.318 54.5016V69.2687C140.309 70.6831 139.756 72.0365 138.78 73.0334C137.804 74.0304 136.484 74.59 135.108 74.59C133.732 74.59 132.412 74.0304 131.435 73.0334C130.459 72.0365 129.907 70.6831 129.898 69.2687V67.5929C129.898 63.7752 128.422 60.1139 125.796 57.4144C123.17 54.7149 119.607 53.1983 115.893 53.1983C112.179 53.1983 108.617 54.7149 105.99 57.4144C103.364 60.1139 101.889 63.7752 101.889 67.5929V83.4299C101.889 84.8501 101.34 86.2122 100.363 87.2165C99.3855 88.2207 98.0604 88.7849 96.6786 88.7849C95.2968 88.7849 93.9717 88.2207 92.9946 87.2165C92.0176 86.2122 91.4687 84.8501 91.4687 83.4299V54.5016H80.8615V83.4288C80.8615 87.7406 82.528 91.8759 85.4943 94.9248C88.4606 97.9737 92.4838 99.6865 96.6788 99.6865C100.874 99.6865 104.897 97.9737 107.863 94.9248C110.83 91.8759 112.496 87.7406 112.496 83.4288V67.5918C112.496 66.6657 112.854 65.7775 113.491 65.1227C114.128 64.4678 114.992 64.0999 115.893 64.0999C116.794 64.0999 117.658 64.4678 118.296 65.1227C118.933 65.7775 119.291 66.6657 119.291 67.5918V69.2676C119.29 73.3861 120.81 77.3514 123.544 80.3623C126.278 83.3731 130.022 85.2051 134.02 85.4882C138.017 85.7712 141.97 84.4841 145.08 81.887C148.19 79.2899 150.225 75.5763 150.774 71.4966C150.873 70.758 150.924 70.0133 150.925 69.2676V54.5016H140.318Z" fill="white"/>
<path d="M49.5969 130.125V134.227C49.5539 134.647 49.6737 135.068 49.9305 135.397C50.0581 135.515 50.2072 135.605 50.3691 135.663C50.5311 135.721 50.7026 135.745 50.8736 135.733C51.1402 135.734 51.405 135.689 51.6569 135.599V136.628C51.3279 136.731 50.9853 136.781 50.6414 136.776C50.3438 136.793 50.0457 136.749 49.7653 136.645C49.4848 136.541 49.2277 136.38 49.0095 136.171C48.8005 135.93 48.6408 135.648 48.5398 135.342C48.4388 135.035 48.3986 134.712 48.4215 134.389V130.123H47V129.169H48.4215V127.245L49.5969 126.813V129.17H51.6859V130.125L49.5969 130.125Z" fill="white"/>
<path d="M57.1709 129.082L57.1419 130.187C56.8938 130.103 56.6339 130.063 56.3729 130.068C56.077 130.044 55.78 130.094 55.5063 130.212C55.2327 130.33 54.9903 130.513 54.7991 130.746C54.449 131.219 54.2671 131.8 54.2838 132.394V136.675H53.1074V131.274C53.1115 130.571 53.0727 129.869 52.9913 129.171H54.1082L54.2243 130.558C54.3859 130.08 54.6972 129.671 55.1094 129.395C55.5253 129.123 56.0096 128.983 56.5022 128.992C56.7281 128.99 56.9532 129.02 57.1709 129.082Z" fill="white"/>
<path d="M64.6416 129.171V136.673H63.481V135.316C63.2784 135.772 62.9408 136.15 62.5163 136.397C62.0573 136.658 61.5391 136.789 61.0145 136.777C60.4133 136.79 59.8213 136.624 59.3099 136.298C58.8134 135.971 58.4202 135.502 58.1783 134.949C57.9139 134.302 57.7783 133.606 57.7795 132.905C57.7807 132.203 57.9188 131.508 58.1855 130.862C58.4311 130.301 58.826 129.823 59.3246 129.482C59.8281 129.15 60.4163 128.979 61.0145 128.99C61.5377 128.978 62.0542 129.112 62.5088 129.378C62.9314 129.633 63.2699 130.012 63.481 130.467V129.169L64.6416 129.171ZM62.9008 135.025C63.2803 134.381 63.4809 133.642 63.4809 132.888C63.4809 132.135 63.2803 131.396 62.9008 130.752C62.7015 130.503 62.4479 130.305 62.1605 130.176C61.8731 130.046 61.5601 129.988 61.2468 130.006C60.9284 129.99 60.6109 130.051 60.3198 130.185C60.0287 130.318 59.7723 130.52 59.5712 130.774C59.1369 131.395 58.9242 132.151 58.9688 132.915C58.9218 133.67 59.1322 134.419 59.564 135.032C59.7693 135.282 60.0283 135.48 60.3206 135.609C60.6129 135.739 60.9304 135.796 61.2482 135.778C61.5619 135.796 61.8753 135.737 62.1626 135.606C62.4499 135.475 62.7029 135.276 62.9008 135.025V135.025Z" fill="white"/>
<path d="M73.1868 131.96V136.673H72.0114V132.02C72.0554 131.477 71.9116 130.935 71.6054 130.491C71.4404 130.318 71.2404 130.186 71.0197 130.102C70.799 130.018 70.5631 129.985 70.3287 130.006C70.0294 129.992 69.7305 130.041 69.4509 130.152C69.1712 130.262 68.9167 130.431 68.7036 130.647C68.4949 130.88 68.3335 131.152 68.2289 131.45C68.1243 131.747 68.0786 132.063 68.0945 132.379V136.674H66.918V131.274C66.9222 130.571 66.8834 129.869 66.8019 129.171H67.9214L68.0375 130.513C68.2481 130.039 68.5983 129.645 69.0387 129.387C69.5032 129.118 70.029 128.982 70.562 128.992C72.3116 128.992 73.1865 129.981 73.1868 131.96Z" fill="white"/>
<path d="M74.9569 135.808L75.3486 134.913C75.709 135.211 76.1163 135.443 76.5529 135.599C76.9935 135.744 77.4539 135.814 77.9164 135.808C78.3529 135.836 78.7881 135.735 79.1706 135.517C79.3077 135.428 79.4195 135.303 79.4946 135.155C79.5697 135.007 79.6055 134.841 79.5984 134.674C79.6039 134.541 79.5808 134.407 79.5307 134.283C79.4806 134.16 79.4048 134.049 79.3085 133.959C79.0279 133.74 78.6988 133.596 78.3507 133.541L77.1177 133.242C76.5844 133.144 76.0918 132.885 75.703 132.497C75.5408 132.328 75.4129 132.128 75.3267 131.907C75.2406 131.687 75.198 131.452 75.2013 131.214C75.1953 130.903 75.262 130.595 75.3957 130.316C75.5295 130.037 75.7264 129.795 75.9699 129.611C76.5592 129.174 77.2755 128.955 78.0013 128.992C78.4955 128.989 78.9865 129.075 79.4519 129.246C79.882 129.399 80.2737 129.649 80.5985 129.977L80.2069 130.856C79.5982 130.301 78.8156 129.988 78.0017 129.977C77.5771 129.95 77.1547 130.057 76.7901 130.282C76.6533 130.375 76.542 130.503 76.467 130.653C76.392 130.803 76.3558 130.971 76.3619 131.139C76.3551 131.274 76.3754 131.408 76.4216 131.534C76.4678 131.66 76.5389 131.774 76.6303 131.87C76.878 132.084 77.1757 132.228 77.4939 132.288L78.7269 132.601C79.2859 132.7 79.8078 132.955 80.2355 133.338C80.4007 133.509 80.5298 133.713 80.6147 133.937C80.6996 134.162 80.7385 134.402 80.729 134.643C80.7361 134.947 80.6695 135.247 80.5353 135.518C80.401 135.789 80.2033 136.021 79.96 136.194C79.3421 136.613 78.6099 136.817 77.8709 136.776C76.8165 136.835 75.7782 136.49 74.9569 135.808V135.808Z" fill="white"/>
<path d="M84.4954 127.016C84.2449 127.343 84.1279 127.758 84.169 128.172V129.171H85.9535V130.125H84.169V136.673H82.9936V130.125H81.5739V129.171H82.9954V128.022C82.9492 127.374 83.1554 126.733 83.5688 126.24C83.7812 126.032 84.0332 125.87 84.3091 125.766C84.5849 125.662 84.8787 125.618 85.172 125.636C85.5051 125.636 85.8369 125.681 86.1585 125.77V126.798C85.9136 126.723 85.6598 126.682 85.4042 126.679C85.2384 126.669 85.0723 126.693 84.9161 126.751C84.7599 126.809 84.6168 126.899 84.4954 127.016V127.016Z" fill="white"/>
<path d="M88.6233 136.3C88.0986 135.98 87.6773 135.508 87.4117 134.943C87.1297 134.296 86.9839 133.594 86.9839 132.885C86.9839 132.175 87.1297 131.474 87.4117 130.827C87.6775 130.262 88.0988 129.79 88.6233 129.469C89.1791 129.156 89.8028 128.992 90.4366 128.992C91.0705 128.992 91.6941 129.156 92.25 129.469C92.7745 129.79 93.1958 130.262 93.4615 130.827C93.7438 131.474 93.8897 132.175 93.8897 132.885C93.8897 133.594 93.7438 134.296 93.4615 134.943C93.196 135.508 92.7746 135.98 92.25 136.3C91.6941 136.613 91.0705 136.778 90.4366 136.778C89.8028 136.778 89.1791 136.613 88.6233 136.3V136.3ZM92.1052 135.04C92.5319 134.411 92.7366 133.65 92.6854 132.885C92.7317 132.127 92.5215 131.376 92.0905 130.759C91.8797 130.522 91.6232 130.333 91.3372 130.203C91.0512 130.073 90.742 130.006 90.4295 130.006C90.1169 130.006 89.8078 130.073 89.5218 130.203C89.2358 130.333 88.9792 130.522 88.7684 130.759C88.3373 131.376 88.127 132.127 88.1732 132.885C88.1216 133.652 88.3293 134.413 88.7612 135.04C88.9766 135.273 89.2359 135.459 89.5234 135.586C89.8108 135.713 90.1204 135.778 90.4332 135.778C90.746 135.778 91.0556 135.713 91.3431 135.586C91.6305 135.459 91.8898 135.273 92.1052 135.04V135.04Z" fill="white"/>
<path d="M99.7791 129.082L99.7501 130.187C99.5021 130.103 99.2422 130.063 98.9811 130.068C98.6852 130.044 98.3881 130.094 98.1144 130.212C97.8407 130.33 97.5982 130.513 97.407 130.746C97.0571 131.219 96.8754 131.801 96.892 132.394V136.675H95.717V131.274C95.7211 130.571 95.6822 129.869 95.6006 129.171H96.7179L96.834 130.558C96.9953 130.08 97.3067 129.671 97.7191 129.395C98.1349 129.123 98.619 128.983 99.1116 128.992C99.3371 128.99 99.5618 129.02 99.7791 129.082Z" fill="white"/>
<path d="M111.488 131.96V136.673H110.313V132.02C110.355 131.482 110.231 130.944 109.957 130.483C109.815 130.315 109.637 130.185 109.436 130.102C109.236 130.019 109.019 129.986 108.804 130.006C108.53 129.992 108.257 130.042 108.006 130.153C107.754 130.265 107.531 130.434 107.353 130.647C106.982 131.146 106.797 131.765 106.831 132.392V136.673H105.654V132.02C105.695 131.483 105.568 130.947 105.291 130.491C105.149 130.321 104.97 130.189 104.768 130.105C104.566 130.02 104.348 129.987 104.131 130.006C103.856 129.992 103.583 130.043 103.33 130.154C103.077 130.265 102.852 130.434 102.673 130.647C102.297 131.144 102.109 131.764 102.143 132.392V136.673H100.968V131.274C100.972 130.571 100.933 129.869 100.852 129.171H101.969L102.085 130.483C102.27 130.028 102.586 129.642 102.992 129.378C103.413 129.114 103.899 128.979 104.392 128.99C104.889 128.969 105.382 129.093 105.814 129.348C106.199 129.611 106.486 130.001 106.626 130.454C106.846 130.008 107.186 129.637 107.605 129.385C108.047 129.119 108.551 128.982 109.063 128.99C110.68 128.991 111.488 129.981 111.488 131.96Z" fill="white"/>
<path d="M113.606 125.994H115.043V127.366H113.606L113.606 125.994ZM113.722 136.673V129.171H114.897V136.673H113.722Z" fill="white"/>
<path d="M123.442 131.96V136.673H122.267V132.02C122.311 131.477 122.167 130.935 121.861 130.491C121.696 130.318 121.496 130.186 121.275 130.102C121.054 130.018 120.818 129.985 120.584 130.006C120.285 129.992 119.986 130.042 119.706 130.152C119.426 130.262 119.172 130.431 118.959 130.647C118.75 130.879 118.589 131.152 118.484 131.45C118.38 131.747 118.334 132.063 118.35 132.379V136.674H117.175V131.274C117.179 130.571 117.14 129.869 117.058 129.171H118.175L118.292 130.513C118.502 130.039 118.853 129.645 119.293 129.387C119.757 129.118 120.283 128.982 120.816 128.992C122.567 128.992 123.442 129.981 123.442 131.96Z" fill="white"/>
<path d="M132.161 129.171V136.612C132.161 137.726 131.883 138.568 131.327 139.14C130.771 139.712 129.951 139.998 128.868 139.998C127.858 140.026 126.861 139.757 125.995 139.223L126.198 138.238C126.612 138.484 127.053 138.68 127.511 138.82C127.953 138.943 128.41 139.004 128.868 138.999C129.158 139.021 129.449 138.981 129.724 138.883C129.999 138.784 130.25 138.628 130.464 138.425C130.853 137.95 131.046 137.337 131.001 136.717V134.943C130.791 135.406 130.449 135.793 130.022 136.054C129.556 136.327 129.027 136.464 128.491 136.449C127.892 136.46 127.302 136.3 126.786 135.987C126.285 135.676 125.884 135.219 125.633 134.675C125.365 134.06 125.227 133.394 125.227 132.721C125.227 132.047 125.365 131.382 125.633 130.767C125.884 130.223 126.285 129.766 126.786 129.455C127.302 129.141 127.892 128.981 128.491 128.992C129.021 128.979 129.545 129.113 130.007 129.38C130.433 129.633 130.774 130.013 130.986 130.469V129.171H132.161ZM130.384 134.712C130.776 134.126 130.986 133.432 130.986 132.721C130.986 132.01 130.776 131.315 130.384 130.73C130.178 130.488 129.922 130.298 129.634 130.172C129.346 130.047 129.035 129.99 128.723 130.007C128.407 129.99 128.091 130.047 127.798 130.172C127.506 130.297 127.244 130.488 127.033 130.73C126.631 131.312 126.416 132.007 126.416 132.721C126.416 133.434 126.631 134.13 127.033 134.712C127.244 134.954 127.506 135.145 127.798 135.27C128.091 135.395 128.407 135.452 128.723 135.435C129.035 135.451 129.346 135.395 129.634 135.269C129.922 135.144 130.178 134.954 130.384 134.712V134.712Z" fill="white"/>
<path d="M143.55 129.467C144.05 129.794 144.449 130.263 144.696 130.817C144.979 131.456 145.118 132.152 145.103 132.853C145.117 133.559 144.978 134.26 144.696 134.904C144.449 135.466 144.052 135.945 143.55 136.283C143.043 136.615 142.453 136.786 141.852 136.775C141.329 136.788 140.813 136.654 140.358 136.388C139.932 136.129 139.593 135.744 139.386 135.282V136.669H138.211V125.692H139.386V130.494C139.583 130.025 139.921 129.633 140.35 129.376C140.808 129.11 141.327 128.976 141.852 128.988C142.451 128.977 143.04 129.144 143.55 129.467V129.467ZM143.288 135.008C143.719 134.38 143.929 133.62 143.883 132.853C143.929 132.103 143.721 131.361 143.296 130.75C143.083 130.515 142.825 130.327 142.539 130.199C142.252 130.071 141.943 130.004 141.631 130.004C141.319 130.004 141.009 130.071 140.723 130.199C140.437 130.327 140.179 130.515 139.966 130.75C139.587 131.394 139.386 132.133 139.386 132.887C139.386 133.64 139.587 134.379 139.966 135.023C140.177 135.262 140.434 135.452 140.721 135.582C141.007 135.711 141.317 135.778 141.631 135.776C141.944 135.775 142.253 135.706 142.539 135.573C142.825 135.441 143.08 135.248 143.288 135.008V135.008Z" fill="white"/>
<path d="M153.023 129.171V136.673H151.877V135.375C151.661 135.815 151.322 136.179 150.904 136.419C150.474 136.662 149.989 136.785 149.497 136.777C149.138 136.804 148.777 136.751 148.44 136.622C148.102 136.493 147.795 136.292 147.539 136.032C147.094 135.535 146.872 134.799 146.871 133.824V129.171H148.046V133.794C148.004 134.325 148.148 134.855 148.453 135.286C148.612 135.454 148.804 135.584 149.018 135.667C149.231 135.749 149.459 135.783 149.686 135.765C149.977 135.777 150.267 135.726 150.537 135.614C150.808 135.502 151.051 135.332 151.253 135.116C151.662 134.649 151.876 134.036 151.848 133.408V129.172L153.023 129.171Z" fill="white"/>
<path d="M154.837 135.808L155.228 134.913C155.589 135.211 155.996 135.443 156.433 135.599C156.873 135.744 157.334 135.814 157.796 135.808C158.233 135.836 158.668 135.735 159.05 135.517C159.188 135.428 159.299 135.303 159.374 135.155C159.45 135.007 159.485 134.841 159.478 134.674C159.484 134.541 159.461 134.407 159.411 134.283C159.36 134.16 159.285 134.049 159.188 133.959C158.908 133.74 158.579 133.596 158.23 133.541L156.997 133.242C156.464 133.144 155.972 132.885 155.583 132.497C155.421 132.328 155.293 132.128 155.207 131.907C155.12 131.687 155.078 131.452 155.081 131.214C155.075 130.903 155.142 130.595 155.275 130.316C155.409 130.037 155.606 129.795 155.85 129.611C156.439 129.174 157.155 128.955 157.881 128.992C158.375 128.989 158.866 129.075 159.332 129.246C159.762 129.399 160.153 129.649 160.478 129.977L160.087 130.856C159.478 130.301 158.695 129.988 157.881 129.977C157.457 129.95 157.034 130.057 156.67 130.282C156.533 130.375 156.421 130.503 156.346 130.653C156.27 130.803 156.234 130.971 156.24 131.139C156.233 131.274 156.253 131.408 156.3 131.534C156.346 131.66 156.417 131.774 156.508 131.87C156.756 132.084 157.054 132.228 157.372 132.288L158.605 132.601C159.164 132.7 159.686 132.955 160.114 133.338C160.279 133.509 160.408 133.713 160.493 133.937C160.578 134.162 160.617 134.402 160.607 134.643C160.614 134.947 160.548 135.247 160.413 135.518C160.279 135.789 160.081 136.021 159.838 136.194C159.22 136.613 158.488 136.817 157.749 136.776C156.695 136.835 155.657 136.49 154.837 135.808V135.808Z" fill="white"/>
<path d="M162.366 125.994H163.802V127.366H162.366V125.994ZM162.482 136.673V129.171H163.657V136.673H162.482Z" fill="white"/>
<path d="M172.203 131.96V136.673H171.028V132.02C171.072 131.477 170.928 130.935 170.621 130.491C170.456 130.318 170.256 130.185 170.036 130.102C169.815 130.018 169.579 129.985 169.345 130.006C169.045 129.992 168.747 130.042 168.467 130.152C168.187 130.262 167.933 130.431 167.72 130.647C167.511 130.879 167.35 131.152 167.245 131.45C167.14 131.747 167.095 132.063 167.111 132.379V136.674H165.935V131.274C165.94 130.571 165.901 129.869 165.819 129.171H166.937L167.052 130.513C167.263 130.039 167.613 129.645 168.054 129.387C168.518 129.118 169.044 128.982 169.577 128.992C171.328 128.992 172.203 129.981 172.203 131.96Z" fill="white"/>
<path d="M180.529 132.885H175.176C175.129 133.662 175.359 134.43 175.821 135.047C176.056 135.299 176.343 135.496 176.66 135.622C176.977 135.748 177.317 135.801 177.656 135.778C178.516 135.775 179.347 135.464 180.007 134.898L180.398 135.778C180.044 136.107 179.626 136.356 179.172 136.509C178.681 136.687 178.163 136.777 177.642 136.777C177.149 136.806 176.656 136.728 176.193 136.55C175.731 136.371 175.31 136.096 174.958 135.741C174.622 135.356 174.363 134.907 174.196 134.42C174.029 133.932 173.957 133.415 173.986 132.899C173.972 132.195 174.122 131.497 174.421 130.863C174.692 130.294 175.114 129.816 175.639 129.484C176.178 129.151 176.796 128.981 177.424 128.992C177.85 128.97 178.276 129.046 178.67 129.215C179.065 129.384 179.417 129.641 179.702 129.969C180.289 130.731 180.583 131.689 180.528 132.661L180.529 132.885ZM175.952 130.498C175.543 130.933 175.286 131.494 175.22 132.094H179.471C179.457 131.502 179.244 130.933 178.868 130.483C178.681 130.294 178.457 130.147 178.211 130.052C177.965 129.957 177.702 129.915 177.44 129.931C177.167 129.919 176.896 129.964 176.64 130.061C176.385 130.159 176.151 130.307 175.952 130.498Z" fill="white"/>
<path d="M181.865 135.808L182.256 134.913C182.617 135.211 183.024 135.443 183.46 135.599C183.901 135.744 184.362 135.814 184.824 135.808C185.261 135.836 185.696 135.735 186.078 135.517C186.215 135.428 186.327 135.303 186.402 135.155C186.477 135.007 186.513 134.841 186.506 134.674C186.512 134.54 186.489 134.407 186.438 134.283C186.388 134.16 186.312 134.049 186.216 133.959C185.936 133.74 185.606 133.596 185.258 133.541L184.025 133.242C183.492 133.144 183 132.885 182.611 132.497C182.449 132.328 182.321 132.128 182.235 131.907C182.148 131.687 182.106 131.452 182.109 131.214C182.103 130.903 182.17 130.595 182.304 130.316C182.438 130.037 182.634 129.795 182.878 129.611C183.467 129.174 184.183 128.955 184.909 128.992C185.403 128.989 185.895 129.075 186.36 129.246C186.79 129.399 187.182 129.648 187.507 129.977L187.115 130.856C186.507 130.3 185.724 129.988 184.91 129.977C184.485 129.95 184.063 130.057 183.698 130.282C183.562 130.375 183.45 130.503 183.375 130.653C183.301 130.803 183.264 130.971 183.27 131.139C183.264 131.274 183.284 131.408 183.33 131.534C183.376 131.66 183.447 131.774 183.539 131.87C183.786 132.084 184.084 132.228 184.402 132.288L185.635 132.601C186.194 132.7 186.716 132.955 187.144 133.338C187.309 133.509 187.438 133.713 187.523 133.937C187.608 134.162 187.647 134.402 187.637 134.643C187.645 134.946 187.578 135.247 187.444 135.518C187.309 135.789 187.112 136.021 186.868 136.194C186.251 136.613 185.518 136.817 184.779 136.776C183.725 136.835 182.686 136.49 181.865 135.808V135.808Z" fill="white"/>
<path d="M189.06 135.808L189.452 134.913C189.812 135.211 190.219 135.443 190.656 135.599C191.097 135.744 191.557 135.814 192.02 135.808C192.456 135.836 192.891 135.735 193.274 135.517C193.411 135.428 193.523 135.303 193.598 135.155C193.673 135.007 193.709 134.841 193.702 134.674C193.707 134.54 193.684 134.407 193.634 134.283C193.584 134.16 193.508 134.049 193.412 133.959C193.131 133.74 192.802 133.596 192.454 133.541L191.221 133.242C190.688 133.144 190.195 132.885 189.806 132.497C189.644 132.328 189.516 132.128 189.43 131.907C189.344 131.687 189.301 131.452 189.305 131.214C189.299 130.903 189.365 130.595 189.499 130.316C189.633 130.037 189.83 129.795 190.074 129.611C190.663 129.174 191.379 128.956 192.105 128.992C192.599 128.989 193.09 129.075 193.556 129.246C193.986 129.399 194.377 129.648 194.702 129.976L194.311 130.856C193.702 130.3 192.919 129.988 192.105 129.976C191.681 129.95 191.258 130.057 190.894 130.282C190.757 130.375 190.646 130.503 190.571 130.653C190.496 130.803 190.46 130.971 190.466 131.139C190.459 131.274 190.48 131.408 190.526 131.534C190.572 131.66 190.643 131.774 190.734 131.87C190.982 132.084 191.279 132.228 191.598 132.288L192.831 132.601C193.39 132.7 193.912 132.955 194.34 133.338C194.505 133.509 194.634 133.713 194.719 133.937C194.804 134.162 194.843 134.402 194.833 134.643C194.84 134.946 194.773 135.247 194.639 135.518C194.505 135.789 194.307 136.021 194.064 136.194C193.447 136.613 192.715 136.817 191.977 136.777C190.921 136.837 189.882 136.491 189.06 135.808V135.808Z" fill="white"/>
<path d="M202.06 130.125V134.227C202.017 134.647 202.136 135.067 202.393 135.397C202.521 135.515 202.67 135.605 202.832 135.663C202.994 135.721 203.165 135.745 203.336 135.733C203.603 135.734 203.868 135.689 204.12 135.599V136.628C203.791 136.731 203.448 136.781 203.104 136.775C202.806 136.793 202.508 136.749 202.228 136.645C201.947 136.541 201.69 136.38 201.472 136.171C201.263 135.93 201.103 135.648 201.002 135.341C200.901 135.035 200.861 134.712 200.884 134.389V130.123H199.462V129.169H200.884V127.245L202.06 126.813V129.17H204.149V130.125L202.06 130.125Z" fill="white"/>
<path d="M206.774 136.3C206.25 135.98 205.829 135.508 205.563 134.943C205.281 134.296 205.135 133.594 205.135 132.885C205.135 132.175 205.281 131.474 205.563 130.827C205.829 130.262 206.25 129.79 206.774 129.469C207.33 129.156 207.954 128.992 208.588 128.992C209.222 128.992 209.845 129.156 210.401 129.469C210.926 129.79 211.347 130.262 211.613 130.827C211.895 131.474 212.041 132.175 212.041 132.885C212.041 133.594 211.895 134.296 211.613 134.943C211.347 135.508 210.926 135.98 210.401 136.3C209.845 136.613 209.222 136.778 208.588 136.778C207.954 136.778 207.33 136.613 206.774 136.3V136.3ZM210.256 135.04C210.683 134.411 210.888 133.65 210.837 132.885C210.883 132.127 210.673 131.376 210.242 130.759C210.031 130.522 209.774 130.333 209.488 130.203C209.202 130.073 208.893 130.006 208.581 130.006C208.268 130.006 207.959 130.073 207.673 130.203C207.387 130.333 207.13 130.522 206.919 130.759C206.488 131.376 206.278 132.127 206.325 132.885C206.273 133.651 206.481 134.413 206.912 135.04C207.117 135.288 207.375 135.483 207.666 135.611C207.957 135.739 208.272 135.796 208.588 135.777C208.903 135.796 209.218 135.74 209.507 135.612C209.797 135.484 210.053 135.288 210.256 135.04V135.04Z" fill="white"/>
<path d="M220.368 129.171V136.612C220.368 137.726 220.09 138.568 219.534 139.14C218.978 139.712 218.158 139.998 217.075 139.998C216.065 140.026 215.069 139.757 214.202 139.223L214.406 138.238C214.819 138.484 215.26 138.68 215.719 138.82C216.161 138.943 216.617 139.004 217.075 138.999C217.365 139.021 217.657 138.981 217.931 138.882C218.206 138.784 218.457 138.628 218.671 138.425C219.06 137.949 219.253 137.336 219.208 136.717V134.943C218.998 135.406 218.657 135.794 218.229 136.054C217.764 136.327 217.234 136.464 216.699 136.449C216.1 136.46 215.51 136.3 214.994 135.987C214.492 135.676 214.091 135.219 213.84 134.675C213.573 134.06 213.434 133.394 213.434 132.721C213.434 132.047 213.573 131.382 213.84 130.767C214.091 130.223 214.493 129.766 214.994 129.455C215.51 129.141 216.1 128.981 216.699 128.992C217.229 128.979 217.752 129.113 218.215 129.38C218.64 129.634 218.981 130.013 219.194 130.469V129.171H220.368ZM218.591 134.712C218.983 134.126 219.193 133.432 219.193 132.721C219.193 132.01 218.983 131.315 218.591 130.73C218.385 130.488 218.129 130.298 217.841 130.172C217.553 130.047 217.242 129.99 216.93 130.007C216.613 129.99 216.298 130.047 216.005 130.172C215.713 130.297 215.451 130.488 215.239 130.73C214.838 131.312 214.623 132.008 214.623 132.721C214.623 133.434 214.838 134.13 215.239 134.712C215.451 134.954 215.713 135.145 216.005 135.27C216.297 135.395 216.613 135.451 216.93 135.435C217.242 135.452 217.553 135.395 217.841 135.27C218.129 135.144 218.385 134.954 218.591 134.712Z" fill="white"/>
<path d="M228.739 132.885H223.386C223.339 133.662 223.568 134.43 224.031 135.047C224.266 135.299 224.552 135.496 224.869 135.622C225.186 135.748 225.527 135.801 225.866 135.778C226.725 135.775 227.556 135.464 228.216 134.898L228.608 135.778C228.254 136.107 227.836 136.356 227.382 136.509C226.89 136.687 226.373 136.777 225.851 136.777C225.358 136.806 224.865 136.728 224.403 136.55C223.941 136.371 223.52 136.096 223.167 135.741C222.831 135.356 222.572 134.907 222.406 134.42C222.239 133.932 222.167 133.415 222.196 132.899C222.182 132.195 222.331 131.497 222.631 130.863C222.901 130.294 223.324 129.816 223.849 129.484C224.387 129.151 225.005 128.981 225.633 128.992C226.06 128.97 226.486 129.046 226.88 129.215C227.274 129.384 227.627 129.641 227.911 129.969C228.499 130.731 228.793 131.689 228.738 132.661L228.739 132.885ZM224.162 130.498C223.753 130.933 223.495 131.494 223.429 132.094H227.68C227.666 131.502 227.454 130.933 227.078 130.483C226.891 130.294 226.666 130.147 226.42 130.052C226.174 129.957 225.912 129.915 225.649 129.931C225.377 129.919 225.105 129.964 224.85 130.061C224.595 130.159 224.361 130.307 224.162 130.498Z" fill="white"/>
<path d="M232.048 130.125V134.227C232.005 134.647 232.125 135.067 232.381 135.397C232.509 135.515 232.658 135.605 232.82 135.663C232.982 135.721 233.153 135.745 233.324 135.733C233.591 135.734 233.856 135.689 234.108 135.599V136.628C233.779 136.731 233.436 136.781 233.092 136.775C232.795 136.793 232.497 136.749 232.216 136.645C231.935 136.541 231.678 136.38 231.46 136.171C231.251 135.93 231.092 135.648 230.991 135.341C230.89 135.035 230.849 134.712 230.872 134.389V130.123H229.451V129.169H230.872V127.245L232.048 126.813V129.17H234.137V130.125L232.048 130.125Z" fill="white"/>
<path d="M241.825 131.958V136.671H240.65V132.018C240.694 131.475 240.55 130.933 240.244 130.489C240.079 130.316 239.879 130.184 239.658 130.1C239.437 130.016 239.201 129.984 238.967 130.004C238.668 129.99 238.369 130.04 238.089 130.15C237.81 130.26 237.555 130.429 237.342 130.645C237.134 130.878 236.972 131.15 236.868 131.448C236.763 131.745 236.717 132.061 236.733 132.377V136.672H235.558V125.694H236.733V130.392C236.953 129.948 237.299 129.584 237.726 129.348C238.18 129.104 238.687 128.981 239.199 128.99C240.95 128.99 241.825 129.979 241.825 131.958Z" fill="white"/>
<path d="M250.153 132.885H244.8C244.753 133.662 244.982 134.43 245.445 135.047C245.68 135.299 245.966 135.496 246.283 135.622C246.601 135.748 246.941 135.801 247.28 135.778C248.139 135.775 248.971 135.464 249.63 134.898L250.022 135.778C249.668 136.107 249.25 136.356 248.796 136.509C248.304 136.687 247.787 136.777 247.265 136.777C246.772 136.806 246.279 136.728 245.817 136.55C245.355 136.371 244.934 136.096 244.581 135.741C244.245 135.356 243.986 134.907 243.819 134.42C243.653 133.932 243.581 133.415 243.609 132.899C243.596 132.195 243.745 131.497 244.045 130.863C244.315 130.294 244.738 129.816 245.263 129.484C245.801 129.151 246.42 128.981 247.047 128.992C247.474 128.97 247.9 129.046 248.294 129.215C248.688 129.384 249.041 129.641 249.325 129.969C249.913 130.731 250.207 131.689 250.152 132.661L250.153 132.885ZM245.576 130.498C245.167 130.933 244.91 131.494 244.843 132.094H249.096C249.082 131.502 248.869 130.933 248.494 130.483C248.306 130.294 248.082 130.147 247.836 130.052C247.59 129.957 247.327 129.915 247.065 129.931C246.793 129.919 246.521 129.963 246.265 130.061C246.009 130.158 245.775 130.307 245.576 130.498V130.498Z" fill="white"/>
<path d="M256 129.082L255.971 130.187C255.723 130.103 255.463 130.063 255.202 130.068C254.906 130.044 254.609 130.094 254.335 130.212C254.062 130.33 253.819 130.513 253.628 130.746C253.278 131.219 253.096 131.8 253.113 132.394V136.675H251.938V131.274C251.942 130.571 251.903 129.869 251.822 129.171H252.939L253.055 130.558C253.216 130.08 253.527 129.671 253.94 129.395C254.356 129.123 254.84 128.983 255.333 128.992C255.558 128.99 255.783 129.02 256 129.082Z" fill="white"/>
</svg>
