<svg width="157" height="112" viewBox="0 0 157 112" fill="none" xmlns="http://www.w3.org/2000/svg">
<g clip-path="url(#clip0)">
<path d="M150.709 25.6836L87.5039 52.872L96.6115 78.0088L103.121 95.9709L104.757 100.489L119.322 106.021L119.849 106.221L135.063 111.998L142.367 108.872L152.316 104.592L157 102.577L150.709 25.6836Z" fill="#F2F2F2"/>
<path d="M152.366 102.007L152.353 102.659L152.317 104.594L142.367 108.875L135.648 111.765L135.365 110.816L135.064 112.001L119.849 106.223L119.614 100.646V100.644L119.562 99.4049L149.367 97.4023L149.952 98.2987L150.067 98.4767L152.366 102.007Z" fill="#2F2E41"/>
<path d="M130.763 42.749C130.763 42.749 128.763 49.956 128.363 49.956C127.963 49.956 132.163 55.5614 132.163 55.5614L138.364 58.9647L140.565 49.7558C140.565 49.7558 138.564 44.751 138.964 42.1484L130.763 42.749Z" fill="#FFB8B8"/>
<path d="M133.964 45.5506C138.051 45.5506 141.365 42.2343 141.365 38.1435C141.365 34.0526 138.051 30.7363 133.964 30.7363C129.876 30.7363 126.562 34.0526 126.562 38.1435C126.562 42.2343 129.876 45.5506 133.964 45.5506Z" fill="#FFB8B8"/>
<path d="M134.964 53.5593L129.05 48.4197L125.562 50.156L117.961 54.9607C117.961 54.9607 119.961 98.2024 118.961 99.8039C118.961 99.8039 121.161 104.809 134.163 101.806C147.165 98.8029 150.566 98.4026 150.566 98.4026L147.766 71.9771L151.166 55.3611L139.744 47.3672L136.164 53.5593L134.964 53.5593Z" fill="#7319D5"/>
<path d="M112.961 70.377C112.961 70.377 109.96 79.786 112.161 80.787C114.361 81.788 116.161 81.3876 116.161 81.3876L119.562 73.1797L112.961 70.377Z" fill="#FFB8B8"/>
<path d="M154.567 68.7754L156.367 77.1835V94.1999C156.367 94.1999 153.767 105.01 151.767 102.208C149.766 99.4049 149.808 98.5174 149.808 98.5174L152.367 94.6003L151.167 78.5848L147.978 70.945L154.567 68.7754Z" fill="#FFB8B8"/>
<path d="M140.965 30.7385C140.965 30.7385 138.565 25.5335 133.964 26.7346C129.363 27.9358 126.763 29.7375 126.563 31.5393C126.363 33.341 126.663 36.0436 126.663 36.0436C126.663 36.0436 127.163 32.34 130.363 33.1408C133.564 33.9416 138.565 33.341 138.565 33.341L139.365 40.5479C139.365 40.5479 140.265 39.2467 141.265 40.0475C142.265 40.8482 144.166 32.34 140.965 30.7385Z" fill="#2F2E41"/>
<path d="M148.03 70.4267L148.754 74.1915L155.843 72.309L154.541 68.834L148.03 70.4267Z" fill="#3F3D56"/>
<path d="M112.828 70.3105L111.698 73.9736L118.839 75.6483L119.323 71.9685L112.828 70.3105Z" fill="#3F3D56"/>
<path d="M146.565 54.9609L151.166 55.3613C151.166 55.3613 156.367 69.575 155.767 69.9754C155.167 70.3758 147.965 72.7781 146.965 72.1775C145.965 71.577 146.565 54.9609 146.565 54.9609Z" fill="#7319D5"/>
<path d="M119.562 55.3613L117.962 54.9609C117.962 54.9609 114.962 58.7646 113.961 63.1689C112.961 67.5731 111.561 71.9773 112.361 71.9773C113.161 71.9773 120.362 74.78 120.362 74.78L119.562 55.3613Z" fill="#7319D5"/>
<path d="M135.732 56.3822C136.531 56.3822 137.179 55.734 137.179 54.9343C137.179 54.1346 136.531 53.4863 135.732 53.4863C134.933 53.4863 134.285 54.1346 134.285 54.9343C134.285 55.734 134.933 56.3822 135.732 56.3822Z" fill="#3F3D56"/>
<path d="M146.902 80.5358L131.448 85.4118L125.141 65.3877C131.096 64.552 136.247 62.9267 140.595 60.5117C141.401 67.342 143.46 74.0219 146.902 80.5358Z" fill="#E6E6E6"/>
<path d="M145.455 82.7077L130.001 87.5836L123.693 67.5595C129.648 66.7238 134.8 65.0985 139.148 62.6836C139.954 69.5139 142.013 76.1938 145.455 82.7077Z" fill="white"/>
<path d="M113.96 74.9803C113.96 74.9803 111.56 79.3846 112.16 80.7859C112.76 82.1873 117.761 82.988 118.361 82.988C118.961 82.988 126.162 81.3865 126.162 81.3865C126.162 81.3865 137.164 76.1815 133.963 73.579C130.763 70.9765 124.762 77.1824 124.762 77.1824H119.961L117.361 75.3807L113.96 74.9803Z" fill="#FFB8B8"/>
<path d="M26.2781 18.0918H0.133789V29.7881H26.2781V18.0918Z" fill="#F2F2F2"/>
<path d="M95.1923 56.0879H90.6338V60.1134H95.1923V56.0879Z" fill="#3F3D56"/>
<path d="M86.0751 56.0879H81.5166V60.1134H86.0751V56.0879Z" fill="#3F3D56"/>
<path d="M104.309 47.2324H99.751V51.7946H104.309V47.2324Z" fill="#7319D5"/>
<path d="M99.7509 51.7949H95.1924V56.0887H99.7509V51.7949Z" fill="#3F3D56"/>
<path d="M90.6337 51.7949H86.0752V56.0887H90.6337V51.7949Z" fill="#3F3D56"/>
<path d="M36.6024 59.8457H32.0439V63.8712H36.6024V59.8457Z" fill="#7319D5"/>
<path d="M77.6288 55.5508H73.0703V59.8446H77.6288V55.5508Z" fill="#3F3D56"/>
<path d="M50.2772 55.5508H45.7188V59.8446H50.2772V55.5508Z" fill="#3F3D56"/>
<path d="M45.7187 50.9883H41.1602V55.5505H45.7187V50.9883Z" fill="#3F3D56"/>
<path d="M68.5116 55.5508H63.9531V59.8446H68.5116V55.5508Z" fill="#3F3D56"/>
<path d="M63.953 50.9883H59.3945V55.5505H63.953V50.9883Z" fill="#3F3D56"/>
<path d="M59.3944 55.5508H54.8359V59.8446H59.3944V55.5508Z" fill="#3F3D56"/>
<path d="M41.161 55.5508H36.6025V59.8446H41.161V55.5508Z" fill="#3F3D56"/>
<path d="M73.0702 50.9883H68.5117V55.5505H73.0702V50.9883Z" fill="#7319D5"/>
<path d="M89.1241 43.9445L86.7559 41.4034L89.2949 39.0332L91.6632 41.5743L89.1241 43.9445ZM87.1333 41.4165L89.1373 43.5667L91.2857 41.5612L89.2818 39.411L87.1333 41.4165Z" fill="#3F3D56"/>
<path d="M57.0698 33.4905H53.5977V30.0156H57.0698V33.4905ZM53.8647 33.2232H56.8027V30.2829H53.8647V33.2232Z" fill="#3F3D56"/>
<path d="M121.559 26.7815H118.087V23.3066H121.559V26.7815ZM118.354 26.5142H121.292V23.5739H118.354V26.5142Z" fill="#3F3D56"/>
<path d="M34.1131 62.2689L33.9078 62.0684C34.8516 60.9974 35.567 59.7449 36.0102 58.3875C36.7078 56.2863 37.0486 52.9677 34.71 49.0912C32.3172 45.1249 32.2095 41.9033 32.5404 39.8993C32.9007 37.7186 33.8196 36.4963 33.8585 36.4453L34.0864 36.6196C34.0772 36.6316 33.1663 37.8474 32.8206 39.963C32.5015 41.9162 32.6128 45.0597 34.9554 48.9428C37.3539 52.9184 36.9986 56.3291 36.2782 58.4903C35.4977 60.8318 34.1693 62.2113 34.1131 62.2689Z" fill="#3F3D56"/>
<path d="M70.3123 53.1459L70.1071 52.9454C71.0508 51.8744 71.7662 50.6219 72.2094 49.2645C72.907 47.1632 73.2479 43.8446 70.9092 39.9681C68.5164 36.0018 68.4087 32.7803 68.7397 30.7762C69.0999 28.5955 70.0188 27.3732 70.0577 27.3223L70.2856 27.4965C70.2764 27.5085 69.3655 28.7243 69.0199 30.84C68.7007 32.7932 68.8121 35.9367 71.1547 39.8197C73.5531 43.7954 73.1978 47.2061 72.4775 49.3672C71.6969 51.7088 70.3685 53.0883 70.3123 53.1459Z" fill="#3F3D56"/>
<path d="M101.82 49.6556L101.615 49.4552C102.559 48.3842 103.274 47.1316 103.717 45.7743C104.415 43.673 104.756 40.3544 102.417 36.4779C100.024 32.5116 99.9165 29.2901 100.247 27.286C100.608 25.1053 101.527 23.883 101.566 23.832L101.793 24.0063C101.784 24.0183 100.873 25.2341 100.528 27.3497C100.209 29.303 100.32 32.4464 102.662 36.3295C105.061 40.3052 104.706 43.7159 103.985 45.877C103.205 48.2185 101.876 49.598 101.82 49.6556Z" fill="#3F3D56"/>
<path d="M19.5153 21.7832H6.89746V22.0702H19.5153V21.7832Z" fill="#3F3D56"/>
<path d="M19.5153 23.7969H6.89746V24.0839H19.5153V23.7969Z" fill="#3F3D56"/>
<path d="M19.5153 25.8086H6.89746V26.0956H19.5153V25.8086Z" fill="#3F3D56"/>
<path d="M90.1715 2.5957H77.5537V2.8827H90.1715V2.5957Z" fill="#3F3D56"/>
<path d="M90.1715 4.60742H77.5537V4.89442H90.1715V4.60742Z" fill="#3F3D56"/>
<path d="M90.1715 6.62109H77.5537V6.90809H90.1715V6.62109Z" fill="#3F3D56"/>
<path d="M119.802 47.1445H107.185V47.4315H119.802V47.1445Z" fill="#3F3D56"/>
<path d="M119.802 49.1562H107.185V49.4432H119.802V49.1562Z" fill="#3F3D56"/>
<path d="M119.802 51.1699H107.185V51.4569H119.802V51.1699Z" fill="#3F3D56"/>
<path d="M40.5651 67.2715H27.9473V67.5585H40.5651V67.2715Z" fill="#3F3D56"/>
<path d="M40.5651 69.2832H27.9473V69.5702H40.5651V69.2832Z" fill="#3F3D56"/>
<path d="M40.5651 71.2969H27.9473V71.5839H40.5651V71.2969Z" fill="#3F3D56"/>
<path d="M18.4834 14.8441C20.6634 9.94999 23.9491 6.73065 28.2492 5.27537C31.4419 4.19484 35.1341 4.09273 39.2233 4.97178C42.2387 5.62488 45.1323 6.74975 47.7975 8.30495C61.9934 16.5504 70.7699 16.6237 75.6327 15.2333C80.9647 13.7087 82.916 10.1314 82.9351 10.0955L83.172 10.2211C83.1525 10.258 81.1568 13.9289 75.717 15.4883C72.5809 16.3873 68.9167 16.4244 64.8261 15.5986C59.7352 14.5708 53.9607 12.195 47.6629 8.5371C45.022 6.99606 42.1549 5.88139 39.1671 5.23415C32.4603 3.79241 23.4701 4.30822 18.7282 14.9533L18.4834 14.8441Z" fill="#2F2E41"/>
<path d="M34.3227 36.6318C36.9884 36.6318 39.1494 34.4691 39.1494 31.8012C39.1494 29.1334 36.9884 26.9707 34.3227 26.9707C31.6571 26.9707 29.4961 29.1334 29.4961 31.8012C29.4961 34.4691 31.6571 36.6318 34.3227 36.6318Z" fill="#3F3D56"/>
<path d="M70.7905 28.1787C73.4562 28.1787 75.6172 26.016 75.6172 23.3481C75.6172 20.6803 73.4562 18.5176 70.7905 18.5176C68.1248 18.5176 65.9639 20.6803 65.9639 23.3481C65.9639 26.016 68.1248 28.1787 70.7905 28.1787Z" fill="#3F3D56"/>
<path d="M102.298 23.8837C104.964 23.8837 107.125 21.721 107.125 19.0532C107.125 16.3854 104.964 14.2227 102.298 14.2227C99.6326 14.2227 97.4717 16.3854 97.4717 19.0532C97.4717 21.721 99.6326 23.8837 102.298 23.8837Z" fill="#3F3D56"/>
<path d="M29.8984 29.9217H0V14.625H29.8984V29.9217ZM0.268147 29.6533H29.6302V14.8934H0.268147V29.6533Z" fill="#3F3D56"/>
<path d="M63.9529 8.0293H37.8086V19.7256H63.9529V8.0293Z" fill="#F2F2F2"/>
<path d="M57.1901 11.7188H44.5723V12.0057H57.1901V11.7188Z" fill="#3F3D56"/>
<path d="M57.1901 13.7324H44.5723V14.0194H57.1901V13.7324Z" fill="#3F3D56"/>
<path d="M56.7877 15.3418H44.1699V15.6288H56.7877V15.3418Z" fill="#3F3D56"/>
<path d="M67.5732 19.8592H37.6748V4.5625H67.5732V19.8592ZM37.943 19.5908H67.305V4.83086H37.943V19.5908Z" fill="#3F3D56"/>
<path d="M131.392 3.4668H105.248V15.1631H131.392V3.4668Z" fill="#F2F2F2"/>
<path d="M124.629 7.1582H112.011V7.44521H124.629V7.1582Z" fill="#3F3D56"/>
<path d="M124.629 9.16992H112.011V9.45692H124.629V9.16992Z" fill="#3F3D56"/>
<path d="M124.629 11.1836H112.011V11.4706H124.629V11.1836Z" fill="#3F3D56"/>
<path d="M135.012 15.2967H105.113V0H135.012V15.2967ZM105.381 15.0283H134.744V0.268363H105.381V15.0283Z" fill="#3F3D56"/>
</g>
<defs>
<clipPath id="clip0">
<rect width="157" height="112" fill="white"/>
</clipPath>
</defs>
</svg>
