[
    {
        "name": "Facilitadores",
        "subdimensions": [
            {
                "name": "Data y Analítica",
                "recommendations": [
                    {
                        "level": "Basico",
                        "texto": "1. Implementar herramientas digitales para producir, gestionar y extraer valor de la data proveniente de operaciones, experiencia de clientes y marketing. \n2. Optimizar procesos y conectar con clientes usando data para conversión."
                    },
                    {
                        "level": "Inicial",
                        "texto": "1. Obtener data y vincularla a la estrategia del negocio para impactar en el crecimiento. \n2. Definir el equipo que produce, recopila y gestiona la data y sumar herramientas digitales de análisis para derribar silos en la empresa."
                    },
                    {
                        "level": "Estrategico",
                        "texto": "1. Desplegar la analítica como un activo para gestionar y proyectar demanda, oferta y productividad. \n2. Velar por la calidad de los datos y administrar el procesamiento, integrando data desestructurada para tomar decisiones."
                    },
                    {
                        "level": "Competitivo",
                        "texto": "1. Usar inteligencia artificial para impulsar el negocio alineado a la visión futura. \n2. Generar e integrar data interna y conectar con fuentes externas. \n3. Anticipar amenazas y desarrollar políticas para una estrategia de datos segura."
                    }
                ]
            },
            {
                "name": "Innovación",
                "recommendations": [
                    {
                        "level": "Basico",
                        "texto": "1. Avanzar hacia mejoras incrementales y modelos flexibles agilizando decisiones. \n2. Observar el entorno y comportamiento de los clientes como insumo para innovar. \n3. Romper silos y llevar a diversos equipos a las mismas conversaciones."
                    },
                    {
                        "level": "Inicial",
                        "texto": "1. Enfocar las innovaciones para impactar en la cadena de valor. \n2. Generar redes entre áreas, descentralizando la data y el control. \n3. Alentar la toma de riesgos con innovaciones. \n4. Crear espacios para experimentar y premiar el aprendizaje."
                    },
                    {
                        "level": "Estrategico",
                        "texto": "1. Definir prioridades digitales multifuncionales. \n2. Alinear expectativas de innovación en la empresa. \n3. Impulsar desde un centro corporativo la adopción de nuevas tecnologías. \n4. Abrirse a proveedores con mayor tolerancia al riesgo."
                    },
                    {
                        "level": "Competitivo",
                        "texto": "1. Potenciar redes multifuncionales y analítica avanzada. \n2. Diseñar ecosistemas de trabajo flexibles, considerando tiempos para crear e innovar. \n3. Integrar mentalidad ensayo-aprendizaje. \n4. Crear incentivos que motiven el intercambio de ideas."
                    }
                ]
            },
            {
                "name": "Tecnología y Sistemas",
                "recommendations": [
                    {
                        "level": "Basico",
                        "texto": "1. Integrar herramientas digitales para agilizar y reducir costos en la operación. \n2. Apalancar el negocio en tecnologías y procesos innovadores. \n3. Llevar la tecnología al lenguaje del negocio. \n4. Subir al menos 40% de los procesos a la nube."
                    },
                    {
                        "level": "Inicial",
                        "texto": "1. Usar tecnologías y sistemas para adaptarse a nuevos escenarios y avanzar en la transformación digital. \n2. Integrar herramientas colaborativas para mejorar sistemas y tecnologías digitales. \n3. Subir más del 40% de los procesos a la nube."
                    },
                    {
                        "level": "Estrategico",
                        "texto": "1. Implementar sobre 60% de los procesos automatizados con tecnologías en la nube. \n2. Priorizar uso de tecnologías inteligentes para la estrategia digital. \n3. Facilitar cambios en el negocio con arquitectura tecnológica flexible y modular."
                    },
                    {
                        "level": "Competitivo",
                        "texto": "1. Reimaginar y desarrollar soluciones diferenciadoras con tecnologías inteligentes e integrar capacidades humanas y mecánicas. \n2. Buscar oportunidades en inteligencia artificial, blockchain, Iot para generar valor, anticiparse y escalar."
                    }
                ]
            }
        ]
    },
    {
        "name": "Mentalidad",
        "subdimensions": [
            {
                "name": "Liderazgo y Compromiso",
                "recommendations": [
                    {
                        "level": "Basico",
                        "texto": "1. Volverse líderes impulsores participativos para vencer resistencias y generar seguridad sobre los beneficios de cambiar. \n2. Comunicar a cada equipo su aporte para asegurar el éxito futuro. \n3. Motivar a aprender, desaprender y reaprender."
                    },
                    {
                        "level": "Inicial",
                        "texto": " 1. Auspiciar activamente la adaptación de roles y habilidades y motivar a trabajar por proyectos transversales. \n2. Evaluar el compromiso de los liderazgos con la transformación. \n3. Comprender disrupciones, inspirar y escuchar a los equipos."
                    },
                    {
                        "level": "Estrategico",
                        "texto": " 1. Comunicar en la empresa el compromiso con los cambios. \n2. Premiar un liderazgo responsable con la transformación. \n3. Reforzar estilos participativos y equipos autónomos. \n4. Velar por una empresa permeable, interconectada y colaborativa."
                    },
                    {
                        "level": "Competitivo",
                        "texto": " 1. Velar por la inteligencia colectiva con una red de impulsores como camino para innovar. \n2. Potenciar ecosistemas de equipos en red con talentos que se fusionan y evolucionan. \n3. Conducir la conexión entre empresa y comunidad."
                    }
                ]
            },
            {
                "name": "Cultura y Organización",
                "recommendations": [
                    {
                        "level": "Basico",
                        "texto": "1. Evaluar barreras organizacionales y culturales. \n2. Desaprender viejos hábitos y reemplazar por otros más ágiles. \n3. Medir el impacto de transformar en la estructura organizacional. \n4. Entender fuerzas impulsoras y resistentes al cambio."
                    },
                    {
                        "level": "Inicial",
                        "texto": "1. Gestionar ADN de la cultura para manejar resistencias y mostrar los beneficios de la transformación. \n2. Crear una estructura transversal que facilite el trabajo en red. \n3. Enfocar más del 40% de los proyectos en una cultura digital."
                    },
                    {
                        "level": "Estrategico",
                        "texto": "1. Instalar una cultura de plasticidad organizacional que promueva el cambio. \n2. Visibilizar triunfos de la gestión del cambio. \n3. Desarrollar incentivos asociados a la adopción del cambio. \n4. Crear espacios digitales más sociales e interactivos."
                    },
                    {
                        "level": "Competitivo",
                        "texto": "1. Medir rentabilidad de gestión del cambio y adopción digital. \n2. Enfocar sobre el 80% de los proyectos internos en una Cultura Digital. \n3. Disponibilizar nuevos canales digitales bidireccionales e interactivos para colaboradores."
                    }
                ]
            },
            {
                "name": "Propósito",
                "recommendations": [
                    {
                        "level": "Basico",
                        "texto": "1. Identificar qué se cambiará y cómo impacta un proyecto de transformación digital en la empresa, negocio, las personas y sus roles. \n2. Reconocer valores culturales y creencias internas que resisten a nuevas formas de hacer las cosas."
                    },
                    {
                        "level": "Inicial",
                        "texto": "1. Comunicar por qué transformar y traspasar a los equipos los beneficios para el negocio actual y futuro, y el bienestar para el capital humano. \n2. Visualizar y proyectar innovaciones que cambiarán la forma de hacer las cosas."
                    },
                    {
                        "level": "Estrategico",
                        "texto": "1. Aumentar la creatividad, colaboración y flexibilidad con experiencias significativas vinculadas al propósito. \n2. Medir el compromiso con la velocidad de adaptación e instalar el deseo de cambiar al interior de la empresa."
                    },
                    {
                        "level": "Competitivo",
                        "texto": "1. Institucionalizar la transformación digital integrándola al ADN de la empresa. \n2. Convertirse en innovadores disruptivos que transforman sus industrias. \n3. Darle sentido de misión a la colaboración como práctica cotidiana."
                    }
                ]
            },
            {
                "name": "Talento y Competencias",
                "recommendations": [
                    {
                        "level": "Basico",
                        "texto": "1. Centrarse en habilidades, no en trabajos. \n2. Inyectar talento y competencias nuevas. \n3. Administrar el talento actual con visión futura del negocio. \n4. Gestionar el talento incorporando necesidades físicas, relacionales y de capacitación."
                    },
                    {
                        "level": "Inicial",
                        "texto": "1. Identificar brechas digitales actuales y repensar roles. \n2. Desarrollar talentos flexibles y automotivados, que resuelvan requerimientos de diversas áreas. \n3. Usar analítica para administrar el capital humano customatizando necesidades."
                    },
                    {
                        "level": "Estrategico",
                        "texto": "1. Diseñar modelos laborales adaptables y de rotación multifuncional. \n2. Usar tecnologías y data para desarrollar nuevas métricas e impactar en todo el ciclo de vida del talento. \n3. Integrar aprendizaje con áreas de Investigación y Desarrollo."
                    },
                    {
                        "level": "Competitivo",
                        "texto": "1. Construir talento como ventaja digital. \n2. Diseñar procesos para predecir la demanda de habilidades y sumar candidatos de mediano y largo plazo. \n3. Acelerar la adopción de aprendizaje y competencias con programas en plataformas digitales."
                    }
                ]
            }
        ]
    },
    {
        "name": "Modelo de Negocio",
        "subdimensions": [
            {
                "name": "Cliente",
                "recommendations": [
                    {
                        "level": "Basico",
                        "texto": "1. Observar el comportamiento predictivo de los clientes para tomar decisiones. \n2. Generar acceso rápido, flexible y simple a través de canales digitales. \n3. Conectar con los clientes para entenderlos y ofrecer soluciones a la medida."
                    },
                    {
                        "level": "Inicial",
                        "texto": "1.Habilitar canales digitales 24/7 para una experiencia sin fricciones. \n2.Activar la interacción personalizada con contenidos de valor capturar el interés y preferencia de los clientes. \n3.Enfocar el modelo de negocios en el cliente."
                    },
                    {
                        "level": "Estrategico",
                        "texto": "1.Personalizar la experiencia multicanal para un servicio conectado y una autogestión satisfactoria. \n2.Empoderar a los clientes para acelerar su adopción digital. \n3.Fijar indicadores y medir periódicamente el modelo customer centric."
                    },
                    {
                        "level": "Competitivo",
                        "texto": "1. Implementar una experiencia omnicanal para una red dinámica de usuarios segmentados. \n2. Empoderar a los clientes para que retroalimenten el negocio y sean promotores. \n3. Repensar la experiencia e indicadores y medir en tiempo real."
                    }
                ]
            },
            {
                "name": "Operaciones",
                "recommendations": [
                    {
                        "level": "Basico",
                        "texto": "1. Descentralizar la operación con optimizaciones digitales. \n2. Crear alianzas para mejorar sistemas de producción, suministro, distribución y logística. \n3. Inyectar agilidad al modelo operacional eliminando flujos lineales y estáticos"
                    },
                    {
                        "level": "Inicial",
                        "texto": "1. Diversificar la cadena de suministro y canales de distribución. \n2. Operar con foco en la experiencia del cliente. \n3. Integrar trazabilidad en procesos. \n4. Crear un centro de comando que monitoree operaciones comerciales y problemas críticos."
                    },
                    {
                        "level": "Estrategico",
                        "texto": "1. Evolucionar hacia centros de análisis de productividad para predecir la demanda y personalizar productos. \n2. Integrar data financiera y operativa para mejorar el desempeño, contener costos, recalibrar procesos y riesgos."
                    },
                    {
                        "level": "Competitivo",
                        "texto": "1. Sincronizar una operación modular y automatizada, simplificando la cadena de suministro. \n2. Construir una plataforma de análisis prospectivo con inteligencia artificial para decidir ágilmente y monitorear la operación en tiempo real."
                    }
                ]
            },
            {
                "name": "Productos y Servicios",
                "recommendations": [
                    {
                        "level": "Basico",
                        "texto": "1. Incorporar puntos de venta online en canales propios para mejorar el acceso de clientes al producto. \n2. Mapear el ciclo de vida del producto y procesos críticos que se pueden optimizar y automatizar con herramientas digitales."
                    },
                    {
                        "level": "Inicial",
                        "texto": "1. Implementar metodologías ágiles para el desarrollo de producto, sumando expectativas de clientes y empleados. \n2. Integrar la experiencia digital como parte del producto utilizando inteligencia de datos y diseño centrado en las personas."
                    },
                    {
                        "level": "Estrategico",
                        "texto": "1. Identificar errores tempranamente, reduciendo costos y agilizando lanzamientos al mercado. \n2. Personalizar productos y servicios, alcanzando segmentos específicos de clientes. \n3. Ajustar la estrategia de comercialización con data integrada."
                    },
                    {
                        "level": "Competitivo",
                        "texto": "1. Evaluar nuevas líneas de productos y testear innovaciones con inteligencia artificial y tecnologías en la nube. \n2. Transformar productos en servicios con plataformas que conocen, conectan y optimizan la experiencia del cliente"
                    }
                ]
            },
            {
                "name": "Visión y Futuro",
                "recommendations": [
                    {
                        "level": "Basico",
                        "texto": "1. Indagar hacia dónde va la industria y proyectar la propuesta de valor. \n2. Integrar soluciones que aseguren agilidad para la empresa. \n3. Conectar con empleados, consumidores y socios comerciales, implementando herramientas digitales."
                    },
                    {
                        "level": "Inicial",
                        "texto": "1. Visualizar el negocio futuro y mapear actores claves de la industria, identificando su posición, redes, oportunidades y amenazas de posible competencia. \n2. Hacer el negocio actual mejor, más barato y rápido con nuevas tecnologías."
                    },
                    {
                        "level": "Estrategico",
                        "texto": "1. Proyectar a 5 y 10 años el negocio con ventajas competitivas en tecnología y alianzas para crecer. \n2. Reconocer cuándo competir y cuándo colaborar para innovar y dar valor al negocio. \n3. Enfocarse en el aprendizaje continuo."
                    },
                    {
                        "level": "Competitivo",
                        "texto": "1. Compartir la visión futura e incorporar la incertidumbre con nuevos modelos de negocios, clientes y socios. \n2. Generar acciones hoy para apoyar el plan de negocio a 10 y 20 años. \n3. Compartir activos y analítica para definir nuevos mercados."
                    }
                ]
            }
        ]
    },
    {
        "name": "Orquestación",
        "subdimensions": [
            {
                "name": "Escalamiento",
                "recommendations": [
                    {
                        "level": "Basico",
                        "texto": "1. Identificar necesidades de estructura y costos para el crecimiento sustentable. \n2. Analizar los productos y servicios actuales y verificar cumplimiento de requisitos de escalabilidad. \n3. Mapear prácticas de escalamiento de la competencia."
                    },
                    {
                        "level": "Inicial",
                        "texto": "1. Diseñar una estructura para soportar crecimiento y generar ahorro en producción. \n2. Conocer e incorporar metodologías de prototipado ágil para alcanzar economías de escala. \n3. Lanzar un programa piloto que sea viable y escalable."
                    },
                    {
                        "level": "Estrategico",
                        "texto": "1. Instalar en la empresa la metodología del prototipado temprano para crecer en el mercado. \n2. Contar con más de un prototipo que escaló en el mercado. \n3. Tener claridad sobre qué iniciativas para generar valor no se están escalando."
                    },
                    {
                        "level": "Competitivo",
                        "texto": "1. Escalar servicios y productos en forma periódica con procesos y propietarios definidos y el apoyo de liderazgos dedicados. \n2. Anticipar el escalamiento estratégico con IA para reducir costos en SAC y mejorar productividad."
                    }
                ]
            },
            {
                "name": "Financiamiento",
                "recommendations": [
                    {
                        "level": "Basico",
                        "texto": "1. Asignar recursos a incorporar herramientas digitales y sistemas de recopilación de data. \n2. Comprometer a la gerencia con un presupuesto orientado al proceso de transformación digital."
                    },
                    {
                        "level": "Inicial",
                        "texto": "1. Comprometer a gerencia para financiar una estrategia digital. Asignar presupuestos para innovar en la cadena de valor y reducir brechas digitales. \n2. Invertir en capacitar, facilitar el trabajo en red y crear una cultura digital."
                    },
                    {
                        "level": "Estrategico",
                        "texto": "1. Comprometer a los directivos con recursos para la transformación transversal. \n2. Financiar sistemas para atraer, retener y capacitar equipos. \n3. Asignar presupuesto a alianzas y redes. \n4. Invertir en modelos modulares, dinámicos y flexibles."
                    },
                    {
                        "level": "Competitivo",
                        "texto": "1. Comprometer al directorio con recursos para liderar la transformación alineada a la visión futura. \n2. Financiar ecosistemas modulares e inteligentes. \n3. Invertir en cultura digital colaborativa y la mejora de la experiencia corporativa."
                    }
                ]
            },
            {
                "name": "Gobernanza",
                "recommendations": [
                    {
                        "level": "Basico",
                        "texto": "1. Contar con un inventario de iniciativas digitales de la empresa. \n2. Crear un órgano de gobierno acotado al menos para riesgos operativos y financieros. \n3. Definir y comunicar la estrategia digital para reducir incertidumbre."
                    },
                    {
                        "level": "Inicial",
                        "texto": "1. Definir una estructura de gobierno en la empresa con responsables y roles para supervisar y administrar iniciativas actuales. \n2. Alinear esfuerzos para que los proyectos digitales se alinen a la estrategia empresarial y visión futura."
                    },
                    {
                        "level": "Estrategico",
                        "texto": "1. Definir una estructura de gobierno ágil, colaborativa y flexible. \n2. Monitorear online el inventario de iniciativas digitales y el desempeño continuo. \n3. Comprometer a la organización con la estrategia digital para mitigar incertidumbre."
                    },
                    {
                        "level": "Competitivo",
                        "texto": "1. Relacionar las estrategias actuales con una visión a futuro para gestionar la incertidumbre en la empresa. \n2. Crear un programa de governanza liderado por un órgano multidisciplinario con procedimientos y planes para su ejecución."
                    }
                ]
            }
        ]
    }
]
  
    