<svg width="24" height="12" viewBox="0 0 24 12" fill="none" xmlns="http://www.w3.org/2000/svg">
<path d="M22.9678 5.78801H1.82398L7.80408 1.28967C7.94106 1.18665 7.96837 0.992305 7.86574 0.85533C7.76272 0.718353 7.56798 0.690645 7.43101 0.794061L0.708667 5.85045C0.700082 5.8567 0.694229 5.8645 0.686424 5.87152C0.68096 5.87699 0.675497 5.88167 0.670034 5.88713C0.646229 5.91289 0.626717 5.94138 0.612668 5.9726C0.610326 5.97767 0.609156 5.98313 0.606814 5.9886C0.594717 6.02099 0.587302 6.05533 0.586131 6.09045C0.586131 6.09318 0.584961 6.09552 0.584961 6.09826C0.584961 6.09826 0.585741 6.10021 0.585741 6.10099L0.584961 6.10606C0.585741 6.14157 0.594717 6.17513 0.606814 6.20752C0.609546 6.21416 0.612278 6.22079 0.6154 6.22743C0.629839 6.25904 0.64857 6.28791 0.672765 6.31328C0.676668 6.31718 0.681741 6.3203 0.685254 6.32421C0.697351 6.33513 0.708277 6.34645 0.721546 6.35543L7.69442 11.0602C7.74789 11.0961 7.80798 11.1133 7.86808 11.1133C7.96759 11.1133 8.06516 11.0653 8.12525 10.9767C8.22125 10.8346 8.18379 10.6419 8.04174 10.5459L1.90984 6.4085H22.9678C23.1387 6.4085 23.278 6.26957 23.278 6.09826C23.278 5.92694 23.1387 5.78801 22.9678 5.78801Z" fill="#7319D5"/>
</svg>
