<svg width="330" height="295" viewBox="0 0 330 295" fill="none" xmlns="http://www.w3.org/2000/svg">
<g clip-path="url(#clip0)">
<path d="M71.3382 90.835C70.4528 90.835 69.6037 91.1873 68.9777 91.8145C68.3517 92.4417 68 93.2924 68 94.1794C68 95.0665 68.3517 95.9171 68.9777 96.5444C69.6037 97.1716 70.4528 97.5239 71.3382 97.5239H113.299V96.0649C113.299 95.028 113.556 94.0073 114.046 93.0945C114.537 92.1816 115.247 91.4052 116.111 90.835H71.3382Z" fill="#CCCCCC"/>
<path d="M109.52 83.3091H95.3333C94.4479 83.3091 93.5989 82.9567 92.9728 82.3295C92.3468 81.7023 91.9951 80.8516 91.9951 79.9646C91.9951 79.0776 92.3468 78.2269 92.9728 77.5997C93.5989 76.9725 94.4479 76.6201 95.3333 76.6201H109.52C110.406 76.6201 111.255 76.9725 111.881 77.5997C112.507 78.2269 112.859 79.0776 112.859 79.9646C112.859 80.8516 112.507 81.7023 111.881 82.3295C111.255 82.9567 110.406 83.3091 109.52 83.3091Z" fill="#CCCCCC"/>
<path d="M77.7012 59.48H22.6216C21.7363 59.48 20.8872 59.1276 20.2612 58.5004C19.6351 57.8732 19.2834 57.0225 19.2834 56.1355C19.2834 55.2485 19.6351 54.3978 20.2612 53.7706C20.8872 53.1434 21.7363 52.791 22.6216 52.791H77.7012C78.5865 52.791 79.4356 53.1434 80.0616 53.7706C80.6877 54.3978 81.0394 55.2485 81.0394 56.1355C81.0394 57.0225 80.6877 57.8732 80.0616 58.5004C79.4356 59.1276 78.5865 59.48 77.7012 59.48Z" fill="#CCCCCC"/>
<path d="M53.7084 45.2661H46.6148C45.7294 45.2661 44.8804 44.9138 44.2543 44.2866C43.6283 43.6593 43.2766 42.8087 43.2766 41.9216C43.2766 41.0346 43.6283 40.1839 44.2543 39.5567C44.8804 38.9295 45.7294 38.5771 46.6148 38.5771H53.7084C54.5937 38.5771 55.4428 38.9295 56.0688 39.5567C56.6948 40.1839 57.0465 41.0346 57.0465 41.9216C57.0465 42.8087 56.6948 43.6593 56.0688 44.2866C55.4428 44.9138 54.5937 45.2661 53.7084 45.2661Z" fill="#CCCCCC"/>
<path d="M112.88 158.098H60.9556C59.075 158.096 57.2719 157.346 55.9421 156.014C54.6122 154.682 53.8642 152.875 53.8621 150.991V68.6998C53.8642 66.8156 54.6122 65.0091 55.9421 63.6767C57.2719 62.3444 59.075 61.5949 60.9556 61.5928H143.898C145.779 61.5949 147.582 62.3444 148.911 63.6767C150.241 65.0091 150.989 66.8156 150.991 68.6998V89.096H150.157V68.6998C150.155 67.0372 149.495 65.4433 148.322 64.2677C147.148 63.0921 145.557 62.4308 143.898 62.4289H60.9557C59.2962 62.4308 57.7053 63.0921 56.5319 64.2677C55.3585 65.4433 54.6985 67.0372 54.6966 68.6998V150.991C54.6985 152.654 55.3585 154.248 56.5319 155.423C57.7053 156.599 59.2962 157.26 60.9557 157.262H112.88V158.098Z" fill="#CCCCCC"/>
<path d="M54.2793 108.835H16.429C14.5483 108.833 12.7453 108.084 11.4155 106.752C10.0856 105.419 9.33757 103.613 9.33545 101.728V34.8141C9.33757 32.9298 10.0856 31.1233 11.4155 29.791C12.7453 28.4586 14.5483 27.7092 16.429 27.707H83.8938C85.7744 27.7092 87.5775 28.4586 88.9073 29.791C90.2372 31.1233 90.9852 32.9298 90.9873 34.8141V62.0109H90.1528V34.8141C90.1509 33.1515 89.4909 31.5576 88.3175 30.3819C87.1441 29.2063 85.5532 28.545 83.8938 28.5432H16.429C14.7696 28.545 13.1787 29.2063 12.0053 30.3819C10.8319 31.5576 10.1719 33.1515 10.17 34.8141V101.728C10.1719 103.391 10.8319 104.985 12.0053 106.161C13.1787 107.336 14.7696 107.997 16.429 107.999H54.2793V108.835Z" fill="#CCCCCC"/>
<path d="M223.224 90.835C224.089 91.4052 224.798 92.1816 225.289 93.0945C225.78 94.0073 226.037 95.028 226.037 96.0649V97.5239H267.997C268.883 97.5239 269.732 97.1716 270.358 96.5444C270.984 95.9171 271.335 95.0665 271.335 94.1794C271.335 93.2924 270.984 92.4417 270.358 91.8145C269.732 91.1873 268.883 90.835 267.997 90.835H223.224Z" fill="#CCCCCC"/>
<path d="M226.477 79.9646C226.478 79.0779 226.83 78.2278 227.456 77.6008C228.081 76.9738 228.93 76.6211 229.815 76.6201H244.002C244.887 76.6201 245.737 76.9725 246.363 77.5997C246.989 78.2269 247.34 79.0776 247.34 79.9646C247.34 80.8516 246.989 81.7023 246.363 82.3295C245.737 82.9567 244.887 83.3091 244.002 83.3091H229.815C228.93 83.3081 228.081 82.9554 227.456 82.3284C226.83 81.7014 226.478 80.8513 226.477 79.9646Z" fill="#CCCCCC"/>
<path d="M258.296 56.1355C258.297 55.2488 258.649 54.3987 259.275 53.7717C259.901 53.1447 260.749 52.792 261.634 52.791H316.714C317.599 52.791 318.448 53.1434 319.074 53.7706C319.7 54.3978 320.052 55.2485 320.052 56.1355C320.052 57.0225 319.7 57.8732 319.074 58.5004C318.448 59.1276 317.599 59.48 316.714 59.48H261.634C260.749 59.479 259.901 59.1263 259.275 58.4993C258.649 57.8723 258.297 57.0222 258.296 56.1355Z" fill="#CCCCCC"/>
<path d="M282.289 41.9216C282.29 41.0349 282.642 40.1848 283.268 39.5578C283.894 38.9309 284.742 38.5782 285.627 38.5771H292.721C293.606 38.5771 294.455 38.9295 295.081 39.5567C295.707 40.1839 296.059 41.0346 296.059 41.9216C296.059 42.8087 295.707 43.6593 295.081 44.2866C294.455 44.9138 293.606 45.2661 292.721 45.2661H285.627C284.742 45.2651 283.894 44.9124 283.268 44.2854C282.642 43.6584 282.29 42.8083 282.289 41.9216Z" fill="#CCCCCC"/>
<path d="M226.456 158.098H278.38C280.26 158.096 282.064 157.346 283.393 156.014C284.723 154.682 285.471 152.875 285.473 150.991V68.6998C285.471 66.8156 284.723 65.0091 283.393 63.6767C282.064 62.3444 280.26 61.5949 278.38 61.5928H195.438C193.557 61.5949 191.754 62.3444 190.424 63.6767C189.094 65.0091 188.346 66.8156 188.344 68.6998V89.096H189.179V68.6998C189.18 67.0372 189.84 65.4433 191.014 64.2677C192.187 63.0921 193.778 62.4308 195.438 62.4289H278.38C280.039 62.4308 281.63 63.0921 282.804 64.2677C283.977 65.4433 284.637 67.0372 284.639 68.6998V150.991C284.637 152.654 283.977 154.248 282.804 155.423C281.63 156.599 280.039 157.26 278.38 157.262H226.456V158.098Z" fill="#CCCCCC"/>
<path d="M285.056 108.835H322.906C324.787 108.833 326.59 108.084 327.92 106.752C329.25 105.419 329.998 103.613 330 101.728V34.8141C329.998 32.9298 329.25 31.1233 327.92 29.791C326.59 28.4586 324.787 27.7092 322.906 27.707H255.442C253.561 27.7092 251.758 28.4586 250.428 29.791C249.098 31.1233 248.35 32.9298 248.348 34.8141V62.0109H249.183V34.8141C249.185 33.1515 249.845 31.5576 251.018 30.3819C252.191 29.2063 253.782 28.545 255.442 28.5432H322.906C324.566 28.545 326.157 29.2063 327.33 30.3819C328.504 31.5576 329.164 33.1515 329.166 34.8141V101.728C329.164 103.391 328.504 104.985 327.33 106.161C326.157 107.336 324.566 107.997 322.906 107.999H285.056V108.835Z" fill="#CCCCCC"/>
<path d="M219.602 88.958H119.558C117.678 88.9618 115.876 89.7117 114.546 91.0437C113.217 92.3758 112.468 94.1813 112.464 96.0651V195.35C112.466 197.235 113.214 199.041 114.544 200.374C115.874 201.706 117.677 202.456 119.558 202.458H219.602C221.483 202.456 223.286 201.706 224.616 200.374C225.946 199.041 226.694 197.235 226.696 195.35V96.0651C226.694 94.1808 225.946 92.3742 224.616 91.0418C223.286 89.7094 221.483 88.96 219.602 88.958ZM225.861 195.35C225.859 197.013 225.199 198.607 224.026 199.782C222.853 200.958 221.262 201.619 219.602 201.621H119.558C117.899 201.619 116.308 200.958 115.134 199.782C113.961 198.607 113.301 197.013 113.299 195.35V96.0651C113.301 94.4027 113.962 92.8091 115.135 91.6337C116.308 90.4582 117.899 89.7967 119.558 89.7941H219.602C221.262 89.7962 222.853 90.4575 224.026 91.6331C225.199 92.8087 225.859 94.4025 225.861 96.0651V195.35Z" fill="#16C62E"/>
<path d="M211.724 127.624H127.436C126.55 127.624 125.701 127.271 125.075 126.644C124.449 126.017 124.097 125.166 124.097 124.279C124.097 123.392 124.449 122.541 125.075 121.914C125.701 121.287 126.55 120.935 127.436 120.935H211.724C212.609 120.935 213.458 121.287 214.084 121.914C214.71 122.541 215.062 123.392 215.062 124.279C215.062 125.166 214.71 126.017 214.084 126.644C213.458 127.271 212.609 127.624 211.724 127.624Z" fill="#7319D5"/>
<path d="M187.731 113.41H151.428C150.543 113.41 149.694 113.057 149.068 112.43C148.442 111.803 148.09 110.952 148.09 110.065C148.09 109.178 148.442 108.327 149.068 107.7C149.694 107.073 150.543 106.721 151.428 106.721H187.731C188.616 106.721 189.465 107.073 190.091 107.7C190.717 108.327 191.069 109.178 191.069 110.065C191.069 110.952 190.717 111.803 190.091 112.43C189.465 113.057 188.616 113.41 187.731 113.41Z" fill="#7319D5"/>
<path d="M163.53 147.691H127.227C126.342 147.691 125.493 147.339 124.867 146.711C124.241 146.084 123.889 145.233 123.889 144.346C123.889 143.459 124.241 142.609 124.867 141.982C125.493 141.354 126.342 141.002 127.227 141.002H163.53C164.415 141.002 165.264 141.354 165.89 141.982C166.516 142.609 166.868 143.459 166.868 144.346C166.868 145.233 166.516 146.084 165.89 146.711C165.264 147.339 164.415 147.691 163.53 147.691Z" fill="#CCCCCC"/>
<path d="M163.53 162.323H127.227C126.342 162.323 125.493 161.97 124.867 161.343C124.241 160.716 123.889 159.865 123.889 158.978C123.889 158.091 124.241 157.241 124.867 156.613C125.493 155.986 126.342 155.634 127.227 155.634H163.53C164.415 155.634 165.264 155.986 165.89 156.613C166.516 157.241 166.868 158.091 166.868 158.978C166.868 159.865 166.516 160.716 165.89 161.343C165.264 161.97 164.415 162.323 163.53 162.323Z" fill="#CCCCCC"/>
<path d="M163.53 176.956H127.227C126.342 176.956 125.493 176.603 124.867 175.976C124.241 175.349 123.889 174.498 123.889 173.611C123.889 172.724 124.241 171.873 124.867 171.246C125.493 170.619 126.342 170.267 127.227 170.267H163.53C164.415 170.267 165.264 170.619 165.89 171.246C166.516 171.873 166.868 172.724 166.868 173.611C166.868 174.498 166.516 175.349 165.89 175.976C165.264 176.603 164.415 176.956 163.53 176.956Z" fill="#CCCCCC"/>
<path d="M208.806 150.558C212.246 150.558 215.035 147.763 215.035 144.316C215.035 140.87 212.246 138.075 208.806 138.075C205.365 138.075 202.576 140.87 202.576 144.316C202.576 147.763 205.365 150.558 208.806 150.558Z" fill="#16C62E"/>
<path d="M208.188 146.698C208.048 146.698 207.912 146.653 207.8 146.569L207.793 146.563L206.329 145.441C206.192 145.336 206.102 145.181 206.08 145.009C206.057 144.838 206.103 144.665 206.208 144.527C206.313 144.39 206.468 144.3 206.639 144.278C206.81 144.255 206.983 144.302 207.12 144.407L208.069 145.135L210.31 142.206C210.361 142.138 210.426 142.081 210.5 142.039C210.574 141.996 210.656 141.968 210.74 141.957C210.825 141.946 210.911 141.951 210.994 141.973C211.076 141.995 211.154 142.034 211.221 142.086L211.221 142.086L211.208 142.105L211.222 142.086C211.359 142.191 211.448 142.346 211.471 142.518C211.493 142.689 211.447 142.862 211.342 142.999L208.706 146.443C208.645 146.522 208.567 146.587 208.477 146.631C208.388 146.675 208.289 146.697 208.189 146.697L208.188 146.698Z" fill="white"/>
<path d="M50.1615 19.4019C48.2465 19.4019 46.3745 18.8329 44.7822 17.767C43.1899 16.701 41.9489 15.1859 41.216 13.4133C40.4832 11.6407 40.2915 9.69016 40.6651 7.80836C41.0387 5.92656 41.9609 4.19803 43.315 2.84133C44.6691 1.48463 46.3944 0.560712 48.2726 0.186402C50.1509 -0.187907 52.0977 0.00420448 53.867 0.738448C55.6362 1.47269 57.1484 2.71609 58.2124 4.3114C59.2763 5.90671 59.8442 7.78229 59.8442 9.70095C59.8412 12.2729 58.8202 14.7387 57.005 16.5573C55.1897 18.376 52.7286 19.399 50.1615 19.4019ZM50.1615 0.836128C48.4116 0.836138 46.7009 1.35606 45.2458 2.33015C43.7908 3.30423 42.6567 4.68873 41.9871 6.30857C41.3174 7.9284 41.1422 9.71082 41.4836 11.4304C41.825 13.15 42.6677 14.7296 43.9051 15.9693C45.1425 17.2091 46.7191 18.0534 48.4354 18.3954C50.1518 18.7375 51.9308 18.5619 53.5476 17.891C55.1644 17.22 56.5462 16.0838 57.5185 14.626C58.4907 13.1682 59.0096 11.4542 59.0096 9.70095C59.007 7.35066 58.0739 5.09739 56.4151 3.43549C54.7564 1.77359 52.5074 0.838773 50.1615 0.836128Z" fill="#CCCCCC"/>
<path d="M49.2435 13.2418C49.035 13.2421 48.8321 13.1746 48.6654 13.0493L48.655 13.0415L46.4776 11.3726C46.3767 11.2952 46.2921 11.1986 46.2285 11.0883C46.1649 10.9781 46.1236 10.8564 46.107 10.7302C46.0903 10.604 46.0987 10.4757 46.1315 10.3527C46.1643 10.2297 46.221 10.1144 46.2983 10.0134C46.3757 9.91234 46.4721 9.82754 46.5821 9.76384C46.6921 9.70013 46.8136 9.65876 46.9396 9.64209C47.0655 9.62542 47.1936 9.63377 47.3163 9.66667C47.4391 9.69957 47.5542 9.75637 47.655 9.83383L49.0654 10.9174L52.3983 6.56113C52.4756 6.46012 52.5719 6.37537 52.6819 6.31169C52.7919 6.24801 52.9133 6.20665 53.0392 6.18999C53.1652 6.17332 53.2931 6.18167 53.4159 6.21456C53.5386 6.24744 53.6536 6.30423 53.7544 6.38166L53.7547 6.38187L53.734 6.41065L53.7552 6.38187C53.9586 6.53847 54.0917 6.76951 54.1252 7.02429C54.1588 7.27906 54.09 7.53677 53.9342 7.74084L50.014 12.8625C49.9233 12.9805 49.8067 13.076 49.6732 13.1416C49.5398 13.2072 49.393 13.2411 49.2443 13.2406L49.2435 13.2418Z" fill="#CCCCCC"/>
<path d="M111.582 53.2652C109.667 53.2652 107.795 52.6962 106.202 51.6302C104.61 50.5643 103.369 49.0492 102.636 47.2766C101.903 45.5039 101.712 43.5534 102.085 41.6716C102.459 39.7898 103.381 38.0613 104.735 36.7046C106.089 35.3479 107.815 34.424 109.693 34.0497C111.571 33.6754 113.518 33.8675 115.287 34.6017C117.056 35.336 118.569 36.5794 119.633 38.1747C120.696 39.77 121.264 41.6456 121.264 43.5642C121.261 46.1362 120.24 48.602 118.425 50.4207C116.61 52.2393 114.149 53.2623 111.582 53.2652ZM111.582 34.6994C109.832 34.6994 108.121 35.2194 106.666 36.1935C105.211 37.1675 104.077 38.552 103.407 40.1719C102.738 41.7917 102.562 43.5741 102.904 45.2937C103.245 47.0133 104.088 48.5929 105.325 49.8326C106.563 51.0724 108.139 51.9167 109.856 52.2587C111.572 52.6008 113.351 52.4252 114.968 51.7543C116.585 51.0833 117.966 49.9471 118.939 48.4893C119.911 47.0314 120.43 45.3175 120.43 43.5642C120.427 41.2139 119.494 38.9607 117.835 37.2988C116.177 35.6368 113.927 34.702 111.582 34.6994Z" fill="#CCCCCC"/>
<path d="M110.664 47.1051C110.455 47.1054 110.252 47.0379 110.086 46.9126L110.075 46.9048L107.898 45.2359C107.694 45.0795 107.561 44.8484 107.527 44.5935C107.494 44.3386 107.562 44.0807 107.719 43.8767C107.875 43.6726 108.105 43.539 108.36 43.5054C108.614 43.4717 108.872 43.5407 109.075 43.6971L110.486 44.7807L113.818 40.4244C113.896 40.3234 113.992 40.2386 114.102 40.175C114.212 40.1113 114.333 40.0699 114.459 40.0533C114.585 40.0366 114.713 40.045 114.836 40.0778C114.959 40.1107 115.074 40.1675 115.175 40.2449L115.175 40.2452L115.154 40.2739L115.175 40.2452C115.379 40.4018 115.512 40.6328 115.545 40.8876C115.579 41.1423 115.51 41.4 115.354 41.6041L111.434 46.7258C111.343 46.8438 111.227 46.9393 111.093 47.0049C110.96 47.0705 110.813 47.1043 110.665 47.1039L110.664 47.1051Z" fill="#CCCCCC"/>
<path d="M208.806 165.191C212.246 165.191 215.035 162.396 215.035 158.949C215.035 155.502 212.246 152.708 208.806 152.708C205.365 152.708 202.576 155.502 202.576 158.949C202.576 162.396 205.365 165.191 208.806 165.191Z" fill="#16C62E"/>
<path d="M208.188 161.33C208.048 161.33 207.912 161.285 207.8 161.2L207.793 161.195L206.329 160.073C206.261 160.021 206.204 159.956 206.161 159.882C206.119 159.808 206.091 159.726 206.08 159.641C206.068 159.556 206.074 159.47 206.096 159.387C206.118 159.305 206.156 159.227 206.208 159.159C206.26 159.091 206.325 159.034 206.399 158.991C206.473 158.949 206.555 158.921 206.639 158.91C206.724 158.898 206.81 158.904 206.893 158.926C206.975 158.948 207.053 158.986 207.12 159.039L208.069 159.767L210.31 156.838C210.361 156.77 210.426 156.713 210.5 156.67C210.574 156.628 210.656 156.6 210.74 156.589C210.825 156.577 210.911 156.583 210.994 156.605C211.076 156.627 211.154 156.665 211.221 156.717L211.221 156.718L211.208 156.737L211.222 156.718C211.359 156.823 211.448 156.978 211.471 157.15C211.493 157.321 211.447 157.494 211.342 157.631L208.706 161.075C208.645 161.154 208.567 161.218 208.477 161.262C208.388 161.307 208.289 161.329 208.189 161.329L208.188 161.33Z" fill="white"/>
<path d="M208.806 179.852C212.246 179.852 215.035 177.057 215.035 173.61C215.035 170.163 212.246 167.369 208.806 167.369C205.365 167.369 202.576 170.163 202.576 173.61C202.576 177.057 205.365 179.852 208.806 179.852Z" fill="#16C62E"/>
<path d="M208.188 175.992C208.048 175.992 207.912 175.947 207.8 175.863L207.793 175.857L206.329 174.735C206.192 174.63 206.103 174.475 206.08 174.303C206.058 174.132 206.104 173.959 206.209 173.822C206.314 173.685 206.469 173.595 206.64 173.572C206.81 173.549 206.983 173.596 207.12 173.701L208.069 174.429L210.309 171.5C210.361 171.432 210.426 171.375 210.5 171.333C210.574 171.29 210.656 171.262 210.74 171.251C210.825 171.24 210.911 171.245 210.994 171.267C211.076 171.289 211.153 171.328 211.221 171.38L211.221 171.38L211.207 171.399L211.222 171.38C211.359 171.485 211.448 171.64 211.471 171.812C211.493 171.983 211.447 172.156 211.342 172.293L208.706 175.737C208.645 175.816 208.567 175.881 208.477 175.925C208.388 175.969 208.289 175.991 208.189 175.991L208.188 175.992Z" fill="white"/>
<path d="M169.589 80.439C163.017 80.3267 160.031 75.3312 160.031 70.7372C160.032 66.1433 163.018 61.1484 169.575 61.0371H169.589C176.147 61.1492 179.134 66.1447 179.133 70.7387C179.133 75.3326 176.146 80.3277 169.589 80.439ZM169.582 61.8732C163.594 61.9782 160.866 66.5409 160.866 70.7372C160.865 74.9354 163.595 79.5004 169.589 79.6029C175.568 79.5012 178.299 74.9366 178.299 70.7387C178.299 66.5423 175.571 61.9796 169.582 61.8732Z" fill="#7319D5"/>
<path d="M171.755 71.2645C173.43 74.1799 168.833 75.3184 167.074 73.5623L167.514 72.619C170.374 75.094 172.894 70.8069 168.526 71.2143V70.1808C172.526 70.504 170.279 66.4699 167.614 68.8564L167.184 67.9133C169.356 65.6551 174.231 68.3857 170.789 70.6423C171.173 70.7323 171.514 70.952 171.755 71.2645Z" fill="#7319D5"/>
<path d="M228.417 53.2652C226.502 53.2652 224.63 52.6962 223.038 51.6302C221.446 50.5643 220.205 49.0492 219.472 47.2766C218.739 45.5039 218.547 43.5534 218.921 41.6716C219.295 39.7898 220.217 38.0613 221.571 36.7046C222.925 35.3479 224.65 34.424 226.529 34.0497C228.407 33.6754 230.354 33.8675 232.123 34.6017C233.892 35.336 235.404 36.5794 236.468 38.1747C237.532 39.77 238.1 41.6456 238.1 43.5642C238.097 46.1362 237.076 48.602 235.261 50.4207C233.446 52.2393 230.984 53.2623 228.417 53.2652ZM228.417 34.6994C226.667 34.6994 224.957 35.2194 223.502 36.1935C222.047 37.1675 220.913 38.552 220.243 40.1719C219.573 41.7917 219.398 43.5741 219.739 45.2937C220.081 47.0133 220.924 48.5929 222.161 49.8326C223.398 51.0724 224.975 51.9167 226.691 52.2587C228.408 52.6008 230.187 52.4252 231.803 51.7543C233.42 51.0833 234.802 49.9471 235.774 48.4893C236.747 47.0314 237.265 45.3175 237.265 43.5642C237.263 41.2139 236.33 38.9607 234.671 37.2988C233.012 35.6368 230.763 34.702 228.417 34.6994Z" fill="#CCCCCC"/>
<path d="M231.106 45.7413H230.095V47.136H228.833V45.7413H225.729V44.7781L229.063 39.9922H230.095V44.728H231.106V45.7413ZM228.833 44.728V42.0088L226.95 44.728H228.833Z" fill="#CCCCCC"/>
<path d="M289.174 19.4019C287.259 19.4019 285.387 18.8329 283.795 17.7669C282.202 16.701 280.961 15.1859 280.228 13.4133C279.496 11.6407 279.304 9.69012 279.678 7.80833C280.051 5.92653 280.973 4.198 282.327 2.84131C283.682 1.48462 285.407 0.560702 287.285 0.186397C289.163 -0.187907 291.11 0.00421071 292.879 0.738455C294.649 1.4727 296.161 2.7161 297.225 4.31141C298.289 5.90672 298.857 7.78229 298.857 9.70095C298.854 12.2729 297.833 14.7387 296.017 16.5574C294.202 18.376 291.741 19.399 289.174 19.4019ZM289.174 0.836129C287.424 0.83615 285.713 1.35608 284.258 2.33017C282.803 3.30426 281.669 4.68877 280.999 6.3086C280.33 7.92844 280.155 9.71086 280.496 11.4305C280.837 13.1501 281.68 14.7296 282.918 15.9694C284.155 17.2091 285.732 18.0534 287.448 18.3954C289.164 18.7375 290.943 18.5619 292.56 17.891C294.177 17.22 295.559 16.0838 296.531 14.626C297.503 13.1682 298.022 11.4542 298.022 9.70095C298.019 7.35065 297.086 5.09738 295.428 3.43548C293.769 1.77357 291.52 0.838763 289.174 0.836129Z" fill="#CCCCCC"/>
<path d="M290.616 8.95345C290.951 9.13904 291.226 9.41776 291.407 9.7561C291.599 10.1223 291.696 10.5313 291.688 10.945C291.696 11.3797 291.585 11.8085 291.367 12.1842C291.149 12.5466 290.828 12.8363 290.446 13.0169C290.011 13.2218 289.534 13.3231 289.054 13.3129C288.604 13.3125 288.157 13.2362 287.732 13.0871C287.338 12.9594 286.973 12.7529 286.66 12.4802L287.091 11.5369C287.65 11.9998 288.349 12.2613 289.074 12.2796C289.447 12.3052 289.815 12.1846 290.1 11.9434C290.331 11.6792 290.458 11.3395 290.456 10.9883C290.454 10.6371 290.324 10.2987 290.09 10.037C289.959 9.91552 289.806 9.82146 289.638 9.7603C289.47 9.69913 289.292 9.67211 289.114 9.6808C288.842 9.67903 288.573 9.73193 288.323 9.83635C288.076 9.94003 287.854 10.0957 287.672 10.2928H286.891V6.08887H291.357V7.09218H288.153V9.03857C288.532 8.78573 288.979 8.65614 289.434 8.66746C289.846 8.65878 290.254 8.75732 290.616 8.95345Z" fill="#CCCCCC"/>
<path d="M61.837 217.747C61.5837 217.187 61.456 216.579 61.4629 215.964C61.4698 215.35 61.6111 214.744 61.8768 214.19C62.1426 213.636 62.5263 213.147 63.001 212.758C63.4757 212.369 64.0298 212.089 64.6243 211.937L65.8893 197.052L71.9727 201.86L69.8389 215.258C70.0267 216.276 69.8355 217.327 69.3014 218.213C68.7674 219.098 67.9276 219.757 66.9413 220.064C65.9549 220.37 64.8905 220.304 63.9498 219.877C63.009 219.45 62.2573 218.692 61.8369 217.747H61.837Z" fill="#FFB8B8"/>
<path d="M65.7496 210.376C65.3118 210.318 64.9085 210.107 64.6105 209.78C64.3126 209.454 64.1392 209.032 64.1207 208.59L63.4164 191.698C63.1633 185.626 64.3967 179.585 67.009 174.1L73.2546 160.988C73.673 160.199 74.2732 159.522 75.0052 159.012C75.7372 158.503 76.5801 158.175 77.4637 158.058C78.3214 157.936 79.1956 158.025 80.0118 158.315C80.8281 158.606 81.5622 159.089 82.1516 159.725C82.4507 160.045 82.7193 160.393 82.9541 160.763C83.4253 161.529 83.6981 162.4 83.7478 163.298C83.7975 164.197 83.6225 165.093 83.2387 165.907L73.6618 192.119L72.925 209.196C72.9138 209.455 72.8494 209.708 72.7358 209.941C72.6222 210.174 72.462 210.38 72.265 210.548C72.068 210.716 71.8386 210.841 71.5911 210.916C71.3437 210.99 71.0834 211.013 70.8267 210.983L65.7744 210.379L65.7496 210.376Z" fill="#7319D5"/>
<path d="M47.8318 284.182L52.5161 286.242L62.6757 269.12L55.7624 266.08L47.8318 284.182Z" fill="#FFB8B8"/>
<path d="M47.3082 282.125L56.5331 286.182L56.5335 286.182C57.3055 286.522 58.0032 287.01 58.5868 287.62C59.1703 288.229 59.6283 288.948 59.9346 289.735C60.2408 290.522 60.3894 291.362 60.3717 292.207C60.354 293.051 60.1705 293.884 59.8316 294.658L59.7477 294.849L44.6438 288.207L47.3082 282.125Z" fill="#2F2E41"/>
<path d="M110.719 289.88H115.835L118.268 270.11L110.718 270.111L110.719 289.88Z" fill="#FFB8B8"/>
<path d="M109.414 288.207L119.489 288.207H119.489C120.332 288.207 121.167 288.373 121.946 288.697C122.725 289.02 123.433 289.494 124.029 290.091C124.625 290.688 125.098 291.397 125.421 292.178C125.743 292.958 125.91 293.795 125.91 294.639V294.848L109.415 294.849L109.414 288.207Z" fill="#2F2E41"/>
<path d="M59.1939 284.259C58.9971 284.259 58.8016 284.228 58.6144 284.168L49.9404 281.374C49.4719 281.221 49.0819 280.891 48.8536 280.453C48.6254 280.016 48.5772 279.506 48.7192 279.033L77.4839 187.262L99.0295 183.029L99.1053 183.153C113.349 206.375 118.104 241.849 121.121 279.436C121.157 279.927 121.002 280.412 120.687 280.79C120.373 281.168 119.923 281.408 119.435 281.46L109.952 282.41C109.509 282.456 109.065 282.343 108.698 282.09C108.332 281.838 108.068 281.462 107.953 281.031L90.5897 219.49C90.5556 219.364 90.4834 219.252 90.3831 219.17C90.2828 219.087 90.1594 219.038 90.0299 219.029C89.9004 219.02 89.7712 219.051 89.6603 219.118C89.5494 219.186 89.4622 219.287 89.4108 219.406L60.9133 283.122C60.7694 283.459 60.5297 283.747 60.224 283.949C59.9184 284.151 59.5602 284.259 59.1939 284.259Z" fill="#2F2E41"/>
<path d="M88.6158 150.515C94.2759 150.515 98.8643 145.917 98.8643 140.247C98.8643 134.576 94.2759 129.979 88.6158 129.979C82.9556 129.979 78.3672 134.576 78.3672 140.247C78.3672 145.917 82.9556 150.515 88.6158 150.515Z" fill="#FFB8B8"/>
<path d="M75.6512 189.979L75.5809 189.832C75.5332 189.732 70.8114 179.696 71.2508 168.12C71.3963 164.321 72.9855 160.721 75.6932 158.056C78.4009 155.392 82.0225 153.865 85.8169 153.788C89.3139 153.719 92.7229 154.889 95.4434 157.092C98.1639 159.294 100.022 162.388 100.689 165.828C102.005 172.558 101.972 178.933 100.591 184.774L100.56 184.903L100.43 184.93L75.6512 189.979Z" fill="#7319D5"/>
<path d="M127.903 204.465C127.296 204.376 126.717 204.154 126.205 203.815C125.693 203.476 125.261 203.029 124.94 202.505C124.62 201.982 124.417 201.394 124.348 200.783C124.278 200.172 124.343 199.554 124.538 198.971L112.734 189.844L120.063 187.324L130.149 196.378C131.104 196.771 131.883 197.501 132.337 198.431C132.79 199.36 132.888 200.424 132.611 201.421C132.335 202.418 131.702 203.279 130.835 203.84C129.967 204.401 128.924 204.623 127.903 204.465H127.903Z" fill="#FFB8B8"/>
<path d="M98.9349 184.343L98.9076 184.299L86.4633 164.107C86.0282 163.328 85.785 162.456 85.7539 161.563C85.7228 160.671 85.9046 159.784 86.2843 158.976C86.6471 158.188 87.1947 157.499 87.8805 156.969C88.5663 156.439 89.3698 156.082 90.2227 155.93C90.6531 155.852 91.0898 155.814 91.5273 155.817C92.4251 155.834 93.3043 156.077 94.085 156.521C94.8656 156.966 95.5231 157.599 95.9977 158.363L112.804 180.626L126.733 190.495C126.944 190.644 127.122 190.836 127.256 191.058C127.39 191.279 127.476 191.526 127.51 191.783C127.544 192.04 127.525 192.301 127.454 192.55C127.382 192.799 127.261 193.03 127.096 193.23L123.853 197.158C123.57 197.504 123.172 197.736 122.733 197.814C122.293 197.892 121.84 197.809 121.456 197.582L98.9349 184.343Z" fill="#7319D5"/>
<path d="M86.783 139.61C87.5383 138.365 89.2052 138.013 90.6524 138.155C92.0996 138.297 93.5069 138.807 94.961 138.795C98.9986 138.764 102.115 133.834 100.418 130.163C99.0255 127.153 95.5486 125.831 92.4033 124.794C85.8087 122.619 78.2335 120.529 72.2493 124.056C70.3423 125.213 68.7782 126.859 67.7186 128.824C66.659 130.79 66.1424 133.003 66.2219 135.235C66.3565 138.011 67.4175 140.862 66.5202 143.491C65.485 146.525 62.2029 148.152 59.1011 148.939C53.6638 150.319 47.931 150.097 42.4597 151.335C36.9884 152.573 31.3818 155.86 29.9069 161.281C28.9382 164.843 29.9491 168.677 31.6231 171.965C33.331 175.32 35.7045 178.29 38.5982 180.694C41.4919 183.097 44.8449 184.884 48.4518 185.944C52.0587 187.004 55.8437 187.315 59.5748 186.858C63.3059 186.401 66.9047 185.186 70.1508 183.287C76.7652 179.418 81.5406 172.878 84.3876 165.753C86.0018 161.598 87.1381 157.271 87.7747 152.858C88.4124 148.726 87.8713 144.551 86.7164 140.534C86.6618 140.384 86.6395 140.224 86.651 140.065C86.6625 139.905 86.7074 139.75 86.783 139.61Z" fill="#2F2E41"/>
<path d="M159.397 295H0.41727C0.306603 295 0.200468 294.956 0.122215 294.878C0.0439619 294.799 0 294.693 0 294.582C0 294.471 0.0439619 294.365 0.122215 294.287C0.200468 294.208 0.306603 294.164 0.41727 294.164H159.397C159.508 294.164 159.614 294.208 159.692 294.287C159.77 294.365 159.814 294.471 159.814 294.582C159.814 294.693 159.77 294.799 159.692 294.878C159.614 294.956 159.508 295 159.397 295Z" fill="#3F3D56"/>
</g>
<defs>
<clipPath id="clip0">
<rect width="330" height="295" fill="white"/>
</clipPath>
</defs>
</svg>
