<svg width="80" height="80" viewBox="0 0 80 80" fill="none" xmlns="http://www.w3.org/2000/svg">
<path d="M30 10C32.4723 10 34.889 10.7331 36.9446 12.1066C39.0002 13.4801 40.6024 15.4324 41.5485 17.7165C42.4946 20.0005 42.7421 22.5139 42.2598 24.9386C41.7775 27.3634 40.587 29.5907 38.8388 31.3388C37.0907 33.087 34.8634 34.2775 32.4386 34.7598C30.0139 35.2421 27.5005 34.9946 25.2165 34.0485C22.9324 33.1024 20.9802 31.5002 19.6066 29.4446C18.2331 27.389 17.5 24.9723 17.5 22.5C17.5 19.1848 18.817 16.0054 21.1612 13.6612C23.5054 11.317 26.6848 10 30 10ZM30 5C26.5388 5 23.1554 6.02636 20.2775 7.94928C17.3997 9.87221 15.1566 12.6053 13.8321 15.803C12.5076 19.0007 12.161 22.5194 12.8363 25.9141C13.5115 29.3087 15.1782 32.4269 17.6256 34.8744C20.0731 37.3218 23.1913 38.9885 26.5859 39.6637C29.9806 40.339 33.4993 39.9924 36.697 38.6679C39.8947 37.3434 42.6278 35.1003 44.5507 32.2225C46.4737 29.3446 47.5 25.9612 47.5 22.5C47.5 17.8587 45.6563 13.4075 42.3744 10.1256C39.0925 6.84374 34.6413 5 30 5Z" fill="white"/>
<path d="M55 75H50V62.5C50 59.1848 48.683 56.0054 46.3388 53.6612C43.9946 51.317 40.8152 50 37.5 50H22.5C19.1848 50 16.0054 51.317 13.6612 53.6612C11.317 56.0054 10 59.1848 10 62.5V75H5V62.5C5 57.8587 6.84374 53.4075 10.1256 50.1256C13.4075 46.8437 17.8587 45 22.5 45H37.5C42.1413 45 46.5925 46.8437 49.8744 50.1256C53.1563 53.4075 55 57.8587 55 62.5V75Z" fill="white"/>
<path d="M62.5 40.4496L56.025 33.9746L52.5 37.4996L62.5 47.4996L80 29.9996L76.475 26.4746L62.5 40.4496Z" fill="white"/>
</svg>
