<svg width="22" height="22" viewBox="0 0 22 22" fill="none" xmlns="http://www.w3.org/2000/svg">
<path d="M11.7504 21.5C11.6554 21.5003 11.5612 21.4825 11.4729 21.4475C11.35 21.3986 11.2423 21.318 11.1606 21.2139C11.0789 21.1098 11.0262 20.986 11.0079 20.855L10.2579 15.605L11.7579 15.395L12.3204 19.3475L14.7504 17.39V11.75C14.7498 11.6513 14.7687 11.5535 14.806 11.4621C14.8433 11.3707 14.8983 11.2876 14.9679 11.2175L18.0204 8.16505C18.6493 7.54034 19.1482 6.7971 19.488 5.97833C19.8279 5.15957 20.002 4.28154 20.0004 3.39505V2.00005H18.6054C17.7189 1.99836 16.8408 2.17249 16.0221 2.51235C15.2033 2.85222 14.4601 3.35107 13.8354 3.98005L10.7829 7.03255C10.7128 7.10206 10.6297 7.15705 10.5383 7.19438C10.4469 7.2317 10.3491 7.25062 10.2504 7.25005H4.61035L2.65285 9.69505L6.60535 10.2575L6.39535 11.7575L1.14535 11.0075C1.01436 10.9892 0.890557 10.9365 0.7865 10.8548C0.682444 10.7732 0.601836 10.6654 0.552854 10.5425C0.503265 10.4188 0.487548 10.2841 0.507321 10.1523C0.527095 10.0205 0.581645 9.89628 0.665354 9.79255L3.66535 6.04255C3.73444 5.95278 3.82297 5.87983 3.92429 5.82917C4.02561 5.77851 4.13709 5.75146 4.25035 5.75005H9.94285L12.7704 2.91505C13.5347 2.14638 14.4441 1.5371 15.4457 1.12254C16.4474 0.707982 17.5213 0.496395 18.6054 0.500046H20.0004C20.3982 0.500046 20.7797 0.658082 21.061 0.939386C21.3423 1.22069 21.5004 1.60222 21.5004 2.00005V3.39505C21.504 4.47907 21.2924 5.55304 20.8779 6.55467C20.4633 7.5563 19.854 8.46567 19.0854 9.23005L16.2504 12.0575V17.75C16.2498 17.8627 16.2239 17.9738 16.1746 18.0751C16.1253 18.1763 16.0537 18.2652 15.9654 18.335L12.2154 21.335C12.0834 21.4409 11.9195 21.4991 11.7504 21.5Z" fill="#CCCCCC"/>
</svg>
