<svg width="174" height="64" viewBox="0 0 174 64" fill="none" xmlns="http://www.w3.org/2000/svg">
<path d="M18.381 37.0099C17.2312 37.0085 16.1288 36.5418 15.3158 35.7122C14.5028 34.8825 14.0454 33.7577 14.0441 32.5844V17.5346H22.6708V8.52442H14.0441V0H5.21408V8.52442H0V17.5346H5.21408V32.5844C5.21436 36.1477 6.60168 39.5649 9.0709 42.0845C11.5401 44.6041 14.889 46.0197 18.381 46.0199H22.6919V36.999L18.381 37.0099Z" fill="#7319D5"/>
<path d="M121.37 8.61156L121.194 11.6652C120.564 11.1471 119.901 10.6707 119.211 10.239C116.427 8.4967 113.46 7.61328 110.392 7.61328C106.688 7.61328 103.296 8.40917 100.311 9.97859C97.3083 11.5361 94.806 13.9389 93.1004 16.9025C91.3795 19.8696 90.5078 23.4026 90.5078 27.4035C90.5078 31.1673 91.346 34.5769 92.9986 37.5346C94.6017 40.4526 96.9647 42.8612 99.8262 44.494C102.668 46.1195 105.867 46.944 109.333 46.944C112.68 46.9619 115.972 46.0879 118.886 44.4084C119.551 44.027 120.197 43.6104 120.819 43.1605V46.279H129.707V8.61156H121.37ZM120.818 24.5376V28.8162C120.627 31.6864 119.6 33.876 117.59 35.7046C115.552 37.5582 113.118 38.4592 110.147 38.4592C108.265 38.4684 106.418 37.9484 104.807 36.9562C103.163 35.9553 101.799 34.5396 100.846 32.8452C99.8808 31.1416 99.3794 29.2057 99.3938 27.2379C99.3938 24.9896 99.8706 23.0019 100.811 21.3292C101.704 19.7126 103.018 18.3805 104.609 17.4812C106.282 16.5517 108.161 16.0761 110.065 16.1C112.604 16.0792 115.071 16.9661 117.036 18.6068C118.99 20.211 120.262 22.2058 120.818 24.5376Z" fill="#7319D5"/>
<path d="M164.747 8.61133L154.378 32.5784L143.657 8.61133H133.738L149.686 43.4039L141.75 61.9125H151.267L174.002 8.61133H164.747Z" fill="#7319D5"/>
<path d="M29.5227 58.8809V60.8578C29.5018 61.0603 29.56 61.263 29.6847 61.422C29.7467 61.4787 29.8191 61.5222 29.8977 61.55C29.9763 61.5778 30.0596 61.5893 30.1427 61.5839C30.2721 61.5843 30.4007 61.5624 30.523 61.5191V62.0152C30.3633 62.0649 30.1969 62.0888 30.0299 62.0862C29.8854 62.0949 29.7407 62.0735 29.6045 62.0235C29.4683 61.9734 29.3434 61.8957 29.2375 61.7951C29.136 61.6786 29.0584 61.5426 29.0094 61.3951C28.9604 61.2475 28.9408 61.0914 28.952 60.9361V58.88H28.2617V58.42H28.952V57.4926L29.5227 57.2842V58.4205H30.5371V58.8805L29.5227 58.8809Z" fill="#3A4852"/>
<path d="M33.2014 58.3786L33.1873 58.9113C33.0669 58.8709 32.9407 58.8514 32.8139 58.8536C32.6702 58.8424 32.526 58.8663 32.3931 58.9232C32.2603 58.9801 32.1425 59.0684 32.0497 59.1808C31.8797 59.4085 31.7914 59.6889 31.7995 59.975V62.0382H31.2283V59.4351C31.2303 59.0963 31.2114 58.7578 31.1719 58.4214H31.7142L31.7706 59.0901C31.8491 58.8598 32.0002 58.6626 32.2004 58.5294C32.4024 58.3985 32.6375 58.331 32.8767 58.3351C32.9864 58.3341 33.0957 58.3488 33.2014 58.3786Z" fill="#3A4852"/>
<path d="M36.8282 58.4214V62.0372H36.2646V61.3831C36.1663 61.6029 36.0023 61.7853 35.7962 61.9042C35.5733 62.0301 35.3217 62.0934 35.067 62.0876C34.775 62.0938 34.4876 62.0136 34.2393 61.8568C33.9981 61.6989 33.8072 61.4729 33.6898 61.2063C33.5614 60.8944 33.4955 60.5593 33.4961 60.221C33.4967 59.8827 33.5637 59.5479 33.6932 59.2365C33.8125 58.9661 34.0043 58.7356 34.2464 58.5716C34.4909 58.4113 34.7765 58.3288 35.067 58.3344C35.321 58.3283 35.5718 58.393 35.7926 58.5213C35.9977 58.6443 36.1621 58.8271 36.2646 59.0462V58.4207L36.8282 58.4214ZM35.9829 61.243C36.1672 60.9324 36.2646 60.5763 36.2646 60.2132C36.2646 59.8502 36.1672 59.494 35.9829 59.1834C35.8861 59.0633 35.763 58.9682 35.6234 58.9058C35.4839 58.8433 35.3319 58.8153 35.1797 58.8241C35.0252 58.8163 34.871 58.8458 34.7296 58.9101C34.5883 58.9744 34.4638 59.0717 34.3661 59.1943C34.1552 59.4935 34.0519 59.8579 34.0736 60.2258C34.0508 60.59 34.153 60.9509 34.3626 61.2466C34.4623 61.3671 34.5881 61.4622 34.73 61.5246C34.8719 61.587 35.0261 61.6148 35.1804 61.6059C35.3328 61.6145 35.4849 61.586 35.6244 61.5229C35.7639 61.4599 35.8868 61.3639 35.9829 61.243Z" fill="#3A4852"/>
<path d="M40.9792 59.7657V62.0373H40.4085V59.7947C40.4299 59.533 40.3601 59.272 40.2114 59.0577C40.1312 58.9746 40.0341 58.9106 39.927 58.8703C39.8198 58.8299 39.7052 58.8142 39.5914 58.8242C39.4461 58.8173 39.301 58.8412 39.1652 58.8943C39.0294 58.9475 38.9058 59.0288 38.8023 59.1331C38.701 59.2451 38.6226 59.3766 38.5718 59.5199C38.521 59.6632 38.4988 59.8154 38.5065 59.9676V62.0379H37.9353V59.4351C37.9373 59.0964 37.9185 58.7578 37.8789 58.4215H38.4225L38.4789 59.0685C38.5811 58.84 38.7512 58.6501 38.965 58.5257C39.1906 58.3962 39.4459 58.3304 39.7047 58.3352C40.5543 58.3352 40.9791 58.812 40.9792 59.7657Z" fill="#3A4852"/>
<path d="M41.8359 61.6201L42.0261 61.1889C42.2011 61.3323 42.3989 61.4442 42.6109 61.5195C42.8249 61.5893 43.0484 61.6233 43.273 61.6201C43.485 61.6338 43.6963 61.5852 43.882 61.48C43.9486 61.437 44.0029 61.3767 44.0394 61.3054C44.0758 61.2341 44.0932 61.1542 44.0898 61.0738C44.0924 61.0093 44.0812 60.945 44.0569 60.8854C44.0326 60.8258 43.9957 60.7723 43.949 60.7288C43.8127 60.6233 43.6529 60.5541 43.4839 60.5275L42.8852 60.3837C42.6262 60.3363 42.387 60.2112 42.1982 60.0243C42.1194 59.9429 42.0573 59.8463 42.0155 59.7402C41.9737 59.634 41.953 59.5204 41.9546 59.4061C41.9517 59.2562 41.9841 59.1077 42.049 58.9733C42.114 58.8388 42.2096 58.7221 42.3278 58.6332C42.614 58.4225 42.9618 58.3174 43.3142 58.3349C43.5542 58.3334 43.7926 58.3748 44.0186 58.4572C44.2275 58.5311 44.4176 58.6514 44.5754 58.8095L44.3852 59.2335C44.0897 58.9657 43.7096 58.8152 43.3144 58.8095C43.1082 58.7969 42.9031 58.8482 42.7261 58.9569C42.6596 59.0017 42.6056 59.0633 42.5692 59.1357C42.5328 59.208 42.5152 59.2887 42.5182 59.37C42.5149 59.4347 42.5248 59.4995 42.5472 59.5601C42.5696 59.6207 42.6041 59.6759 42.6485 59.7223C42.7688 59.8254 42.9133 59.8948 43.0679 59.9236L43.6666 60.0745C43.938 60.1222 44.1914 60.2451 44.3991 60.4296C44.4793 60.512 44.542 60.6104 44.5832 60.7186C44.6245 60.8268 44.6434 60.9425 44.6387 61.0585C44.6422 61.205 44.6099 61.35 44.5447 61.4805C44.4795 61.6111 44.3835 61.723 44.2653 61.8062C43.9653 62.0081 43.6097 62.1063 43.2509 62.0866C42.7389 62.1152 42.2347 61.949 41.8359 61.6201Z" fill="#3A4852"/>
<path d="M46.4694 57.3827C46.3478 57.5404 46.2909 57.7401 46.3109 57.9398V58.4213H47.1774V58.8814H46.3109V62.0372H45.7402V58.8814H45.0508V58.4213H45.741V57.8677C45.7186 57.5551 45.8187 57.2462 46.0194 57.0089C46.1226 56.9083 46.245 56.8305 46.3789 56.7804C46.5129 56.7303 46.6555 56.709 46.7979 56.7177C46.9597 56.7174 47.1208 56.7391 47.2769 56.7824V57.2777C47.1581 57.2413 47.0348 57.222 46.9107 57.2202C46.8302 57.2154 46.7495 57.2273 46.6737 57.2552C46.5978 57.2831 46.5283 57.3265 46.4694 57.3827Z" fill="#3A4852"/>
<path d="M48.4718 61.8574C48.2171 61.703 48.0125 61.4755 47.8835 61.2033C47.7466 60.8912 47.6758 60.5532 47.6758 60.2112C47.6758 59.8693 47.7466 59.5312 47.8835 59.2192C48.0126 58.947 48.2171 58.7196 48.4718 58.5651C48.7417 58.4141 49.0446 58.335 49.3524 58.335C49.6602 58.335 49.963 58.4141 50.2329 58.5651C50.4876 58.7196 50.6921 58.947 50.8212 59.2192C50.9583 59.5312 51.0291 59.8693 51.0291 60.2112C51.0291 60.5532 50.9583 60.8913 50.8212 61.2033C50.6923 61.4755 50.4877 61.703 50.2329 61.8574C49.963 62.0084 49.6602 62.0875 49.3524 62.0875C49.0446 62.0875 48.7417 62.0084 48.4718 61.8574ZM50.1626 61.25C50.3698 60.9467 50.4692 60.5802 50.4443 60.2113C50.4668 59.846 50.3647 59.4841 50.1555 59.1868C50.0531 59.0725 49.9285 58.9812 49.7896 58.9187C49.6508 58.8562 49.5007 58.8239 49.3489 58.8239C49.1971 58.8239 49.047 58.8562 48.9081 58.9187C48.7692 58.9812 48.6447 59.0725 48.5423 59.1868C48.333 59.4841 48.2309 59.846 48.2533 60.2113C48.2282 60.5808 48.3291 60.9477 48.5388 61.25C48.6434 61.3624 48.7693 61.4519 48.9089 61.5131C49.0485 61.5743 49.1988 61.6058 49.3507 61.6058C49.5026 61.6058 49.6529 61.5743 49.7925 61.5131C49.9321 61.4519 50.058 61.3624 50.1626 61.25Z" fill="#3A4852"/>
<path d="M53.8884 58.3786L53.8743 58.9113C53.7539 58.8709 53.6276 58.8514 53.5009 58.8536C53.3572 58.8424 53.2129 58.8663 53.08 58.9232C52.9471 58.9801 52.8294 59.0684 52.7365 59.1808C52.5666 59.4086 52.4784 59.6889 52.4865 59.975V62.0382H51.9159V59.4351C51.9179 59.0963 51.899 58.7578 51.8594 58.4214H52.4019L52.4583 59.0901C52.5366 58.8597 52.6878 58.6625 52.8881 58.5294C53.09 58.3985 53.3251 58.331 53.5642 58.3351C53.6737 58.3342 53.7828 58.3488 53.8884 58.3786Z" fill="#3A4852"/>
<path d="M59.5747 59.7654V62.037H59.0041V59.7944C59.0248 59.5351 58.9644 59.2758 58.8315 59.0538C58.7627 58.9729 58.6761 58.9098 58.5787 58.8698C58.4813 58.8298 58.3759 58.8141 58.2714 58.8239C58.1387 58.817 58.0061 58.8412 57.884 58.8948C57.7619 58.9484 57.6535 59.0298 57.567 59.1328C57.3869 59.3733 57.2969 59.6716 57.3133 59.9739V62.037H56.7421V59.7944C56.7621 59.5358 56.7004 59.2775 56.5658 59.0573C56.4968 58.9756 56.4097 58.9118 56.3117 58.8712C56.2138 58.8306 56.1078 58.8144 56.0024 58.8239C55.8692 58.8172 55.7361 58.8415 55.6134 58.8951C55.4908 58.9486 55.3816 59.0299 55.2942 59.1328C55.1121 59.3724 55.0208 59.6711 55.0373 59.9739V62.037H54.4665V59.4348C54.4685 59.0961 54.4497 58.7575 54.4102 58.4212H54.9527L55.0091 59.0538C55.0986 58.8343 55.2523 58.6483 55.4493 58.5211C55.6537 58.3938 55.8896 58.3289 56.1291 58.3342C56.3706 58.3237 56.6101 58.3836 56.8195 58.5068C57.0067 58.6333 57.1458 58.8212 57.214 59.0394C57.3208 58.8248 57.4859 58.646 57.6895 58.5245C57.904 58.396 58.1489 58.3301 58.3975 58.334C59.1824 58.3346 59.5748 58.8117 59.5747 59.7654Z" fill="#3A4852"/>
<path d="M60.6055 56.8906H61.303V57.5518H60.6056L60.6055 56.8906ZM60.6618 62.0375V58.4217H61.2324V62.0375H60.6618Z" fill="#3A4852"/>
<path d="M65.3809 59.7657V62.0373H64.8103V59.7947C64.8317 59.533 64.7619 59.2719 64.613 59.0577C64.5329 58.9746 64.4358 58.9106 64.3286 58.8702C64.2215 58.8299 64.1069 58.8141 63.9931 58.8242C63.8478 58.8173 63.7027 58.8412 63.5669 58.8943C63.4311 58.9475 63.3076 59.0288 63.2042 59.1331C63.1028 59.245 63.0244 59.3765 62.9736 59.5199C62.9228 59.6632 62.9006 59.8154 62.9083 59.9676V62.0379H62.3376V59.4351C62.3396 59.0964 62.3208 58.7578 62.2812 58.4215H62.8236L62.88 59.0685C62.9823 58.8401 63.1524 58.6502 63.3661 58.5257C63.5917 58.3962 63.847 58.3304 64.1058 58.3352C64.9559 58.3352 65.3809 58.812 65.3809 59.7657Z" fill="#3A4852"/>
<path d="M69.6133 58.4217V62.0082C69.6133 62.5449 69.4783 62.9511 69.2083 63.2267C68.9382 63.5024 68.5402 63.6402 68.0143 63.6401C67.5239 63.6537 67.0399 63.524 66.6193 63.2663L66.718 62.7917C66.9189 62.9106 67.1329 63.0047 67.3555 63.0721C67.5701 63.1317 67.7918 63.1608 68.0143 63.1584C68.1551 63.1691 68.2966 63.1501 68.4299 63.1025C68.5633 63.0549 68.6855 62.9797 68.7891 62.8818C68.9782 62.6528 69.0719 62.3573 69.0501 62.0586V61.2037C68.9479 61.4269 68.7822 61.6135 68.5746 61.7392C68.3485 61.8708 68.0914 61.9366 67.8312 61.9297C67.5404 61.935 67.2539 61.8579 67.0035 61.7069C66.76 61.5568 66.5652 61.3367 66.4434 61.0743C66.3133 60.7781 66.2461 60.4571 66.2461 60.1326C66.2461 59.808 66.3133 59.487 66.4434 59.1908C66.5653 58.9285 66.76 58.7086 67.0035 58.5584C67.2539 58.4074 67.5404 58.3302 67.8312 58.3354C68.0886 58.3291 68.3429 58.3937 68.5674 58.5223C68.7741 58.6445 68.9398 58.8274 69.043 59.0472V58.4217H69.6133ZM68.7503 61.0922C68.9408 60.8099 69.0428 60.4753 69.0428 60.1326C69.0428 59.7898 68.9408 59.4552 68.7503 59.1729C68.6504 59.0565 68.5259 58.9646 68.3862 58.9042C68.2466 58.8439 68.0953 58.8166 67.9438 58.8244C67.7902 58.8166 67.6369 58.8438 67.4949 58.9041C67.3529 58.9644 67.2259 59.0562 67.123 59.1729C66.9282 59.4534 66.8236 59.7887 66.8236 60.1326C66.8236 60.4764 66.9282 60.8117 67.123 61.0922C67.2258 61.209 67.3528 61.3009 67.4948 61.3612C67.6368 61.4215 67.7902 61.4487 67.9438 61.4409C68.0953 61.4487 68.2466 61.4214 68.3863 61.361C68.5259 61.3006 68.6504 61.2087 68.7503 61.0922Z" fill="#3A4852"/>
<path d="M75.1432 58.5648C75.3864 58.7224 75.5798 58.9483 75.7 59.2154C75.8372 59.5232 75.9047 59.8586 75.8973 60.1967C75.9041 60.537 75.8367 60.8747 75.7 61.1852C75.5801 61.4563 75.387 61.687 75.1432 61.8501C74.8973 62.01 74.6106 62.0925 74.319 62.0873C74.065 62.0934 73.8141 62.0287 73.5934 61.9003C73.3867 61.7758 73.222 61.59 73.1213 61.3677V62.0362H72.5508V56.7451H73.1213V59.0599C73.2171 58.8337 73.3812 58.6448 73.5897 58.5206C73.8119 58.3925 74.0638 58.3279 74.319 58.3337C74.6097 58.3286 74.8958 58.4088 75.1432 58.5648ZM75.0164 61.2354C75.2255 60.9327 75.3274 60.5664 75.3052 60.1967C75.3273 59.8354 75.2265 59.4773 75.0198 59.1831C74.9165 59.0697 74.7915 58.9793 74.6524 58.9174C74.5133 58.8556 74.3632 58.8237 74.2115 58.8237C74.0598 58.8237 73.9097 58.8556 73.7707 58.9174C73.6316 58.9793 73.5065 59.0697 73.4032 59.1831C73.2188 59.4936 73.1213 59.8498 73.1213 60.2129C73.1213 60.576 73.2188 60.9321 73.4032 61.2427C73.5055 61.3576 73.6302 61.4493 73.7695 61.5118C73.9087 61.5744 74.0593 61.6063 74.2114 61.6056C74.3635 61.6049 74.5138 61.5716 74.6524 61.5078C74.7911 61.4441 74.9151 61.3512 75.0164 61.2354Z" fill="#3A4852"/>
<path d="M79.745 58.4209V62.0367H79.1882V61.4114C79.0835 61.6234 78.9191 61.7986 78.7162 61.9146C78.5069 62.0315 78.2715 62.091 78.0329 62.0872C77.8584 62.0998 77.6833 62.0742 77.5193 62.0123C77.3553 61.9503 77.2061 61.8533 77.0818 61.7278C76.8659 61.4881 76.7579 61.1334 76.7578 60.6637V58.4209H77.3284V60.6494C77.3077 60.9054 77.3777 61.1604 77.5257 61.3683C77.6028 61.4492 77.6964 61.5119 77.7999 61.5518C77.9034 61.5917 78.0143 61.6078 78.1246 61.5991C78.2659 61.605 78.4068 61.5802 78.538 61.5262C78.6691 61.4723 78.7875 61.3905 78.8853 61.2862C79.084 61.0614 79.1878 60.7657 79.1742 60.4633V58.4214L79.745 58.4209Z" fill="#3A4852"/>
<path d="M80.625 61.6201L80.8152 61.1888C80.9902 61.3323 81.188 61.4441 81.4 61.5194C81.6139 61.5893 81.8375 61.6233 82.0621 61.6201C82.274 61.6338 82.4854 61.5852 82.6711 61.48C82.7377 61.437 82.792 61.3767 82.8284 61.3054C82.8649 61.2341 82.8823 61.1542 82.8788 61.0738C82.8815 61.0093 82.8703 60.945 82.846 60.8854C82.8216 60.8258 82.7848 60.7723 82.7381 60.7288C82.6018 60.6233 82.442 60.5541 82.273 60.5275L81.6742 60.3837C81.4153 60.3363 81.1761 60.2112 80.9873 60.0243C80.9085 59.9429 80.8464 59.8463 80.8046 59.7401C80.7628 59.634 80.7421 59.5204 80.7437 59.4061C80.7408 59.2562 80.7731 59.1077 80.8381 58.9733C80.903 58.8388 80.9986 58.7221 81.1169 58.6332C81.4031 58.4225 81.7509 58.3174 82.1033 58.3349C82.3433 58.3334 82.5817 58.3748 82.8077 58.4572C83.0165 58.5311 83.2067 58.6514 83.3645 58.8095L83.1743 59.2335C82.8787 58.9657 82.4987 58.8152 82.1035 58.8095C81.8973 58.7969 81.6922 58.8482 81.5152 58.9569C81.4486 59.0016 81.3943 59.0632 81.3578 59.1355C81.3212 59.2079 81.3035 59.2887 81.3064 59.37C81.3031 59.4347 81.3129 59.4994 81.3354 59.5601C81.3578 59.6207 81.3923 59.6759 81.4367 59.7223C81.557 59.8254 81.7015 59.8948 81.8561 59.9236L82.4548 60.0745C82.7262 60.1222 82.9796 60.2451 83.1873 60.4296C83.2675 60.512 83.3302 60.6103 83.3715 60.7186C83.4127 60.8268 83.4316 60.9425 83.4269 61.0585C83.4304 61.205 83.3981 61.35 83.3329 61.4805C83.2677 61.6111 83.1717 61.723 83.0535 61.8062C82.7535 62.0081 82.3979 62.1063 82.0391 62.0865C81.5274 62.115 81.0236 61.9488 80.625 61.6201Z" fill="#3A4852"/>
<path d="M84.2812 56.8906H84.9786V57.5518H84.2812V56.8906ZM84.3376 62.0375V58.4217H84.9082V62.0375H84.3376Z" fill="#3A4852"/>
<path d="M89.0567 59.7657V62.0373H88.4861V59.7947C88.5075 59.5329 88.4376 59.2719 88.2888 59.0577C88.2087 58.9746 88.1116 58.9106 88.0044 58.8702C87.8972 58.8298 87.7827 58.8141 87.6689 58.8242C87.5236 58.8173 87.3785 58.8412 87.2427 58.8944C87.1069 58.9475 86.9834 59.0288 86.8799 59.1331C86.7786 59.245 86.7002 59.3765 86.6494 59.5198C86.5986 59.6632 86.5764 59.8154 86.5841 59.9676V62.0378H86.0134V59.4351C86.0154 59.0964 85.9966 58.7578 85.957 58.4215H86.4996L86.5558 59.0685C86.6581 58.8401 86.8282 58.6502 87.0419 58.5257C87.2675 58.3962 87.5228 58.3305 87.7816 58.3352C88.6318 58.3352 89.0568 58.812 89.0567 59.7657Z" fill="#3A4852"/>
<path d="M93.1023 60.2112H90.5028C90.4802 60.5858 90.5915 60.9561 90.816 61.2534C90.9302 61.3751 91.0693 61.4697 91.2233 61.5305C91.3772 61.5914 91.5424 61.617 91.7072 61.6057C92.1244 61.6043 92.5281 61.4542 92.8485 61.1815L93.0386 61.6057C92.8667 61.7644 92.6638 61.8844 92.4434 61.9579C92.2046 62.0437 91.9532 62.0874 91.7001 62.0873C91.4607 62.101 91.2212 62.0637 90.9969 61.9777C90.7725 61.8916 90.5681 61.7588 90.3968 61.5877C90.2336 61.4025 90.1078 61.1861 90.0268 60.9511C89.9458 60.7161 89.9111 60.467 89.9248 60.2183C89.9183 59.8787 89.9908 59.5424 90.1362 59.2369C90.2676 58.9626 90.4728 58.732 90.7278 58.572C90.9892 58.4118 91.2894 58.3296 91.5943 58.3348C91.8014 58.3241 92.0082 58.3609 92.1996 58.4424C92.391 58.5238 92.5621 58.648 92.7004 58.8057C92.9856 59.1733 93.1285 59.6351 93.1018 60.1032L93.1023 60.2112ZM90.8797 59.061C90.6812 59.2703 90.5561 59.5407 90.524 59.8301H92.5882C92.5813 59.5447 92.478 59.2704 92.2957 59.0537C92.2046 58.9625 92.0958 58.8916 91.9764 58.8458C91.8569 58.7999 91.7294 58.78 91.6019 58.7874C91.4698 58.7819 91.3379 58.8033 91.2139 58.8503C91.0899 58.8972 90.9763 58.9689 90.8797 59.061Z" fill="#3A4852"/>
<path d="M93.75 61.6201L93.9402 61.1888C94.1151 61.3323 94.3129 61.4441 94.5248 61.5194C94.7388 61.5892 94.9624 61.6232 95.187 61.6201C95.399 61.6338 95.6103 61.5852 95.796 61.48C95.8626 61.4369 95.9169 61.3767 95.9533 61.3053C95.9898 61.234 96.0072 61.1542 96.0038 61.0738C96.0065 61.0093 95.9952 60.9449 95.9709 60.8853C95.9465 60.8257 95.9097 60.7723 95.8629 60.7288C95.7267 60.6233 95.5669 60.5541 95.3979 60.5275L94.7992 60.3836C94.5402 60.3364 94.301 60.2112 94.1123 60.0243C94.0335 59.9429 93.9714 59.8463 93.9296 59.7401C93.8878 59.634 93.8671 59.5204 93.8687 59.4061C93.8658 59.2561 93.8982 59.1077 93.9632 58.9732C94.0281 58.8388 94.1238 58.7221 94.2421 58.6332C94.5282 58.4225 94.8759 58.3174 95.2283 58.3349C95.4683 58.3334 95.7068 58.3748 95.9328 58.4572C96.1417 58.531 96.3319 58.6514 96.4896 58.8095L96.2996 59.2335C96.004 58.9656 95.6239 58.8152 95.2286 58.8095C95.0225 58.7969 94.8174 58.8483 94.6403 58.9569C94.5739 59.0018 94.5199 59.0634 94.4836 59.1357C94.4472 59.2081 94.4296 59.2888 94.4326 59.37C94.4293 59.4347 94.4392 59.4994 94.4616 59.5601C94.484 59.6207 94.5185 59.6759 94.5629 59.7223C94.6831 59.8254 94.8276 59.8948 94.9821 59.9236L95.581 60.0745C95.8524 60.1222 96.1058 60.2451 96.3135 60.4296C96.3937 60.512 96.4564 60.6103 96.4976 60.7186C96.5389 60.8268 96.5578 60.9425 96.5531 61.0585C96.5565 61.205 96.5242 61.35 96.459 61.4805C96.3938 61.611 96.2979 61.7229 96.1797 61.8062C95.8797 62.008 95.5241 62.1063 95.1653 62.0865C94.6532 62.1153 94.1489 61.9491 93.75 61.6201Z" fill="#3A4852"/>
<path d="M97.2422 61.6201L97.4324 61.1888C97.6073 61.3323 97.8051 61.4441 98.017 61.5194C98.231 61.5892 98.4546 61.6232 98.6792 61.6201C98.8912 61.6338 99.1025 61.5852 99.2882 61.48C99.3548 61.4369 99.409 61.3767 99.4455 61.3053C99.482 61.234 99.4994 61.1542 99.496 61.0738C99.4987 61.0093 99.4874 60.9449 99.4631 60.8853C99.4387 60.8257 99.4019 60.7723 99.3551 60.7288C99.2189 60.6233 99.0591 60.5541 98.8901 60.5275L98.2914 60.3836C98.0324 60.3364 97.7932 60.2112 97.6044 60.0243C97.5257 59.9429 97.4636 59.8463 97.4218 59.7401C97.38 59.634 97.3593 59.5204 97.3609 59.4061C97.358 59.2561 97.3904 59.1077 97.4554 58.9732C97.5203 58.8387 97.616 58.7221 97.7343 58.6332C98.0204 58.4226 98.3681 58.3174 98.7205 58.3349C98.9605 58.3334 99.199 58.3748 99.425 58.4572C99.6339 58.531 99.8241 58.6514 99.9818 58.8095L99.7918 59.2335C99.4962 58.9656 99.1161 58.8151 98.7208 58.8095C98.5146 58.7969 98.3096 58.8482 98.1325 58.9569C98.0661 59.0018 98.0121 59.0634 97.9758 59.1357C97.9394 59.2081 97.9218 59.2888 97.9248 59.37C97.9215 59.4347 97.9313 59.4994 97.9538 59.5601C97.9762 59.6207 98.0107 59.6759 98.0551 59.7223C98.1753 59.8254 98.3198 59.8948 98.4743 59.9236L99.0732 60.0745C99.3446 60.1222 99.598 60.2451 99.8057 60.4296C99.8859 60.512 99.9486 60.6103 99.9898 60.7186C100.031 60.8268 100.05 60.9425 100.045 61.0585C100.049 61.205 100.016 61.35 99.9512 61.4805C99.886 61.611 99.79 61.7229 99.6719 61.8062C99.3722 62.0082 99.017 62.1068 98.6584 62.0874C98.1459 62.1161 97.6412 61.9496 97.2422 61.6201Z" fill="#3A4852"/>
<path d="M103.554 58.8809V60.8577C103.533 61.0602 103.591 61.263 103.716 61.422C103.778 61.4787 103.851 61.5222 103.929 61.55C104.008 61.5778 104.091 61.5893 104.174 61.5839C104.304 61.5842 104.432 61.5623 104.554 61.5191V62.0152C104.395 62.0649 104.228 62.0888 104.061 62.0862C103.917 62.0949 103.772 62.0735 103.636 62.0235C103.5 61.9734 103.375 61.8957 103.269 61.795C103.167 61.6786 103.09 61.5426 103.041 61.395C102.992 61.2475 102.972 61.0914 102.983 60.936V58.88H102.293V58.42H102.983V57.4926L103.554 57.2842V58.4205H104.569V58.8805L103.554 58.8809Z" fill="#3A4852"/>
<path d="M105.843 61.8574C105.588 61.7029 105.384 61.4755 105.255 61.2033C105.118 60.8913 105.047 60.5532 105.047 60.2112C105.047 59.8693 105.118 59.5312 105.255 59.2192C105.384 58.9471 105.588 58.7196 105.843 58.5651C106.113 58.4141 106.416 58.335 106.724 58.335C107.031 58.335 107.334 58.4141 107.604 58.5651C107.859 58.7196 108.063 58.947 108.192 59.2192C108.329 59.5312 108.4 59.8693 108.4 60.2112C108.4 60.5532 108.329 60.8912 108.192 61.2033C108.064 61.4755 107.859 61.703 107.604 61.8574C107.334 62.0084 107.031 62.0875 106.724 62.0875C106.416 62.0875 106.113 62.0084 105.843 61.8574ZM107.534 61.25C107.741 60.9467 107.84 60.5802 107.816 60.2113C107.838 59.8461 107.736 59.4841 107.527 59.1868C107.424 59.0725 107.3 58.9812 107.161 58.9187C107.022 58.8562 106.872 58.8239 106.72 58.8239C106.568 58.8239 106.418 58.8562 106.279 58.9187C106.14 58.9812 106.016 59.0725 105.913 59.1868C105.704 59.4841 105.602 59.846 105.625 60.2113C105.6 60.5807 105.7 60.9477 105.91 61.25C106.009 61.3694 106.135 61.4637 106.276 61.5253C106.417 61.5869 106.57 61.6142 106.724 61.6051C106.877 61.6145 107.029 61.5873 107.17 61.5256C107.311 61.464 107.435 61.3696 107.534 61.25Z" fill="#3A4852"/>
<path d="M112.445 58.4217V62.0082C112.445 62.5449 112.31 62.9511 112.04 63.2267C111.77 63.5024 111.372 63.6402 110.846 63.6401C110.356 63.6537 109.872 63.524 109.451 63.2663L109.55 62.7917C109.751 62.9106 109.965 63.0047 110.187 63.0721C110.402 63.1317 110.624 63.1608 110.846 63.1584C110.987 63.1691 111.128 63.15 111.262 63.1024C111.395 63.0548 111.517 62.9797 111.621 62.8818C111.81 62.6527 111.904 62.3573 111.882 62.0586V61.2037C111.78 61.427 111.614 61.6136 111.406 61.7392C111.18 61.8708 110.923 61.9367 110.663 61.9297C110.372 61.935 110.086 61.8579 109.836 61.7069C109.592 61.5568 109.397 61.3367 109.275 61.0743C109.145 60.7781 109.078 60.4571 109.078 60.1326C109.078 59.808 109.145 59.487 109.275 59.1908C109.397 58.9285 109.592 58.7086 109.836 58.5584C110.086 58.4074 110.372 58.3302 110.663 58.3354C110.921 58.3291 111.175 58.3937 111.399 58.5223C111.606 58.6445 111.772 58.8274 111.875 59.0472V58.4217H112.445ZM111.582 61.0922C111.773 60.8099 111.875 60.4753 111.875 60.1326C111.875 59.7898 111.773 59.4552 111.582 59.1729C111.482 59.0564 111.358 58.9646 111.218 58.9042C111.078 58.8439 110.927 58.8166 110.775 58.8244C110.622 58.8166 110.469 58.8438 110.327 58.9041C110.185 58.9644 110.058 59.0562 109.955 59.1729C109.76 59.4534 109.655 59.7888 109.655 60.1326C109.655 60.4763 109.76 60.8117 109.955 61.0922C110.058 61.2089 110.185 61.3008 110.327 61.3611C110.469 61.4215 110.622 61.4487 110.775 61.4409C110.927 61.4487 111.078 61.4214 111.218 61.361C111.358 61.3006 111.482 61.2087 111.582 61.0922Z" fill="#3A4852"/>
<path d="M116.508 60.2112H113.909C113.886 60.5858 113.998 60.9561 114.222 61.2534C114.336 61.3751 114.475 61.4697 114.629 61.5305C114.783 61.5914 114.949 61.617 115.113 61.6057C115.531 61.6043 115.934 61.4542 116.255 61.1815L116.445 61.6057C116.273 61.7644 116.07 61.8844 115.849 61.9579C115.611 62.0437 115.359 62.0874 115.106 62.0873C114.867 62.101 114.627 62.0637 114.403 61.9777C114.179 61.8916 113.974 61.7588 113.803 61.5877C113.64 61.4025 113.514 61.1861 113.433 60.9511C113.352 60.716 113.317 60.467 113.331 60.2183C113.325 59.8787 113.397 59.5424 113.542 59.2369C113.674 58.9626 113.879 58.732 114.134 58.572C114.395 58.4118 114.695 58.3296 115 58.3348C115.207 58.3241 115.414 58.3609 115.606 58.4424C115.797 58.5238 115.968 58.648 116.106 58.8057C116.392 59.1733 116.535 59.6351 116.508 60.1032L116.508 60.2112ZM114.286 59.061C114.087 59.2703 113.962 59.5407 113.93 59.8301H115.994C115.987 59.5447 115.884 59.2704 115.702 59.0537C115.611 58.9625 115.502 58.8917 115.383 58.8458C115.263 58.7999 115.135 58.78 115.008 58.7874C114.876 58.7819 114.744 58.8033 114.62 58.8503C114.496 58.8972 114.382 58.9689 114.286 59.061Z" fill="#3A4852"/>
<path d="M118.117 58.8809V60.8577C118.096 61.0602 118.154 61.263 118.279 61.422C118.341 61.4787 118.413 61.5222 118.492 61.55C118.57 61.5778 118.654 61.5893 118.737 61.5839C118.866 61.5842 118.995 61.5623 119.117 61.5191V62.0152C118.957 62.0649 118.791 62.0888 118.624 62.0862C118.479 62.0949 118.335 62.0735 118.198 62.0235C118.062 61.9734 117.937 61.8957 117.831 61.795C117.73 61.6786 117.652 61.5426 117.603 61.395C117.554 61.2475 117.535 61.0914 117.546 60.936V58.88H116.855V58.42H117.546V57.4926L118.117 57.2842V58.4205H119.131V58.8805L118.117 58.8809Z" fill="#3A4852"/>
<path d="M122.863 59.765V62.0366H122.293V59.7939C122.314 59.5322 122.244 59.2712 122.096 59.0569C122.015 58.9739 121.918 58.9099 121.811 58.8695C121.704 58.8292 121.589 58.8134 121.476 58.8234C121.33 58.8165 121.185 58.8404 121.049 58.8936C120.914 58.9467 120.79 59.0281 120.687 59.1324C120.585 59.2443 120.507 59.3758 120.456 59.5191C120.405 59.6624 120.383 59.8147 120.391 59.9669V62.0371H119.82V56.7461H120.391V59.0104C120.497 58.7963 120.666 58.6207 120.873 58.5072C121.094 58.3894 121.34 58.33 121.588 58.3346C122.438 58.3345 122.863 58.8113 122.863 59.765Z" fill="#3A4852"/>
<path d="M126.907 60.2112H124.307C124.285 60.5858 124.396 60.9561 124.621 61.2534C124.735 61.3751 124.874 61.4697 125.028 61.5305C125.182 61.5914 125.347 61.617 125.512 61.6057C125.929 61.6043 126.333 61.4542 126.653 61.1815L126.843 61.6057C126.671 61.7644 126.468 61.8845 126.248 61.9579C126.009 62.0437 125.758 62.0874 125.505 62.0873C125.265 62.101 125.026 62.0637 124.802 61.9777C124.577 61.8916 124.373 61.7588 124.202 61.5877C124.038 61.4025 123.913 61.1861 123.832 60.9511C123.75 60.7161 123.716 60.467 123.729 60.2183C123.723 59.8787 123.795 59.5424 123.941 59.2369C124.072 58.9626 124.277 58.732 124.532 58.572C124.794 58.4118 125.094 58.3296 125.399 58.3348C125.606 58.3241 125.813 58.3609 126.004 58.4424C126.196 58.5238 126.367 58.648 126.505 58.8057C126.79 59.1733 126.933 59.6351 126.907 60.1032L126.907 60.2112ZM124.684 59.061C124.486 59.2703 124.361 59.5407 124.329 59.8301H126.394C126.387 59.5447 126.284 59.2704 126.101 59.0537C126.01 58.9625 125.901 58.8916 125.782 58.8458C125.662 58.7999 125.535 58.78 125.408 58.7874C125.275 58.7818 125.143 58.8031 125.019 58.8501C124.895 58.897 124.781 58.9687 124.684 59.061Z" fill="#3A4852"/>
<path d="M129.748 58.3786L129.734 58.9113C129.613 58.8709 129.487 58.8514 129.36 58.8536C129.216 58.8424 129.072 58.8663 128.939 58.9232C128.806 58.9801 128.689 59.0684 128.596 59.1808C128.426 59.4085 128.338 59.6889 128.346 59.975V62.0382H127.775V59.4351C127.777 59.0963 127.758 58.7578 127.719 58.4214H128.261L128.317 59.0901C128.396 58.8598 128.547 58.6626 128.747 58.5294C128.949 58.3985 129.184 58.331 129.424 58.3351C129.533 58.3342 129.642 58.3488 129.748 58.3786Z" fill="#3A4852"/>
<path d="M77.691 8.67854V20.8818C77.6837 22.0506 77.2235 23.1691 76.4109 23.9929C75.5982 24.8168 74.4991 25.2792 73.3534 25.2792C72.2078 25.2792 71.1086 24.8168 70.296 23.9929C69.4833 23.1691 69.0231 22.0506 69.0159 20.8818V19.497C69.0159 16.3421 67.7875 13.3165 65.6009 11.0856C63.4144 8.85482 60.4488 7.60156 57.3565 7.60156C54.2643 7.60156 51.2987 8.85482 49.1121 11.0856C46.9255 13.3165 45.6972 16.3421 45.6972 19.497V32.5844C45.6972 33.758 45.2402 34.8836 44.4267 35.7135C43.6133 36.5434 42.5101 37.0097 41.3597 37.0097C40.2093 37.0097 39.1061 36.5434 38.2927 35.7135C37.4792 34.8836 37.0222 33.758 37.0222 32.5844V8.67854H28.1914V32.5835C28.1914 36.1467 29.5788 39.564 32.0484 42.0835C34.5179 44.6031 37.8674 46.0186 41.3599 46.0186C44.8524 46.0186 48.2018 44.6031 50.6714 42.0835C53.1409 39.564 54.5283 36.1467 54.5283 32.5835V19.4961C54.5283 18.7308 54.8263 17.9968 55.3567 17.4556C55.8872 16.9145 56.6066 16.6105 57.3567 16.6105C58.1068 16.6105 58.8262 16.9145 59.3566 17.4556C59.887 17.9968 60.185 18.7308 60.185 19.4961V20.8809C60.1845 24.2844 61.4502 27.5612 63.7264 30.0493C66.0025 32.5375 69.1195 34.0514 72.4476 34.2853C75.7757 34.5192 79.0667 33.4556 81.6557 31.3094C84.2448 29.1631 85.9389 26.0943 86.3958 22.7229C86.4787 22.1125 86.5208 21.4971 86.5218 20.8809V8.67854H77.691Z" fill="#7319D5"/>
</svg>
