<svg width="24" height="24" viewBox="0 0 24 24" fill="none" xmlns="http://www.w3.org/2000/svg">
<path d="M20.25 21V4.5H14.25V21H11.25V10.5H5.25V21H3V1.5H1.5V21C1.5 21.3978 1.65804 21.7794 1.93934 22.0607C2.22064 22.342 2.60218 22.5 3 22.5H22.5V21H20.25ZM9.75 21H6.75V12H9.75V21ZM18.75 21H15.75V6H18.75V21Z" fill="#CCCCCC"/>
</svg>
