<svg width="48" height="48" viewBox="0 0 48 48" fill="none" xmlns="http://www.w3.org/2000/svg">
<path d="M36 6V40.125L25.35 34.74L24 34.065L22.65 34.74L12 40.125V6H36ZM36 3H12C11.2044 3 10.4413 3.31607 9.87868 3.87868C9.31607 4.44129 9 5.20435 9 6V45L24 37.5L39 45V6C39 5.20435 38.6839 4.44129 38.1213 3.87868C37.5587 3.31607 36.7956 3 36 3Z" fill="#7319D5"/>
</svg>
