<svg width="16" height="16" viewBox="0 0 16 16" fill="none" xmlns="http://www.w3.org/2000/svg">
<path d="M10.8939 0.227419H10.901L10.9301 0.255431L14.2717 3.47744C14.2718 3.47752 14.2719 3.4776 14.272 3.47769C14.3437 3.54633 14.384 3.64141 14.384 3.74042V15.3978C14.384 15.5997 14.2201 15.7631 14.0187 15.7631H2.015C1.81336 15.7631 1.65 15.5996 1.65 15.3978V0.514752C1.65 0.31319 1.81344 0.149752 2.015 0.149752H10.673C10.7219 0.149752 10.7686 0.159976 10.8112 0.177406C10.8114 0.177464 10.8115 0.177521 10.8116 0.177578L10.7737 0.270085C10.7851 0.274652 10.7946 0.28172 10.8042 0.288828C10.8086 0.292096 10.813 0.295373 10.8177 0.298418L10.8939 0.227419ZM10.308 3.74042V0.879752H2.38V15.0331H13.6537V4.10542H10.673C10.4714 4.10542 10.308 3.94198 10.308 3.74042ZM11.038 3.37542H13.1142L11.038 1.37374V3.37542Z" fill="white" stroke="white" stroke-width="0.2"/>
<path d="M6.20941 9.15796L6.20937 9.15791C6.09602 8.99179 5.86922 8.94812 5.70213 9.06197M6.20941 9.15796L6.84244 10.6473C6.79244 10.6969 6.7251 10.7246 6.6551 10.7246C6.6471 10.7246 6.63877 10.7246 6.63044 10.7236L6.62116 10.8232C6.62076 10.8231 6.62036 10.8231 6.61997 10.8231C6.51221 10.8127 6.41444 10.755 6.35349 10.6656L6.35347 10.6656L5.6062 9.56935L5.68877 9.51294L5.60614 9.56927L5.60616 9.5693C5.49234 9.40263 5.5355 9.17539 5.70213 9.06197M6.20941 9.15796L6.70842 9.8902L6.20941 9.15796ZM5.70213 9.06197L5.75844 9.14461L5.70218 9.06193C5.70216 9.06195 5.70215 9.06196 5.70213 9.06197Z" fill="white" stroke="white" stroke-width="0.2"/>
</svg>
