<svg width="24" height="20" viewBox="0 0 24 20" fill="none" xmlns="http://www.w3.org/2000/svg">
<path d="M12.4575 0.657642C12.3251 0.553011 12.1613 0.496094 11.9925 0.496094C11.8237 0.496094 11.6599 0.553011 11.5275 0.657642L0.75 9.06514L1.68 10.2501L3 9.21514V18.5001C3 18.898 3.15804 19.2795 3.43934 19.5608C3.72064 19.8421 4.10218 20.0001 4.5 20.0001H19.5C19.8978 20.0001 20.2794 19.8421 20.5607 19.5608C20.842 19.2795 21 18.898 21 18.5001V9.22264L22.32 10.2501L23.25 9.07264L12.4575 0.657642ZM13.5 18.5001H10.5V12.5001H13.5V18.5001ZM15 18.5001V12.5001C15 12.1023 14.842 11.7208 14.5607 11.4395C14.2794 11.1582 13.8978 11.0001 13.5 11.0001H10.5C10.1022 11.0001 9.72064 11.1582 9.43934 11.4395C9.15804 11.7208 9 12.1023 9 12.5001V18.5001H4.5V8.04514L12 2.20264L19.5 8.05264V18.5001H15Z" fill="#CCCCCC"/>
</svg>
