<svg width="96" height="96" viewBox="0 0 96 96" fill="none" xmlns="http://www.w3.org/2000/svg">
<g clip-path="url(#clip0)">
<path d="M7.33058 20.719C9.75233 18.0768 12.2903 15.6991 15.0846 13.4917C15.4133 13.2322 15.8864 13.5429 15.7763 13.9469C14.2101 19.7037 11.4736 25.3928 7.25483 29.6221C7.06546 26.6613 7.06264 23.6757 7.33058 20.719Z" fill="#CCCCCC"/>
<path d="M7.25536 29.6248C4.81974 26.6855 2.72687 23.6467 0.840806 20.3659C0.625182 19.9907 0.05162 20.1245 0.0296826 20.5567C-0.310442 27.2773 2.25737 35.1408 8.51329 38.3124C7.88986 35.4543 7.44061 32.546 7.25536 29.6248Z" fill="#CCCCCC"/>
<path d="M8.5127 38.3102C10.0455 35.1565 11.7613 32.2221 13.7722 29.3777C14.0109 29.0402 14.5459 29.1949 14.5633 29.6078C14.8084 35.4132 13.8122 41.55 11.0304 46.6461C9.99957 43.9337 9.12957 41.1477 8.5127 38.3102Z" fill="#CCCCCC"/>
<path d="M11.0314 46.6484C7.86882 44.6159 4.97964 42.3933 2.20839 39.8971C1.88871 39.6091 1.38715 39.9098 1.49552 40.3261C3.16502 46.7453 7.93932 53.3328 14.7367 54.4962C13.3238 51.9728 12.0579 49.354 11.0314 46.6484Z" fill="#CCCCCC"/>
<path d="M14.7354 54.4946C15.2894 51.0538 16.0818 47.7716 17.1848 44.4902C17.3161 44.0998 17.8702 44.0923 18.0076 44.4805C19.9368 49.9269 20.7183 56.0715 19.5543 61.7184C17.7852 59.4287 16.1483 57.0221 14.7354 54.4946Z" fill="#CCCCCC"/>
<path d="M19.5565 61.7193C15.9513 60.698 12.5455 59.4206 9.17224 57.855C8.78262 57.674 8.39205 58.1075 8.61668 58.4739C12.0849 64.1296 18.578 69.0266 25.417 68.1826C23.3176 66.1713 21.3337 64.0228 19.5565 61.7193Z" fill="#CCCCCC"/>
<path d="M25.4154 68.1816C24.9234 64.7149 24.7145 61.3339 24.8111 57.8584C24.8225 57.4465 25.3511 57.2775 25.5956 57.6092C29.0499 62.2924 31.6267 67.9811 32.2434 73.7486C29.8415 72.0608 27.5353 70.2156 25.4154 68.1816Z" fill="#CCCCCC"/>
<path d="M88.67 20.719C86.2483 18.0768 83.7103 15.6991 80.9159 13.4917C80.5873 13.2322 80.1142 13.5429 80.2243 13.9469C81.7904 19.7037 84.527 25.3928 88.7457 29.6221C88.9351 26.6613 88.9379 23.6757 88.67 20.719Z" fill="#CCCCCC"/>
<path d="M88.7443 29.6248C91.1799 26.6855 93.2728 23.6467 95.1588 20.3659C95.3744 19.9907 95.948 20.1245 95.9699 20.5567C96.3101 27.2773 93.7423 35.1408 87.4863 38.3124C88.1098 35.4543 88.559 32.546 88.7443 29.6248Z" fill="#CCCCCC"/>
<path d="M87.4868 38.3102C85.954 35.1565 84.2382 32.2221 82.2272 29.3777C81.9885 29.0402 81.4536 29.1949 81.4362 29.6078C81.1911 35.4132 82.1873 41.55 84.969 46.6461C85.9999 43.9337 86.8699 41.1477 87.4868 38.3102Z" fill="#CCCCCC"/>
<path d="M84.969 46.6484C88.1316 44.6159 91.0208 42.3933 93.792 39.8971C94.1117 39.6091 94.6133 39.9098 94.5049 40.3261C92.8354 46.7453 88.0611 53.3328 81.2637 54.4962C82.6767 51.9728 83.9425 49.354 84.969 46.6484Z" fill="#CCCCCC"/>
<path d="M81.2643 54.4946C80.7102 51.0538 79.9178 47.7716 78.8148 44.4902C78.6835 44.0998 78.1295 44.0923 77.992 44.4805C76.0628 49.9269 75.2813 56.0715 76.4453 61.7184C78.2144 59.4287 79.8513 57.0221 81.2643 54.4946Z" fill="#CCCCCC"/>
<path d="M76.4433 61.7193C80.0486 60.698 83.4543 59.4206 86.8276 57.855C87.2174 57.674 87.6078 58.1075 87.3834 58.4739C83.9152 64.1296 77.4221 69.0266 70.583 68.1826C72.6823 66.1713 74.6662 64.0228 76.4433 61.7193Z" fill="#CCCCCC"/>
<path d="M70.5848 68.1816C71.0768 64.7149 71.2857 61.3339 71.1891 57.8584C71.1777 57.4465 70.6491 57.2775 70.4046 57.6092C66.9503 62.2924 64.3735 67.9811 63.7568 73.7486C66.1587 72.0608 68.465 70.2156 70.5848 68.1816Z" fill="#CCCCCC"/>
<path d="M90.0639 20.839C90.0634 20.8105 90.064 20.7822 90.0619 20.7535C89.7308 16.3459 88.9183 11.9275 87.6471 7.62119C87.4206 6.85376 86.6143 6.41519 85.8475 6.64188C85.08 6.86838 84.6415 7.67407 84.868 8.4415C86.0691 12.5101 86.8395 16.6819 87.1613 20.8433C87.162 20.8744 87.1622 20.9055 87.165 20.937C87.4091 23.6275 87.4335 26.5429 87.2378 29.6027C87.2376 29.6038 87.2374 29.6052 87.2374 29.6063C87.069 32.263 86.6567 35.1077 86.0123 38.0616C86.0123 38.0618 86.0121 38.0621 86.0121 38.0623C85.4511 40.6429 84.6257 43.3736 83.5596 46.1788C83.5592 46.1798 83.559 46.1805 83.5586 46.1814V46.1816C82.624 48.645 81.4097 51.2158 79.9498 53.8228C78.6627 56.1251 77.0837 58.4917 75.2564 60.857C75.256 60.8574 75.2558 60.858 75.2554 60.8584C75.255 60.8587 75.2547 60.8591 75.2545 60.8595C73.6349 62.9585 71.7152 65.0752 69.5487 67.1512L69.5485 67.1514C67.6178 69.0039 65.3813 70.8268 62.9007 72.57C62.8917 72.5763 62.8838 72.5836 62.875 72.59C62.8666 72.5962 62.8576 72.6015 62.8493 72.6078C58.6763 75.8141 56.5617 76.6138 54.323 77.46C52.5498 78.1304 50.7397 78.8165 48.0007 80.6424C45.2617 78.8165 43.4515 78.1304 41.6784 77.46C39.4396 76.6136 37.325 75.8141 33.152 72.6078C33.1437 72.6015 33.1347 72.5964 33.1263 72.5902C33.1175 72.5836 33.1094 72.5763 33.1004 72.57C30.6198 70.827 28.3833 69.0039 26.4526 67.1514L26.4524 67.1512C24.2859 65.0754 22.3663 62.9585 20.7466 60.8595C20.7463 60.8591 20.7459 60.8587 20.7457 60.8584C20.7453 60.858 20.7451 60.8574 20.7448 60.857C18.9174 58.4917 17.3383 56.1251 16.0513 53.8228C14.5912 51.2158 13.3772 48.645 12.4425 46.1816C12.4425 46.1814 12.4425 46.1814 12.4423 46.1814C12.4419 46.1805 12.4417 46.1798 12.4413 46.1788C11.3748 43.3736 10.5497 40.6429 9.98848 38.0623C9.98848 38.062 9.98829 38.0618 9.98829 38.0616C9.34367 35.1077 8.93154 32.2628 8.76317 29.6063C8.76298 29.605 8.76279 29.6038 8.76279 29.6027C8.56704 26.5431 8.59142 23.6275 8.83554 20.937C8.83835 20.9055 8.83854 20.8744 8.83929 20.8433C9.16104 16.6819 9.93148 12.5102 11.1326 8.4415C11.3591 7.67407 10.9205 6.86838 10.1531 6.64188C9.38642 6.41482 8.57998 6.85376 8.35348 7.62119C7.08223 11.9275 6.2698 16.3459 5.93867 20.7535C5.93642 20.7822 5.93698 20.8105 5.93661 20.839C5.69286 23.6318 5.6698 26.6408 5.87136 29.7878C5.87136 29.7885 5.87136 29.7891 5.87136 29.7898C6.04911 32.5898 6.48148 35.5781 7.15611 38.6721C7.15648 38.6741 7.15667 38.6762 7.15704 38.6783C7.74879 41.3987 8.61504 44.2684 9.73217 47.2074C9.73254 47.2082 9.73273 47.2089 9.73292 47.2097C10.7179 49.8049 11.9921 52.5051 13.5208 55.2351C13.5212 55.2356 13.5213 55.2362 13.5217 55.2367C14.8785 57.6635 16.5371 60.1505 18.4518 62.6285C18.452 62.6287 18.4522 62.6289 18.4524 62.6291C18.4526 62.6293 18.4526 62.6293 18.4526 62.6295C20.1603 64.8429 22.1776 67.0683 24.4486 69.2443C24.4492 69.2448 24.4499 69.2454 24.4505 69.246C26.4798 71.1926 28.8215 73.1026 31.4107 74.9236C35.9073 78.3757 38.3202 79.2881 40.6533 80.1703C42.1055 80.7193 43.519 81.2548 45.476 82.4583C43.9778 83.6066 42.2427 85.0473 40.184 86.8893C39.5877 87.4228 39.5367 88.3387 40.0704 88.9349C40.3565 89.2548 40.7527 89.4177 41.1505 89.4177C41.4944 89.4177 41.8396 89.2961 42.116 89.0486C44.5032 86.9124 46.4112 85.3512 48.0003 84.1771C49.5891 85.3512 51.4972 86.9124 53.8846 89.0486C54.161 89.2959 54.5061 89.4177 54.85 89.4177C55.2479 89.4177 55.6441 89.2548 55.9302 88.9349C56.4638 88.3387 56.413 87.4228 55.8166 86.8893C53.758 85.0471 52.0227 83.6064 50.5246 82.4583C52.4813 81.2548 53.8951 80.7193 55.3473 80.1703C57.6805 79.2883 60.0933 78.3757 64.5899 74.9236C67.1791 73.1026 69.5207 71.1926 71.55 69.246C71.5506 69.2454 71.5514 69.2448 71.5519 69.2443C73.8229 67.0683 75.8402 64.8429 77.548 62.6295C77.548 62.6293 77.5482 62.6293 77.5482 62.6291C77.5483 62.6289 77.5485 62.6287 77.5487 62.6285C79.4635 60.1505 81.1221 57.6635 82.4788 55.2367C82.4792 55.2362 82.4794 55.2356 82.4798 55.2351C84.0083 52.5051 85.2827 49.8049 86.2676 47.2097C86.2678 47.2089 86.2682 47.2082 86.2684 47.2074C87.3855 44.2684 88.2518 41.3987 88.8435 38.6783C88.8439 38.6762 88.8441 38.6741 88.8445 38.6721C89.5193 35.5781 89.9514 32.5898 90.1292 29.7898C90.1292 29.7891 90.1292 29.7885 90.1292 29.7878C90.3308 26.6408 90.3079 23.6318 90.0639 20.839Z" fill="#999999"/>
</g>
<path d="M45.2716 36.3195C44.9655 36.3195 44.6977 36.2064 44.4681 35.98C44.2386 35.7537 44.1238 35.4896 44.1238 35.1879V33.3772C44.3151 31.6043 44.8699 30.0577 45.7881 28.7374C46.7446 27.3794 48.0838 25.8328 49.8055 24.0976C51.0681 22.8905 52.0246 21.8531 52.6751 20.9855C53.3255 20.1179 53.7081 19.2315 53.8229 18.3261C53.976 16.7795 53.4594 15.5536 52.2733 14.6482C51.0873 13.7052 49.6525 13.2337 47.969 13.2337C44.2194 13.2337 41.962 15.0632 41.1968 18.7222C40.929 19.5898 40.3742 20.0236 39.5325 20.0236H34.6542C34.2716 20.0236 33.9655 19.9105 33.7359 19.6841C33.5064 19.4201 33.3916 19.0806 33.3916 18.6656C33.4681 16.5909 34.0994 14.6482 35.2855 12.8376C36.4716 11.0269 38.1933 9.57463 40.4507 8.48069C42.7081 7.34903 45.3481 6.7832 48.3707 6.7832C51.5464 6.7832 54.1481 7.29245 56.1759 8.31094C58.242 9.29172 59.7342 10.5554 60.6525 12.102C61.609 13.6486 62.0873 15.2518 62.0873 16.9116C62.0873 18.8354 61.6473 20.4951 60.7673 21.8909C59.9255 23.2488 58.6438 24.8332 56.922 26.6438C55.6977 27.9641 54.7412 29.0958 54.0525 30.0388C53.402 30.9441 52.962 31.9249 52.7325 32.9811C52.5794 33.9242 52.4838 34.5654 52.4455 34.9049C52.1394 35.848 51.6229 36.3195 50.8959 36.3195H45.2716ZM45.0994 46.9571C44.7168 46.9571 44.3916 46.8251 44.1238 46.561C43.8559 46.297 43.722 45.9763 43.722 45.5991V40.6764C43.722 40.2992 43.8559 39.9785 44.1238 39.7145C44.3916 39.4127 44.7168 39.2618 45.0994 39.2618H50.6664C51.0873 39.2618 51.4316 39.3939 51.6994 39.6579C51.9673 39.922 52.1012 40.2615 52.1012 40.6764V45.5991C52.1012 45.9763 51.9673 46.297 51.6994 46.561C51.4316 46.8251 51.0873 46.9571 50.6664 46.9571H45.0994Z" fill="#7319D5"/>
<defs>
<clipPath id="clip0">
<rect width="96" height="96" fill="white"/>
</clipPath>
</defs>
</svg>
