<svg width="358" height="268" viewBox="0 0 358 268" fill="none" xmlns="http://www.w3.org/2000/svg">
<path opacity="0.1" d="M204.239 37.584C182.421 36.8283 161.643 29.7771 141.801 22.0646C121.959 14.3522 102.306 5.79624 81.0117 1.72408C67.3153 -0.907475 51.6503 -1.27859 40.617 6.07289C30.0017 13.1443 26.5633 25.3642 24.7194 36.6799C23.3305 45.202 22.5147 54.1729 26.3172 62.1519C28.9601 67.6917 33.6458 72.3475 36.8887 77.6511C48.1714 96.1158 40.1956 118.882 27.9724 136.908C22.2417 145.363 15.584 153.44 11.1579 162.431C6.73173 171.422 4.68554 181.746 8.55881 190.929C12.395 200.039 21.5405 206.867 31.4479 211.675C51.5694 221.442 75.2709 224.235 98.3993 225.821C149.581 229.323 201.033 227.808 252.349 226.287C271.342 225.727 290.415 225.156 309.097 222.218C319.473 220.585 330.182 217.994 337.717 211.739C347.277 203.8 349.647 190.359 343.238 180.403C332.491 163.706 302.786 159.56 295.266 141.642C291.133 131.777 295.377 120.792 301.387 111.645C314.278 92.0201 335.883 74.8036 337.019 52.3747C337.801 36.97 327.415 21.5417 311.355 14.2509C294.524 6.60932 271.18 7.57085 258.768 20.2158C245.975 33.242 223.497 38.2554 204.239 37.584Z" fill="#7319D5"/>
<path d="M87.4808 41.6595H0V129.213H87.4808V41.6595Z" fill="#E8E9ED"/>
<path d="M358 41.6595H270.519V129.213H358V41.6595Z" fill="#E8E9ED"/>
<path opacity="0.5" d="M49.011 10.8061L48.1379 9.91201C48.1206 9.89258 48.0992 9.87711 48.0754 9.86663C48.0516 9.85616 48.0258 9.85092 47.9997 9.85128C47.9736 9.85046 47.9477 9.85549 47.9237 9.866C47.8998 9.8765 47.8786 9.89222 47.8615 9.91201L41.8274 15.9848L39.6295 13.7885C39.6119 13.7695 39.5905 13.7543 39.5667 13.744C39.5429 13.7336 39.5173 13.7283 39.4913 13.7283C39.4654 13.7283 39.4397 13.7336 39.4159 13.744C39.3922 13.7543 39.3708 13.7695 39.3531 13.7885L38.4733 14.6691C38.4541 14.6873 38.4388 14.7093 38.4284 14.7337C38.418 14.758 38.4126 14.7842 38.4126 14.8107C38.4126 14.8372 38.418 14.8635 38.4284 14.8878C38.4388 14.9122 38.4541 14.9342 38.4733 14.9524L41.2442 17.7223C41.393 17.8872 41.5993 17.9887 41.8207 18.0057C42.0393 17.9866 42.2438 17.8896 42.3971 17.7324L49.0144 11.0895C49.0492 11.0505 49.0685 11 49.0685 10.9478C49.0685 10.8955 49.0492 10.845 49.0144 10.8061H49.011Z" fill="#3ACC6C"/>
<path opacity="0.5" d="M43.7389 5.02017C45.7968 5.02165 47.7905 5.7371 49.3804 7.04467C50.9704 8.35224 52.0582 10.171 52.4586 12.1912C52.859 14.2115 52.5472 16.3081 51.5763 18.1241C50.6055 19.94 49.0356 21.3629 47.1341 22.1504C45.2326 22.938 43.1171 23.0413 41.148 22.443C39.1789 21.8446 37.478 20.5816 36.335 18.8689C35.192 17.1563 34.6775 15.1 34.8794 13.0503C35.0812 11.0007 35.9868 9.08449 37.4419 7.62811C38.2672 6.79843 39.2486 6.14075 40.3295 5.69311C41.4104 5.24547 42.5692 5.01674 43.7389 5.02017ZM43.7389 3.63355C41.7033 3.63355 39.7134 4.23773 38.0208 5.36967C36.3283 6.50162 35.0092 8.11049 34.2304 9.99279C33.4515 11.8751 33.2479 13.9463 33.6453 15.9444C34.0426 17.9425 35.0232 19.7779 36.4628 21.2182C37.9025 22.6586 39.7366 23.6393 41.7332 24.0364C43.7298 24.4334 45.7992 24.229 47.6797 23.4489C49.5602 22.6688 51.1673 21.348 52.2978 19.6537C53.4282 17.9594 54.0312 15.9677 54.0306 13.9303C54.031 12.5777 53.7651 11.2383 53.248 9.98862C52.7309 8.73894 51.9728 7.6035 51.017 6.64722C50.0612 5.69095 48.9265 4.93258 47.6776 4.41547C46.4288 3.89836 45.0904 3.63266 43.7389 3.63355Z" fill="#7319D5"/>
<path opacity="0.8" d="M116.576 39.5948L115.477 38.468C115.455 38.4442 115.428 38.4253 115.399 38.4125C115.369 38.3997 115.337 38.3933 115.305 38.3937C115.272 38.3924 115.239 38.3983 115.209 38.4112C115.179 38.424 115.152 38.4434 115.13 38.468L107.535 46.1265L104.767 43.36C104.745 43.3365 104.719 43.3178 104.689 43.305C104.659 43.2923 104.628 43.2857 104.595 43.2857C104.563 43.2856 104.53 43.2922 104.5 43.3049C104.47 43.3177 104.443 43.3364 104.42 43.36L103.311 44.4699C103.287 44.4927 103.268 44.5201 103.254 44.5506C103.241 44.581 103.234 44.6139 103.234 44.6471C103.234 44.6803 103.241 44.7131 103.254 44.7436C103.268 44.774 103.287 44.8015 103.311 44.8242L106.797 48.3059C106.985 48.513 107.246 48.6398 107.525 48.6602C107.798 48.6367 108.053 48.5172 108.246 48.3228L116.572 39.9423C116.611 39.8947 116.633 39.8351 116.633 39.7736C116.633 39.7121 116.611 39.6525 116.572 39.6049L116.576 39.5948Z" fill="#3ACC6C"/>
<path opacity="0.8" d="M109.935 32.3074C112.528 32.3079 115.041 33.2083 117.045 34.855C119.049 36.5018 120.421 38.793 120.926 41.3384C121.432 43.8838 121.04 46.5258 119.817 48.8144C118.595 51.103 116.617 52.8966 114.221 53.8895C111.825 54.8824 109.16 55.0133 106.679 54.2598C104.197 53.5064 102.054 51.9152 100.613 49.7574C99.1725 47.5995 98.524 45.0086 98.7781 42.4259C99.0322 39.8432 100.173 37.4286 102.007 35.5934C103.045 34.5476 104.281 33.7185 105.642 33.1544C107.003 32.5903 108.462 32.3024 109.935 32.3074ZM109.935 30.5631C107.373 30.5631 104.868 31.3235 102.738 32.7482C100.608 34.1728 98.9471 36.1978 97.9666 38.5669C96.9861 40.936 96.7295 43.5429 97.2294 46.058C97.7293 48.5731 98.9631 50.8833 100.775 52.6965C102.587 54.5098 104.895 55.7446 107.408 56.2449C109.921 56.7452 112.526 56.4884 114.893 55.5071C117.26 54.5258 119.283 52.8639 120.707 50.7318C122.13 48.5996 122.89 46.0929 122.89 43.5286C122.89 41.8258 122.556 40.1396 121.905 38.5664C121.254 36.9931 120.3 35.5637 119.097 34.3596C117.894 33.1556 116.465 32.2006 114.893 31.5491C113.321 30.8977 111.637 30.5627 109.935 30.5631Z" fill="#7319D5"/>
<path opacity="0.5" d="M314.258 5.02017C316.316 5.02165 318.31 5.7371 319.899 7.04467C321.489 8.35224 322.577 10.171 322.978 12.1912C323.378 14.2115 323.066 16.3081 322.095 18.1241C321.125 19.94 319.555 21.3629 317.653 22.1504C315.752 22.938 313.636 23.0413 311.667 22.443C309.698 21.8446 307.997 20.5816 306.854 18.8689C305.711 17.1563 305.197 15.1 305.398 13.0503C305.6 11.0007 306.506 9.08449 307.961 7.62811C308.786 6.79843 309.768 6.14075 310.849 5.69311C311.929 5.24547 313.088 5.01674 314.258 5.02017ZM314.258 3.63355C312.222 3.63355 310.232 4.23773 308.54 5.36967C306.847 6.50162 305.528 8.11049 304.749 9.99279C303.971 11.8751 303.767 13.9463 304.164 15.9444C304.562 17.9425 305.542 19.7779 306.982 21.2182C308.422 22.6586 310.256 23.6393 312.252 24.0364C314.249 24.4334 316.318 24.229 318.199 23.4489C320.079 22.6688 321.686 21.348 322.817 19.6537C323.947 17.9594 324.55 15.9677 324.55 13.9303C324.55 12.5777 324.284 11.2383 323.767 9.98862C323.25 8.73894 322.492 7.6035 321.536 6.64722C320.58 5.69095 319.446 4.93258 318.197 4.41547C316.948 3.89836 315.609 3.63266 314.258 3.63355Z" fill="#7319D5"/>
<path opacity="0.8" d="M247.59 32.3074C250.183 32.304 252.698 33.2011 254.705 34.8457C256.712 36.4902 258.087 38.7805 258.595 41.326C259.104 43.8715 258.714 46.5147 257.494 48.8051C256.273 51.0955 254.296 52.8912 251.9 53.8863C249.505 54.8813 246.838 55.0139 244.356 54.2617C241.874 53.5094 239.729 51.9188 238.287 49.7609C236.845 47.603 236.196 45.0114 236.449 42.428C236.703 39.8445 237.844 37.4291 239.678 35.5934C240.717 34.5485 241.953 33.72 243.314 33.156C244.674 32.592 246.134 32.3035 247.607 32.3074H247.59ZM247.607 30.5631C245.044 30.5631 242.54 31.3235 240.409 32.7482C238.279 34.1729 236.618 36.1978 235.638 38.5669C234.657 40.936 234.401 43.543 234.901 46.058C235.401 48.5731 236.634 50.8833 238.446 52.6965C240.258 54.5098 242.566 55.7446 245.079 56.2449C247.592 56.7452 250.197 56.4884 252.564 55.5071C254.931 54.5258 256.955 52.864 258.378 50.7318C259.802 48.5996 260.561 46.0929 260.561 43.5286C260.562 41.8244 260.226 40.1368 259.574 38.5625C258.923 36.9881 257.967 35.5579 256.762 34.3537C255.557 33.1494 254.127 32.1947 252.553 31.5443C250.979 30.8939 249.293 30.5605 247.59 30.5631H247.607Z" fill="#7319D5"/>
<path d="M178.437 52.8808C181.864 52.8831 185.183 54.0742 187.831 56.2513C190.478 58.4283 192.289 61.4567 192.956 64.8204C193.623 68.1841 193.104 71.6751 191.487 74.6988C189.871 77.7225 187.257 80.0918 184.091 81.403C180.925 82.7143 177.403 82.8865 174.124 81.8902C170.845 80.8939 168.013 78.7909 166.11 75.9392C164.207 73.0876 163.35 69.6638 163.686 66.251C164.023 62.8383 165.53 59.6477 167.953 57.2228C169.327 55.841 170.961 54.7457 172.76 54.0004C174.56 53.255 176.49 52.8745 178.437 52.8808ZM178.437 50.5731C175.05 50.5731 171.738 51.5785 168.921 53.4621C166.105 55.3457 163.909 58.023 162.613 61.1553C161.317 64.2876 160.977 67.7343 161.638 71.0596C162.299 74.3849 163.93 77.4393 166.326 79.8367C168.721 82.2341 171.773 83.8667 175.096 84.5281C178.418 85.1896 181.862 84.8501 184.992 83.5526C188.122 82.2552 190.797 80.058 192.679 77.239C194.561 74.42 195.565 71.1057 195.565 67.7153C195.566 65.464 195.123 63.2347 194.262 61.1548C193.402 59.0748 192.14 57.1849 190.549 55.593C188.959 54.0011 187.071 52.7384 184.992 51.8771C182.914 51.0158 180.687 50.5727 178.437 50.5731Z" fill="#7319D5"/>
<path d="M158.68 64.608H61.1904V162.178H158.68V64.608Z" fill="#F3F5F7"/>
<path d="M296.335 64.608H198.845V162.178H296.335V64.608Z" fill="#F3F5F7"/>
<path opacity="0.1" d="M41.2579 57.2025H8.74121V60.8192H41.2579V57.2025Z" fill="black"/>
<path opacity="0.1" d="M318.778 57.2025H286.262V60.8192H318.778V57.2025Z" fill="black"/>
<path d="M236.371 208.638C236.371 208.638 244.819 193.662 257.541 189.347C262.888 187.571 267.516 184.107 270.728 179.475C272.235 177.26 273.537 174.913 274.618 172.461" stroke="#535461" stroke-width="2" stroke-miterlimit="10"/>
<path d="M282.618 169.705C281.168 171.112 274.416 172.569 274.416 172.569C274.416 172.569 276.075 165.859 277.524 164.448C278.221 163.772 279.157 163.401 280.127 163.416C281.097 163.431 282.021 163.831 282.697 164.528C283.372 165.225 283.743 166.162 283.729 167.133C283.714 168.104 283.314 169.029 282.618 169.705Z" fill="#7319D5"/>
<path d="M278.799 181.844C276.816 182.238 270.371 179.789 270.371 179.789C270.371 179.789 275.404 175.066 277.386 174.664C278.328 174.5 279.296 174.71 280.084 175.251C280.872 175.792 281.418 176.62 281.604 177.558C281.789 178.496 281.601 179.47 281.079 180.271C280.556 181.072 279.742 181.636 278.809 181.844H278.799Z" fill="#7319D5"/>
<path d="M264.893 194.985C262.985 194.31 258.646 188.946 258.646 188.946C258.646 188.946 265.388 187.404 267.286 188.065C267.74 188.222 268.159 188.468 268.518 188.787C268.877 189.106 269.17 189.493 269.38 189.925C269.59 190.358 269.713 190.827 269.741 191.307C269.77 191.787 269.704 192.268 269.547 192.723C269.389 193.177 269.144 193.596 268.825 193.955C268.507 194.315 268.12 194.608 267.688 194.818C267.256 195.028 266.786 195.151 266.307 195.18C265.827 195.208 265.347 195.142 264.893 194.985Z" fill="#7319D5"/>
<path d="M252.15 202.552C250.155 202.215 244.97 197.657 244.97 197.657C244.97 197.657 251.348 195.001 253.34 195.329C253.818 195.403 254.276 195.571 254.688 195.823C255.1 196.076 255.458 196.407 255.742 196.799C256.025 197.191 256.228 197.635 256.339 198.105C256.45 198.576 256.467 199.064 256.388 199.541C256.309 200.018 256.137 200.475 255.881 200.885C255.625 201.296 255.29 201.651 254.896 201.931C254.502 202.211 254.057 202.41 253.585 202.516C253.114 202.623 252.626 202.635 252.15 202.552Z" fill="#7319D5"/>
<path d="M264.731 174.546C264.731 176.57 268.386 182.431 268.386 182.431C268.386 182.431 272.04 176.57 272.04 174.55C272.04 173.579 271.654 172.648 270.968 171.961C270.283 171.275 269.352 170.889 268.382 170.889C267.412 170.889 266.482 171.275 265.796 171.961C265.11 172.648 264.725 173.579 264.725 174.55L264.731 174.546Z" fill="#7319D5"/>
<path d="M249.922 183.595C250.526 185.525 255.768 190.025 255.768 190.025C255.768 190.025 257.507 183.338 256.904 181.409C256.76 180.95 256.528 180.524 256.22 180.155C255.912 179.786 255.534 179.481 255.109 179.258C254.683 179.035 254.218 178.899 253.74 178.856C253.261 178.813 252.779 178.865 252.321 179.008C251.862 179.152 251.437 179.384 251.068 179.692C250.699 180.001 250.395 180.378 250.172 180.804C249.95 181.23 249.813 181.696 249.77 182.175C249.727 182.653 249.779 183.136 249.922 183.595Z" fill="#7319D5"/>
<path d="M236.735 194.354C237.005 196.358 241.407 201.678 241.407 201.678C241.407 201.678 244.253 195.383 243.986 193.379C243.857 192.416 243.351 191.545 242.58 190.956C241.809 190.367 240.835 190.108 239.874 190.238C238.912 190.367 238.041 190.873 237.453 191.645C236.864 192.417 236.606 193.391 236.735 194.354Z" fill="#7319D5"/>
<path opacity="0.25" d="M282.618 169.705C281.168 171.112 274.416 172.569 274.416 172.569C274.416 172.569 276.075 165.859 277.524 164.448C278.221 163.772 279.157 163.401 280.127 163.416C281.097 163.431 282.021 163.831 282.697 164.528C283.372 165.225 283.743 166.162 283.729 167.133C283.714 168.104 283.314 169.029 282.618 169.705Z" fill="black"/>
<path opacity="0.25" d="M278.799 181.844C276.816 182.238 270.371 179.789 270.371 179.789C270.371 179.789 275.404 175.066 277.386 174.664C278.328 174.5 279.296 174.71 280.084 175.251C280.872 175.792 281.418 176.62 281.604 177.558C281.789 178.496 281.601 179.47 281.079 180.271C280.556 181.072 279.742 181.636 278.809 181.844H278.799Z" fill="black"/>
<path opacity="0.25" d="M264.893 194.985C262.985 194.31 258.646 188.946 258.646 188.946C258.646 188.946 265.388 187.404 267.286 188.065C267.74 188.222 268.159 188.468 268.518 188.787C268.877 189.106 269.17 189.493 269.38 189.925C269.59 190.358 269.713 190.827 269.741 191.307C269.77 191.787 269.704 192.268 269.547 192.723C269.389 193.177 269.144 193.596 268.825 193.955C268.507 194.315 268.12 194.608 267.688 194.818C267.256 195.028 266.786 195.151 266.307 195.18C265.827 195.208 265.347 195.142 264.893 194.985Z" fill="black"/>
<path opacity="0.25" d="M252.15 202.552C250.155 202.215 244.97 197.657 244.97 197.657C244.97 197.657 251.348 195.001 253.34 195.329C253.818 195.403 254.276 195.571 254.688 195.823C255.1 196.076 255.458 196.407 255.742 196.799C256.025 197.191 256.228 197.635 256.339 198.105C256.45 198.576 256.467 199.064 256.388 199.541C256.309 200.018 256.137 200.475 255.881 200.885C255.625 201.296 255.29 201.651 254.896 201.931C254.502 202.211 254.057 202.41 253.585 202.516C253.114 202.623 252.626 202.635 252.15 202.552Z" fill="black"/>
<path opacity="0.25" d="M264.731 174.546C264.731 176.57 268.386 182.431 268.386 182.431C268.386 182.431 272.04 176.57 272.04 174.55C272.04 173.579 271.654 172.648 270.968 171.961C270.283 171.275 269.352 170.889 268.382 170.889C267.412 170.889 266.482 171.275 265.796 171.961C265.11 172.648 264.725 173.579 264.725 174.55L264.731 174.546Z" fill="black"/>
<path opacity="0.25" d="M249.922 183.595C250.526 185.525 255.768 190.025 255.768 190.025C255.768 190.025 257.507 183.338 256.904 181.409C256.76 180.95 256.528 180.524 256.22 180.155C255.912 179.786 255.534 179.481 255.109 179.258C254.683 179.035 254.218 178.899 253.74 178.856C253.261 178.813 252.779 178.865 252.321 179.008C251.862 179.152 251.437 179.384 251.068 179.692C250.699 180.001 250.395 180.378 250.172 180.804C249.95 181.23 249.813 181.696 249.77 182.175C249.727 182.653 249.779 183.136 249.922 183.595Z" fill="black"/>
<path opacity="0.25" d="M236.735 194.354C237.005 196.358 241.407 201.678 241.407 201.678C241.407 201.678 244.253 195.383 243.986 193.379C243.857 192.416 243.351 191.545 242.58 190.956C241.809 190.367 240.835 190.108 239.874 190.238C238.912 190.367 238.041 190.873 237.453 191.645C236.864 192.417 236.606 193.391 236.735 194.354Z" fill="black"/>
<path d="M236.856 208.341C236.856 208.341 238.518 191.226 248.399 182.12C252.569 178.325 255.397 173.278 256.459 167.738C256.941 165.105 257.181 162.433 257.177 159.756" stroke="#535461" stroke-width="2" stroke-miterlimit="10"/>
<path d="M263.373 153.99C262.618 155.866 257.035 159.934 257.035 159.934C257.035 159.934 255.832 153.129 256.587 151.254C256.766 150.808 257.032 150.401 257.368 150.058C257.705 149.715 258.105 149.441 258.547 149.253C258.989 149.065 259.464 148.966 259.944 148.961C260.425 148.956 260.901 149.046 261.347 149.226C261.792 149.406 262.198 149.671 262.541 150.008C262.884 150.345 263.157 150.746 263.346 151.188C263.534 151.63 263.633 152.105 263.638 152.586C263.642 153.067 263.552 153.544 263.373 153.99Z" fill="#7319D5"/>
<path d="M264.795 166.638C263.143 167.802 256.25 168.183 256.25 168.183C256.25 168.183 258.946 161.814 260.588 160.653C261.382 160.129 262.348 159.935 263.283 160.113C264.217 160.29 265.045 160.825 265.592 161.603C266.139 162.381 266.362 163.342 266.213 164.282C266.065 165.222 265.556 166.067 264.795 166.638Z" fill="#7319D5"/>
<path d="M257.403 184.29C255.38 184.458 249.248 181.304 249.248 181.304C249.248 181.304 254.776 177.164 256.789 176.995C257.272 176.946 257.761 176.993 258.226 177.135C258.69 177.276 259.122 177.509 259.496 177.819C259.87 178.13 260.179 178.512 260.404 178.943C260.629 179.374 260.765 179.845 260.806 180.33C260.847 180.814 260.791 181.302 260.641 181.765C260.491 182.228 260.251 182.656 259.934 183.024C259.617 183.393 259.23 183.695 258.796 183.912C258.361 184.129 257.887 184.258 257.403 184.29Z" fill="#7319D5"/>
<path d="M248.807 196.385C246.848 196.891 240.261 194.819 240.261 194.819C240.261 194.819 245.014 189.806 246.97 189.296C247.901 189.074 248.882 189.226 249.702 189.72C250.523 190.214 251.117 191.01 251.358 191.938C251.598 192.865 251.466 193.85 250.989 194.681C250.512 195.512 249.728 196.122 248.807 196.381V196.385Z" fill="#7319D5"/>
<path d="M248.978 165.673C249.798 167.522 255.511 171.408 255.511 171.408C255.511 171.408 256.486 164.566 255.67 162.718C255.277 161.829 254.548 161.134 253.642 160.784C252.737 160.434 251.73 160.459 250.843 160.852C249.955 161.245 249.26 161.975 248.911 162.881C248.561 163.787 248.585 164.795 248.978 165.683V165.673Z" fill="#7319D5"/>
<path d="M239.102 179.944C240.45 181.462 247.05 183.453 247.05 183.453C247.05 183.453 245.931 176.631 244.6 175.113C243.96 174.383 243.056 173.938 242.088 173.875C241.12 173.812 240.166 174.136 239.437 174.777C238.708 175.418 238.263 176.322 238.2 177.291C238.137 178.26 238.461 179.214 239.102 179.944Z" fill="#7319D5"/>
<path d="M231.405 195.133C232.461 196.857 238.643 199.937 238.643 199.937C238.643 199.937 238.697 193.024 237.632 191.3C237.124 190.473 236.308 189.882 235.365 189.656C234.421 189.431 233.427 189.589 232.6 190.098C231.774 190.606 231.183 191.422 230.958 192.366C230.732 193.31 230.891 194.306 231.399 195.133H231.405Z" fill="#7319D5"/>
<path opacity="0.1" d="M106.291 85.4344H73.7744V89.0512H106.291V85.4344Z" fill="black"/>
<path opacity="0.1" d="M153.107 117.226H133.694V120.842H153.107V117.226Z" fill="black"/>
<path opacity="0.1" d="M162.442 141.497H133.694V145.113H162.442V141.497Z" fill="black"/>
<path opacity="0.1" d="M106.291 98.1805H73.7744V101.797H106.291V98.1805Z" fill="black"/>
<path opacity="0.1" d="M252.616 85.4344H220.099V89.0512H252.616V85.4344Z" fill="black"/>
<path opacity="0.1" d="M252.616 98.1805H220.099V101.797H252.616V98.1805Z" fill="black"/>
<path d="M173.829 72.7559L174.739 71.5616C175.614 72.4203 176.79 72.9042 178.015 72.9111C179.553 72.9111 180.692 72.1587 180.692 70.9408C180.692 69.6183 179.6 68.7478 176.573 68.7478V67.3747C179.269 67.3747 180.281 66.4874 180.281 65.3167C180.281 64.2573 179.374 63.5961 178.029 63.5961C176.981 63.627 175.98 64.0369 175.211 64.7499L174.243 63.5961C175.306 62.645 176.677 62.1116 178.103 62.0947C180.432 62.0947 182.148 63.2148 182.148 65.1784C182.148 66.5616 181.137 67.4658 179.681 67.9651V68.0393C181.241 68.3767 182.549 69.4125 182.549 71.0285C182.549 73.1608 180.527 74.4394 178.14 74.4394C176.111 74.436 174.719 73.6634 173.829 72.7559Z" fill="#7319D5"/>
<g opacity="0.8">
<path opacity="0.8" d="M248.665 41.6662C248.665 41.0184 248.722 40.1918 248.756 39.5441H248.672C248.301 40.1176 247.88 40.6878 247.502 41.2579L244.805 44.7194H251.965V46.1128H242.958V44.932L248.335 37.847H250.314V49.1121H248.665V41.6662Z" fill="#7319D5"/>
</g>
<g opacity="0.5">
<path opacity="0.5" d="M310.755 17.5033L311.366 16.67C311.955 17.2487 312.748 17.5742 313.574 17.5775C314.659 17.5775 315.512 16.9297 315.512 15.867C315.512 14.8043 314.76 14.2307 313.644 14.2307C313.079 14.226 312.526 14.3892 312.053 14.6997L311.419 14.2914L311.676 10.307H316.395V11.4035H312.788L312.589 13.5863C313.028 13.3867 313.506 13.2854 313.988 13.2894C315.535 13.2894 316.796 14.0856 316.796 15.8468C316.796 17.6079 315.32 18.6369 313.725 18.6369C313.18 18.6529 312.637 18.561 312.127 18.3665C311.618 18.1719 311.151 17.8786 310.755 17.5033Z" fill="#7319D5"/>
</g>
<path opacity="0.1" d="M237.538 95.5859H117.028V216.195H237.538V95.5859Z" fill="#7319D5"/>
<path d="M241.583 89.8507H121.073V210.46H241.583V89.8507Z" fill="white"/>
<path opacity="0.5" d="M228.958 103.211H133.694V106.828H228.958V103.211Z" fill="#7319D5"/>
<path opacity="0.1" d="M194.355 129.361H133.694V132.978H194.355V129.361Z" fill="black"/>
<path opacity="0.1" d="M192.551 153.635H133.694V157.252H192.551V153.635Z" fill="black"/>
<path opacity="0.1" d="M213.927 165.771H133.694V169.388H213.927V165.771Z" fill="black"/>
<path opacity="0.5" d="M211.537 129.682L211.122 129.253C211.104 129.236 211.08 129.226 211.055 129.226C211.031 129.226 211.008 129.236 210.991 129.253L208.115 132.155L207.067 131.105C207.048 131.089 207.025 131.079 207 131.078C206.976 131.079 206.953 131.089 206.936 131.105L206.514 131.527C206.505 131.536 206.498 131.546 206.493 131.558C206.488 131.569 206.486 131.582 206.486 131.594C206.486 131.607 206.488 131.619 206.493 131.631C206.498 131.643 206.505 131.653 206.514 131.662L207.836 132.981C207.907 133.059 208.006 133.108 208.112 133.116C208.216 133.107 208.313 133.06 208.385 132.984L211.537 129.816C211.552 129.797 211.561 129.774 211.561 129.749C211.561 129.724 211.552 129.701 211.537 129.682Z" fill="#3ACC6C"/>
<path opacity="0.5" d="M209.025 126.915C210.008 126.914 210.961 127.255 211.721 127.878C212.481 128.502 213.002 129.37 213.194 130.334C213.386 131.299 213.238 132.3 212.775 133.168C212.312 134.036 211.563 134.716 210.655 135.093C209.747 135.469 208.737 135.519 207.796 135.234C206.856 134.949 206.043 134.346 205.497 133.528C204.951 132.71 204.705 131.728 204.801 130.749C204.898 129.77 205.33 128.855 206.025 128.16C206.418 127.764 206.886 127.45 207.401 127.236C207.916 127.023 208.468 126.913 209.025 126.915ZM209.025 126.257C208.055 126.256 207.106 126.544 206.299 127.083C205.492 127.622 204.863 128.389 204.491 129.286C204.12 130.183 204.022 131.17 204.211 132.123C204.4 133.075 204.868 133.95 205.554 134.637C206.24 135.324 207.114 135.791 208.066 135.981C209.018 136.17 210.004 136.072 210.901 135.7C211.797 135.328 212.563 134.699 213.102 133.891C213.64 133.083 213.927 132.134 213.927 131.162C213.925 129.863 213.408 128.617 212.489 127.698C211.57 126.78 210.324 126.264 209.025 126.264V126.257Z" fill="#3ACC6C"/>
<path opacity="0.5" d="M211.537 153.953L211.122 153.528C211.114 153.519 211.103 153.512 211.092 153.507C211.08 153.502 211.067 153.5 211.055 153.501C211.043 153.5 211.031 153.502 211.02 153.507C211.009 153.512 210.999 153.519 210.991 153.528L208.115 156.426L207.067 155.38C207.058 155.371 207.048 155.363 207.036 155.358C207.025 155.353 207.012 155.35 207 155.35C206.987 155.35 206.975 155.353 206.964 155.358C206.953 155.363 206.944 155.371 206.936 155.38L206.514 155.798C206.505 155.807 206.498 155.818 206.493 155.829C206.488 155.841 206.486 155.853 206.486 155.866C206.486 155.878 206.488 155.891 206.493 155.902C206.498 155.914 206.505 155.924 206.514 155.933L207.836 157.256C207.907 157.334 208.006 157.382 208.112 157.391C208.216 157.38 208.312 157.334 208.385 157.259L211.537 154.088C211.552 154.069 211.561 154.045 211.561 154.02C211.561 153.996 211.552 153.972 211.537 153.953Z" fill="#3ACC6C"/>
<path opacity="0.5" d="M209.025 151.206C210.008 151.206 210.961 151.546 211.721 152.169C212.481 152.793 213.002 153.661 213.194 154.626C213.386 155.59 213.238 156.592 212.775 157.459C212.312 158.327 211.563 159.007 210.655 159.384C209.747 159.761 208.737 159.811 207.796 159.525C206.856 159.24 206.043 158.637 205.497 157.819C204.951 157.002 204.705 156.02 204.801 155.041C204.898 154.062 205.33 153.147 206.025 152.451C206.418 152.055 206.886 151.741 207.401 151.528C207.916 151.314 208.468 151.205 209.025 151.206ZM209.025 150.531C208.055 150.531 207.107 150.818 206.299 151.357C205.492 151.896 204.863 152.663 204.492 153.559C204.12 154.456 204.022 155.444 204.211 156.396C204.4 157.348 204.867 158.223 205.553 158.91C206.238 159.597 207.112 160.065 208.064 160.255C209.015 160.444 210.002 160.347 210.898 159.976C211.795 159.604 212.561 158.975 213.1 158.168C213.639 157.361 213.927 156.411 213.927 155.44C213.927 154.796 213.801 154.158 213.555 153.562C213.309 152.967 212.948 152.425 212.492 151.969C212.037 151.514 211.497 151.152 210.902 150.905C210.307 150.658 209.669 150.531 209.025 150.531Z" fill="#3ACC6C"/>
<path opacity="0.1" d="M172.767 268C186.062 268 196.839 266.19 196.839 263.958C196.839 261.726 186.062 259.916 172.767 259.916C159.472 259.916 148.695 261.726 148.695 263.958C148.695 266.19 159.472 268 172.767 268Z" fill="#7319D5"/>
<path d="M44.1299 233.928C44.1299 233.928 45.3839 235.571 43.5501 238.054C41.7162 240.537 40.1993 242.629 40.8128 244.178C40.8128 244.178 43.5804 239.569 45.8356 239.505C48.0908 239.441 46.6075 236.701 44.1299 233.928Z" fill="#7319D5"/>
<path opacity="0.1" d="M44.1296 233.928C44.2388 234.087 44.3251 234.261 44.3858 234.444C46.5837 237.032 47.7568 239.444 45.6432 239.505C43.6745 239.562 41.3114 243.085 40.7451 243.975C40.763 244.044 40.7855 244.112 40.8125 244.178C40.8125 244.178 43.5801 239.569 45.8353 239.505C48.0905 239.441 46.6073 236.701 44.1296 233.928Z" fill="black"/>
<path d="M46.4623 236.023C46.4623 236.604 46.3982 237.073 46.3173 237.073C46.2364 237.073 46.1724 236.604 46.1724 236.023C46.1724 235.443 46.2533 235.716 46.3342 235.716C46.4151 235.716 46.4623 235.446 46.4623 236.023Z" fill="#FFD037"/>
<path d="M47.2647 236.715C46.7556 236.992 46.314 237.16 46.2769 237.089C46.2399 237.019 46.614 236.752 47.1264 236.458C47.6388 236.165 47.4332 236.384 47.4635 236.458C47.4939 236.533 47.7703 236.438 47.2647 236.715Z" fill="#FFD037"/>
<path d="M37.4956 233.928C37.4956 233.928 36.2383 235.571 38.0754 238.054C39.9126 240.537 41.4228 242.629 40.8127 244.178C40.8127 244.178 38.0417 239.569 35.7899 239.505C33.5381 239.441 35.0146 236.701 37.4956 233.928Z" fill="#7319D5"/>
<path opacity="0.1" d="M37.4956 233.928C37.3864 234.087 37.3002 234.261 37.2394 234.444C35.0382 237.032 33.8684 239.444 35.9821 239.505C37.9507 239.562 40.3138 243.085 40.8801 243.975C40.8599 244.043 40.8397 244.11 40.8127 244.178C40.8127 244.178 38.0417 239.569 35.7899 239.505C33.5381 239.441 35.0146 236.701 37.4956 233.928Z" fill="black"/>
<path d="M35.1597 236.023C35.1597 236.604 35.2237 237.073 35.3046 237.073C35.3855 237.073 35.4496 236.604 35.4496 236.023C35.4496 235.443 35.3687 235.716 35.2878 235.716C35.2069 235.716 35.1597 235.446 35.1597 236.023Z" fill="#FFD037"/>
<path d="M34.3604 236.715C34.8661 236.992 35.3077 237.16 35.3481 237.089C35.3886 237.019 35.011 236.752 34.4986 236.458C33.9862 236.165 34.1919 236.384 34.1615 236.458C34.1312 236.533 33.8514 236.438 34.3604 236.715Z" fill="#FFD037"/>
<path opacity="0.1" d="M40.8127 256.752C48.0642 256.752 53.9427 255.849 53.9427 254.734C53.9427 253.62 48.0642 252.717 40.8127 252.717C33.5611 252.717 27.6826 253.62 27.6826 254.734C27.6826 255.849 33.5611 256.752 40.8127 256.752Z" fill="#7319D5"/>
<path d="M47.5716 241.961L47.5076 242.477L47.4199 243.199L47.3829 243.503L47.2952 244.228L47.2581 244.532L47.1671 245.254L46.1558 253.5C46.0682 254.235 44.8647 254.809 43.4152 254.809H38.2003C36.7507 254.809 35.5507 254.235 35.463 253.5L34.4517 245.254L34.3641 244.532L34.327 244.228L34.2393 243.503L34.2023 243.199L34.1146 242.477L34.0472 241.961C33.9966 241.546 34.6472 241.195 35.4664 241.195H46.1457C46.9716 241.195 47.6222 241.546 47.5716 241.961Z" fill="#65617D"/>
<path d="M47.5072 242.474L47.4196 243.199H34.2053L34.1143 242.474H47.5072Z" fill="#9D9CB5"/>
<path d="M47.3828 243.503L47.2952 244.228H34.3303L34.2427 243.503H47.3828Z" fill="#9D9CB5"/>
<path d="M47.2579 244.529L47.1669 245.254H34.4548L34.3672 244.529H47.2579Z" fill="#9D9CB5"/>
<path opacity="0.1" d="M199.172 155.798C198.946 155.336 197.149 149.388 197.149 149.388L193.687 140.592C193.687 140.592 191.587 129.017 188.452 131.905C185.317 134.793 190.138 141.722 190.138 141.722C190.138 141.722 192.117 146.783 192.015 147.795C191.914 148.807 193.118 152.519 193.118 152.519L192.727 154.651C192.218 154.617 191.887 154.617 191.887 154.617C191.887 154.617 191.577 155.062 191.281 155.093C191.23 155.1 191.179 155.093 191.132 155.073C190.795 154.921 189.679 154.951 189.11 154.951C188.58 154.88 188.068 154.715 187.596 154.465C187.401 154.074 186.295 153.841 185.314 153.709C184.569 151.854 183.521 150.049 183.376 148.112C183.304 147.585 183.408 147.049 183.672 146.587C183.738 146.488 183.812 146.396 183.895 146.311C184.168 146.034 184.501 145.791 184.805 145.535C184.957 145.407 185.095 145.275 185.226 145.14C187.798 142.643 187.39 138.777 185.058 136.102C182.361 133.008 170.198 126.351 166.517 132.053C166.005 132.849 165.988 133.77 165.843 134.654C165.476 136.816 164.463 138.816 162.937 140.39C161.717 141.689 160.116 142.886 159.415 144.357L159.391 144.303C159.224 144.622 159.101 144.963 159.027 145.316C158.673 147.107 159.88 148.831 160.513 150.575C160.729 151.168 160.885 151.78 160.979 152.404L161.019 152.019C161.174 152.91 161.227 153.815 161.178 154.718C156.762 155.622 156.758 163.24 156.758 163.24C156.758 163.24 156.215 166.277 156.306 167.36C156.397 168.443 156.397 170.811 156.397 171.388C156.397 171.965 155.851 175.508 155.791 175.933C155.713 176.402 154.884 178.649 156.886 179.155C157.024 179.192 157.173 179.222 157.324 179.249C157.409 181.068 157.567 184.883 157.429 185.727C157.429 185.727 158.157 190.848 158.761 192.137C159.148 192.899 159.599 193.627 160.109 194.313C160.066 194.624 159.962 194.923 159.802 195.194C159.495 195.642 159.654 196.01 160.17 196.169C160.154 196.324 160.134 196.499 160.109 196.695C159.89 198.672 159.559 202.596 160.109 204.586C160.881 207.312 160.925 208.22 160.925 208.22C160.924 208.663 161.033 209.1 161.242 209.492C161.579 209.947 162.152 214.171 162.152 214.853C162.152 215.534 163.696 221.668 163.241 223.122C162.785 224.576 163.15 226.62 163.15 226.62C163.15 226.62 162.877 230.21 162.56 230.983C162.243 231.755 162.105 244.205 162.603 247.43C163.102 250.655 163.423 253.337 163.423 253.337C163.423 253.337 163.086 256.289 163.375 256.711C163.665 257.133 164.147 259.576 163.783 259.71C163.419 259.845 163.241 260.847 163.241 260.847C163.432 261.14 163.639 261.423 163.861 261.694C163.72 261.645 163.583 261.586 163.45 261.519C163.595 261.725 163.81 262.008 164.073 262.318L163.827 265.584C163.817 265.712 163.851 265.84 163.925 265.945C163.999 266.049 164.108 266.125 164.232 266.158C165.028 266.377 165.87 266.373 166.665 266.148C167.46 265.922 168.178 265.484 168.742 264.879C171.011 262.561 171.776 262.882 172.194 261.472C172.234 261.32 172.275 261.175 172.305 261.033C172.368 260.761 172.352 260.477 172.26 260.214C172.167 259.951 172.002 259.719 171.784 259.546C171.565 259.373 171.302 259.266 171.025 259.236C170.748 259.207 170.469 259.257 170.219 259.38C170.364 258.368 170.478 257.258 170.367 256.62C170.141 255.304 170.185 251.85 170.185 251.85L169.868 235.318C169.868 235.318 170.458 232.049 171.139 230.777C171.82 229.505 171.729 225.041 171.729 225.041L172.501 210.409L173.269 203.324C173.269 203.324 173.994 200.872 174.901 203.598C174.901 203.598 174.402 209.094 174.631 210.413C174.86 211.732 175.174 218.135 174.948 219.546C174.722 220.956 173.721 228.678 174.358 230.632C174.995 232.585 175.673 234.947 175.538 235.719C175.403 236.492 174.948 253.263 174.948 253.263C174.948 253.263 176.172 256.488 175.265 257.534C174.358 258.58 175.221 262.76 175.221 262.76C175.221 262.76 175.329 262.838 175.518 262.949L175.491 263.287L175.208 267.045C175.198 267.173 175.233 267.3 175.307 267.405C175.38 267.51 175.489 267.585 175.612 267.619C176.409 267.837 177.25 267.833 178.045 267.607C178.84 267.382 179.558 266.944 180.123 266.34C182.391 264.022 183.156 264.339 183.574 262.932C183.615 262.781 183.655 262.632 183.689 262.49C183.758 262.19 183.73 261.875 183.611 261.59C183.492 261.306 183.286 261.066 183.024 260.904C182.762 260.742 182.455 260.667 182.148 260.688C181.84 260.709 181.547 260.826 181.309 261.023C181.294 261.039 181.277 261.054 181.259 261.067C181.201 261.117 181.141 261.161 181.08 261.205L180.992 261.262C181.218 260.223 181.548 258.452 181.393 257.615C181.168 256.387 181.619 252.663 181.619 252.663C181.619 252.663 182.937 248.209 182.968 246.438C182.998 244.667 183.332 232.268 183.332 232.268C183.332 232.268 183.288 226.499 183.47 225.092C183.652 223.685 185.102 211.506 186.554 207.886C187.67 205.099 188.169 197.997 187.872 194.391C187.856 194.208 187.839 194.053 187.822 193.878C189.598 192.542 189.787 190.342 189.787 190.342C189.787 190.342 188.152 187.191 186.578 185.858C185.004 184.526 184.64 182.225 184.7 181.253C184.728 180.66 184.535 180.078 184.158 179.62C184.158 179.62 183.429 177.259 182.944 177.016C182.904 176.996 182.869 176.968 182.84 176.935C182.502 176.577 182.762 175.561 182.762 175.561V175.531C182.816 175.295 183.17 173.77 183.055 173.379C182.941 172.987 183.116 170.956 183.116 170.956C183.116 170.956 184.269 167.505 184.087 164.779C183.905 162.053 186.447 162.292 186.447 162.292L194.298 162.211H195.191C195.568 161.89 195.907 161.526 196.202 161.128C196.505 161.185 196.817 161.177 197.116 161.104C197.416 161.03 197.696 160.894 197.938 160.703C199.604 159.178 199.398 156.267 199.172 155.798ZM162.661 179.414L162.718 178.031L163.025 178.294C163.118 178.657 163.118 179.038 163.025 179.401C162.977 179.571 162.892 179.729 162.775 179.862C162.659 179.996 162.513 180.101 162.351 180.17C162.312 180.189 162.274 180.212 162.239 180.238L162.162 179.448C162.482 179.428 162.661 179.411 162.661 179.411V179.414Z" fill="black"/>
<path d="M192.113 158.48C192.113 158.48 196.583 161.358 198.275 159.83C199.968 158.301 199.759 155.353 199.529 154.887C199.3 154.422 197.48 148.433 197.48 148.433L193.964 139.567C193.964 139.567 191.827 127.897 188.638 130.795C185.449 133.693 190.357 140.69 190.357 140.69C190.357 140.69 192.379 145.795 192.265 146.817C192.15 147.839 193.384 151.584 193.384 151.584L192.113 158.48Z" fill="url(#paint0_linear)"/>
<path d="M183.776 262.45C183.743 262.595 183.706 262.744 183.659 262.895C183.244 264.316 182.458 263.995 180.153 266.33C179.577 266.94 178.846 267.383 178.039 267.61C177.231 267.837 176.377 267.84 175.568 267.619C175.443 267.586 175.333 267.51 175.258 267.405C175.183 267.299 175.147 267.171 175.157 267.042L175.447 263.253L175.585 261.428C175.585 261.428 179.256 262.46 181.127 261.155C181.188 261.111 181.248 261.067 181.306 261.016L181.359 260.972C181.6 260.775 181.896 260.658 182.207 260.636C182.517 260.615 182.827 260.69 183.092 260.853C183.358 261.015 183.566 261.256 183.689 261.542C183.811 261.828 183.842 262.146 183.776 262.45Z" fill="url(#paint1_linear)"/>
<path d="M172.258 261.02C172.228 261.165 172.187 261.313 172.143 261.465C171.729 262.885 170.943 262.565 168.638 264.9C168.061 265.509 167.331 265.951 166.523 266.179C165.716 266.406 164.862 266.411 164.053 266.192C163.927 266.159 163.816 266.083 163.741 265.977C163.666 265.871 163.63 265.741 163.642 265.611L163.928 261.823L164.07 259.997C164.07 259.997 167.741 261.03 169.608 259.724C169.672 259.68 169.73 259.636 169.79 259.586L169.844 259.542C170.085 259.344 170.381 259.226 170.691 259.204C171.002 259.182 171.312 259.258 171.577 259.42C171.843 259.583 172.051 259.824 172.173 260.111C172.295 260.398 172.325 260.715 172.258 261.02Z" fill="url(#paint2_linear)"/>
<g opacity="0.1">
<path opacity="0.1" d="M168.455 261.59L168.607 263.557C166.497 265.648 163.989 262.545 163.247 261.512C165.179 262.504 168.455 261.59 168.455 261.59Z" fill="url(#paint3_linear)"/>
</g>
<g opacity="0.1">
<path opacity="0.1" d="M180.844 262.389L181.124 262.207C179.195 265.115 176.337 263.773 175.447 263.253L175.585 261.428C175.585 261.428 179.256 262.46 181.127 261.155C180.979 261.866 180.844 262.389 180.844 262.389Z" fill="url(#paint4_linear)"/>
</g>
<path d="M186.706 207.377C185.23 211.041 183.753 223.318 183.568 224.738C183.383 226.158 183.43 231.975 183.43 231.975L183.046 246.266C183.002 248.054 181.663 252.541 181.663 252.541C181.663 252.541 181.202 256.3 181.431 257.535C181.66 258.769 180.831 262.025 180.831 262.025L181.111 261.843C178.801 265.321 175.157 262.71 175.157 262.71C175.157 262.71 174.281 258.496 175.201 257.444C176.121 256.391 174.881 253.139 174.881 253.139C174.881 253.139 175.339 236.236 175.481 235.457C175.623 234.677 174.955 232.295 174.281 230.325C173.607 228.355 174.648 220.568 174.881 219.148C175.114 217.727 174.787 211.27 174.544 209.941C174.301 208.611 174.82 203.068 174.82 203.068C173.897 200.322 173.158 202.795 173.158 202.795L172.42 209.988L171.662 224.755C171.662 224.755 171.756 229.242 171.062 230.524C170.367 231.806 169.77 235.106 169.77 235.106L170.108 251.779C170.108 251.779 170.06 255.261 170.293 256.59C170.526 257.919 169.784 261.354 169.784 261.354C167.202 267.4 163.042 260.851 163.042 260.851C163.042 260.851 163.224 259.839 163.595 259.704C163.966 259.569 163.457 257.093 163.18 256.668C162.904 256.243 163.224 253.294 163.224 253.294C163.224 253.294 162.904 250.595 162.395 247.336C161.886 244.077 162.027 231.533 162.348 230.754C162.668 229.974 162.948 226.368 162.948 226.368C162.948 226.368 162.58 224.306 163.042 222.839C163.504 221.371 161.933 215.19 161.933 214.502C161.933 213.814 161.333 209.556 161.009 209.104C160.792 208.711 160.676 208.271 160.672 207.822C160.672 207.822 160.625 206.904 159.84 204.158C159.266 202.134 159.604 198.193 159.84 196.203C159.92 195.464 159.988 194.995 159.988 194.995C159.988 194.995 186.474 190.734 187.536 191.699C187.785 191.921 187.95 192.711 188.045 193.811C188.345 197.407 187.836 204.57 186.706 207.377Z" fill="url(#paint5_linear)"/>
<g opacity="0.1">
<path opacity="0.1" d="M176.691 227.973C176.816 227.973 179.725 228.22 180.814 228.004C181.902 227.788 176.691 227.973 176.691 227.973Z" fill="url(#paint6_linear)"/>
</g>
<g opacity="0.1">
<path opacity="0.1" d="M176.907 229.684C176.907 229.684 180.952 230.386 181.154 230.021C181.356 229.657 176.907 229.684 176.907 229.684Z" fill="url(#paint7_linear)"/>
</g>
<g opacity="0.1">
<path opacity="0.1" d="M164.572 228.952C164.572 228.952 166.662 229.043 167.802 229.562C168.941 230.082 164.572 228.952 164.572 228.952Z" fill="url(#paint8_linear)"/>
</g>
<path d="M156.974 177.586C156.974 177.586 157.311 183.969 157.129 185.096C157.129 185.096 157.867 190.258 158.478 191.57C159.028 192.617 159.677 193.609 160.416 194.532L162.23 181.86L161.808 177.522L156.974 177.586Z" fill="url(#paint9_linear)"/>
<path d="M176.047 148.511C179.972 148.511 183.153 145.352 183.153 141.456C183.153 137.56 179.972 134.401 176.047 134.401C172.122 134.401 168.941 137.56 168.941 141.456C168.941 145.352 172.122 148.511 176.047 148.511Z" fill="url(#paint10_linear)"/>
<path d="M172.356 144.756C172.356 144.756 170.141 149.061 167.926 151.078C165.712 153.096 181.215 155.383 181.582 155.383C181.95 155.383 178.815 146.223 179.368 145.123C179.92 144.023 172.356 144.756 172.356 144.756Z" fill="url(#paint11_linear)"/>
<g opacity="0.1">
<path opacity="0.1" d="M188.045 193.777C187.697 194.041 187.313 194.255 186.905 194.411C184.077 195.511 180.999 197.039 178.906 196.435C176.812 195.831 172.386 196.435 172.386 196.435C172.386 196.435 163.463 195.7 161.68 196.128C161.082 196.31 160.446 196.327 159.839 196.176C159.92 195.437 159.988 194.968 159.988 194.968C159.988 194.968 186.474 190.707 187.536 191.672C187.785 191.887 187.95 192.667 188.045 193.777Z" fill="url(#paint12_linear)"/>
</g>
<path d="M189.983 189.708C189.983 189.708 189.737 192.745 186.905 193.861C184.073 194.978 180.999 196.489 178.906 195.886C176.812 195.282 172.386 195.886 172.386 195.886C172.386 195.886 163.463 195.15 161.68 195.579C159.897 196.007 158.983 195.457 159.526 194.661C160.068 193.865 160.021 191.243 160.021 190.143C160.021 189.043 159.404 184.583 159.957 183.791C160.51 182.998 161.002 179.944 162.111 179.455C162.277 179.386 162.426 179.28 162.545 179.146C162.665 179.012 162.753 178.852 162.802 178.679C162.899 178.313 162.899 177.928 162.802 177.562C162.802 177.562 162.617 177.411 162.357 177.181C161.707 176.604 160.601 175.531 160.955 175.181C161.447 174.691 160.955 171.513 160.955 171.513C160.955 171.513 159.785 169.071 160.217 168.156C160.648 167.242 156.465 162.421 156.465 162.421C156.465 162.421 156.465 154.115 161.521 153.747C161.521 153.747 165.088 153.872 165.519 152.283C165.951 150.694 168.779 149.776 168.779 149.776L175.238 151.183C175.238 151.183 180.969 152.404 182.007 151.672C183.045 150.94 183.854 152.647 183.854 152.647C183.854 152.647 187.421 152.833 187.792 153.565C188.162 154.297 186.622 161.443 186.622 161.443C186.622 161.443 184.036 161.2 184.222 163.949C184.407 166.699 183.237 170.177 183.237 170.177C183.237 170.177 183.052 172.202 183.177 172.62C183.301 173.038 182.934 174.55 182.877 174.789V174.82C182.877 174.82 182.62 175.832 182.954 176.206C182.986 176.238 183.023 176.265 183.062 176.287C183.554 176.53 184.292 178.912 184.292 178.912C184.677 179.373 184.876 179.962 184.849 180.562C184.788 181.54 185.155 183.858 186.753 185.204C188.351 186.55 189.983 189.708 189.983 189.708Z" fill="url(#paint13_linear)"/>
<path d="M162.539 175.568V175.828L162.425 178.686C162.425 178.686 158.642 178.989 156.579 178.47C154.516 177.95 155.389 175.693 155.47 175.221C155.531 174.792 156.084 171.22 156.084 170.639C156.084 170.059 156.084 167.677 155.993 166.591C155.902 165.504 156.455 162.438 156.455 162.438L156.852 161.948L161.191 163.598L162.539 175.568Z" fill="url(#paint14_linear)"/>
<g opacity="0.1">
<path opacity="0.1" d="M162.533 175.835L162.418 178.693C162.418 178.693 158.636 178.996 156.573 178.477C154.51 177.957 155.383 175.7 155.464 175.228L162.533 175.835Z" fill="url(#paint15_linear)"/>
</g>
<g opacity="0.1">
<path opacity="0.1" d="M162.819 178.672C162.916 178.306 162.916 177.921 162.819 177.556C162.819 177.556 162.634 177.404 162.375 177.174C165.634 176.726 178.535 174.964 182.884 174.776V174.806C182.884 174.806 182.627 175.818 182.961 176.193L162.819 178.672Z" fill="url(#paint16_linear)"/>
</g>
<g opacity="0.1">
<path opacity="0.1" d="M183.338 180.896C183.338 180.896 184.137 185.386 181.154 186.968C181.154 186.968 182.846 184.732 183.338 180.896Z" fill="url(#paint17_linear)"/>
</g>
<g opacity="0.1">
<path opacity="0.1" d="M163.804 187.083C163.804 187.083 171.001 185.862 172.417 186.806C173.832 187.751 163.804 187.083 163.804 187.083Z" fill="url(#paint18_linear)"/>
</g>
<g opacity="0.1">
<path opacity="0.1" d="M180.844 159.263C180.844 159.263 179.738 163.78 180.568 164.82C181.397 165.859 180.844 159.263 180.844 159.263Z" fill="url(#paint19_linear)"/>
</g>
<g opacity="0.1">
<path opacity="0.1" d="M159.988 155.565C159.988 155.565 160.999 157.252 160.389 158.986C159.779 160.72 159.988 155.565 159.988 155.565Z" fill="url(#paint20_linear)"/>
</g>
<path d="M157.897 170.285C157.897 170.285 159.189 171.051 158.757 172.242C158.326 173.433 157.897 170.285 157.897 170.285Z" fill="url(#paint21_linear)"/>
<g opacity="0.1">
<path opacity="0.1" d="M157.763 166.803C157.763 166.803 158.963 167.448 159.111 168.392C159.259 169.337 157.763 166.803 157.763 166.803Z" fill="url(#paint22_linear)"/>
</g>
<g opacity="0.1">
<path opacity="0.1" d="M175.555 203.328C175.555 203.328 183.092 204.094 184.599 202.316C184.599 202.323 177.8 203.665 175.555 203.328Z" fill="url(#paint23_linear)"/>
</g>
<g opacity="0.1">
<path opacity="0.1" d="M162.543 202.903C162.543 202.903 170.633 204.796 172.231 203.298C172.231 203.298 165.28 203.817 162.543 202.903Z" fill="url(#paint24_linear)"/>
</g>
<g opacity="0.1">
<path opacity="0.1" d="M176.138 205.804C176.138 205.804 179.509 205.804 181.09 205.896C182.671 205.987 176.138 205.804 176.138 205.804Z" fill="url(#paint25_linear)"/>
</g>
<g opacity="0.1">
<path opacity="0.1" d="M163.096 207.238C163.096 207.238 164.758 209.1 166.632 208.766C168.506 208.432 163.096 207.238 163.096 207.238Z" fill="url(#paint26_linear)"/>
</g>
<path d="M166.359 130.963C165.836 131.766 165.82 132.694 165.685 133.585C165.313 135.774 164.283 137.797 162.732 139.384C161.255 140.943 159.229 142.353 158.848 144.256C158.488 146.064 159.715 147.802 160.359 149.56C162.044 154.199 159.684 159.06 158.993 163.848C158.804 165.17 159.034 166.86 160.679 167.299C161.191 167.437 161.778 167.42 162.236 167.636C162.856 167.93 163.045 168.541 163.16 169.09C163.57 171.056 163.712 173.068 163.581 175.072C163.507 176.199 163.426 177.491 164.495 178.264C165.04 178.6 165.64 178.838 166.268 178.966C167.953 179.418 170.134 179.779 171.27 178.723C171.749 178.281 171.945 177.653 172.521 177.302C173.411 176.779 174.675 177.134 175.798 177.188C176.858 177.233 177.912 176.994 178.849 176.494C179.786 175.995 180.573 175.253 181.127 174.347C182.034 172.724 181.956 170.875 181.619 169.128C181.282 167.38 180.702 165.653 180.659 163.885C180.606 163.265 180.745 162.645 181.056 162.107C181.731 161.054 183.339 160.575 184.427 159.745C186.47 158.193 186.45 155.649 185.722 153.52C184.994 151.392 183.645 149.357 183.48 147.157C183.408 146.625 183.514 146.084 183.784 145.619C184.14 145.178 184.558 144.789 185.024 144.465C188.007 141.965 187.657 137.856 185.189 135.046C182.452 131.918 170.084 125.204 166.359 130.963Z" fill="url(#paint27_linear)"/>
<g opacity="0.1">
<path opacity="0.1" d="M160.736 151.48C161.03 149.633 160.869 147.743 160.268 145.974C159.931 145.086 159.469 144.202 159.128 143.315C158.957 143.633 158.832 143.974 158.757 144.327C158.393 146.132 159.624 147.87 160.268 149.631C160.485 150.23 160.642 150.849 160.736 151.48Z" fill="url(#paint28_linear)"/>
<path opacity="0.1" d="M163.494 171.486C163.625 169.482 163.482 167.47 163.069 165.504C162.954 164.954 162.766 164.344 162.149 164.05C161.687 163.831 161.1 163.848 160.588 163.713C160.275 163.638 159.983 163.492 159.734 163.288C159.485 163.083 159.286 162.825 159.152 162.532C159.061 162.998 158.977 163.463 158.909 163.925C158.717 165.248 158.946 166.938 160.595 167.377C161.107 167.515 161.694 167.498 162.155 167.714C162.772 168.008 162.961 168.618 163.076 169.168C163.267 170.08 163.399 171.003 163.473 171.931C163.467 171.786 163.494 171.635 163.494 171.486Z" fill="url(#paint29_linear)"/>
<path opacity="0.1" d="M181.023 170.774C180.469 171.68 179.683 172.421 178.747 172.921C177.81 173.42 176.757 173.66 175.697 173.615C174.574 173.561 173.31 173.207 172.42 173.73C171.827 174.067 171.645 174.708 171.17 175.15C170.034 176.206 167.852 175.845 166.167 175.393C165.539 175.266 164.939 175.028 164.394 174.691C163.928 174.355 163.615 173.848 163.521 173.281C163.521 173.908 163.521 174.539 163.48 175.167C163.406 176.29 163.325 177.582 164.394 178.355C164.939 178.692 165.539 178.93 166.167 179.057C167.852 179.512 170.034 179.87 171.17 178.814C171.645 178.372 171.844 177.748 172.42 177.397C173.31 176.871 174.574 177.225 175.697 177.282C176.758 177.328 177.811 177.088 178.748 176.588C179.685 176.088 180.47 175.345 181.023 174.438C181.896 172.879 181.859 171.111 181.556 169.425C181.439 169.896 181.26 170.35 181.023 170.774Z" fill="url(#paint30_linear)"/>
<path opacity="0.1" d="M184.93 140.882C184.463 141.206 184.044 141.595 183.686 142.036C183.418 142.502 183.313 143.043 183.386 143.575C183.443 144.243 183.585 144.902 183.807 145.535C184.152 145.173 184.527 144.842 184.93 144.546C186.953 142.86 187.438 140.43 186.784 138.167C186.438 139.23 185.794 140.173 184.93 140.882Z" fill="url(#paint31_linear)"/>
<path opacity="0.1" d="M184.333 156.162C183.241 156.989 181.637 157.468 180.962 158.524C180.65 159.061 180.511 159.683 180.565 160.302C180.59 161.017 180.678 161.728 180.828 162.428C180.868 162.345 180.913 162.265 180.962 162.188C181.637 161.139 183.241 160.656 184.333 159.826C186.198 158.409 186.356 156.166 185.803 154.165C185.521 154.962 185.01 155.657 184.333 156.162Z" fill="url(#paint32_linear)"/>
</g>
<path d="M198.38 156.911C197.119 160.086 195.487 161.338 195.487 161.338H194.581L186.598 161.419L185.674 158.915L186.969 153.517L187.764 153.568C188.244 153.82 188.764 153.985 189.302 154.057C189.885 154.057 191.024 154.027 191.361 154.178C191.409 154.2 191.461 154.207 191.513 154.199C191.813 154.168 192.133 153.72 192.133 153.72C192.133 153.72 199.64 153.733 198.38 156.911Z" fill="url(#paint33_linear)"/>
<g opacity="0.1">
<path opacity="0.1" d="M198.38 156.911C197.119 160.086 195.488 161.338 195.488 161.338H194.581C195.053 160.079 196.051 157.495 196.442 156.901C196.833 156.307 193.472 154.931 191.517 154.172C191.817 154.141 192.137 153.693 192.137 153.693C192.137 153.693 199.641 153.733 198.38 156.911Z" fill="url(#paint34_linear)"/>
</g>
<path d="M191.877 159.371C191.877 159.371 196.259 162.225 197.945 160.7C199.63 159.175 199.405 156.26 199.179 155.798C198.953 155.336 197.156 149.388 197.156 149.388L193.694 140.592C193.694 140.592 191.594 129.017 188.459 131.905C185.324 134.793 190.144 141.723 190.144 141.723C190.144 141.723 192.123 146.783 192.022 147.795C191.921 148.808 193.124 152.519 193.124 152.519L191.877 159.371Z" fill="#EFB7B9"/>
<path d="M183.675 262.494C183.642 262.636 183.601 262.784 183.561 262.936C183.15 264.343 182.378 264.026 180.109 266.343C179.545 266.947 178.826 267.385 178.032 267.611C177.237 267.836 176.395 267.84 175.599 267.622C175.475 267.589 175.367 267.513 175.293 267.408C175.219 267.303 175.184 267.176 175.194 267.048L175.477 263.29L175.615 261.482C175.615 261.482 179.229 262.494 181.066 261.208C181.127 261.165 181.188 261.121 181.245 261.07C181.263 261.057 181.28 261.043 181.296 261.026C181.533 260.83 181.826 260.713 182.134 260.691C182.441 260.67 182.748 260.746 183.01 260.907C183.273 261.069 183.478 261.309 183.597 261.594C183.717 261.878 183.744 262.193 183.675 262.494Z" fill="#7319D5"/>
<path d="M172.332 261.077C172.302 261.219 172.262 261.364 172.221 261.516C171.81 262.926 171.038 262.605 168.769 264.923C168.206 265.528 167.487 265.966 166.692 266.192C165.897 266.417 165.056 266.421 164.259 266.202C164.135 266.169 164.026 266.094 163.952 265.989C163.879 265.884 163.844 265.756 163.854 265.628L164.138 261.87L164.276 260.062C164.276 260.062 167.889 261.074 169.727 259.788C169.789 259.747 169.848 259.701 169.905 259.653L169.956 259.606C170.194 259.41 170.487 259.294 170.794 259.274C171.102 259.253 171.408 259.329 171.67 259.491C171.932 259.653 172.136 259.893 172.255 260.178C172.374 260.462 172.401 260.777 172.332 261.077Z" fill="#7319D5"/>
<path opacity="0.1" d="M168.6 261.64L168.749 263.594C166.676 265.665 164.205 262.582 163.477 261.57C165.385 262.541 168.6 261.64 168.6 261.64Z" fill="black"/>
<path opacity="0.1" d="M180.79 262.433L181.063 262.254C179.168 265.136 176.343 263.806 175.477 263.29L175.615 261.482C175.615 261.482 179.229 262.494 181.066 261.208C180.921 261.914 180.79 262.433 180.79 262.433Z" fill="black"/>
<path d="M186.554 207.886C185.102 211.519 183.649 223.695 183.47 225.092C183.291 226.489 183.332 232.268 183.332 232.268L182.968 246.438C182.924 248.209 181.619 252.663 181.619 252.663C181.619 252.663 181.168 256.374 181.393 257.615C181.619 258.857 180.804 262.069 180.804 262.069L181.077 261.887C178.808 265.338 175.221 262.75 175.221 262.75C175.221 262.75 174.358 258.57 175.265 257.524C176.172 256.479 174.948 253.253 174.948 253.253C174.948 253.253 175.403 236.489 175.538 235.709C175.673 234.93 174.992 232.575 174.358 230.622C173.724 228.668 174.722 220.942 174.948 219.536C175.174 218.129 174.857 211.718 174.631 210.403C174.405 209.087 174.901 203.588 174.901 203.588C173.994 200.862 173.269 203.314 173.269 203.314L172.541 210.447L171.756 225.092C171.756 225.092 171.847 229.542 171.166 230.828C170.485 232.113 169.898 235.355 169.898 235.355L170.215 251.887C170.215 251.887 170.171 255.342 170.397 256.657C170.623 257.973 169.898 261.381 169.898 261.381C167.357 267.376 163.271 260.881 163.271 260.881C163.271 260.881 163.453 259.869 163.814 259.744C164.174 259.62 163.679 257.153 163.406 256.745C163.133 256.337 163.453 253.371 163.453 253.371C163.453 253.371 163.116 250.689 162.634 247.464C162.152 244.238 162.273 231.789 162.59 231.017C162.907 230.244 163.18 226.654 163.18 226.654C163.18 226.654 162.816 224.61 163.271 223.156C163.726 221.702 162.182 215.568 162.182 214.886C162.182 214.205 161.592 209.981 161.272 209.526C161.064 209.134 160.955 208.697 160.955 208.254C160.955 208.254 160.911 207.346 160.139 204.62C159.576 202.629 159.907 198.706 160.139 196.729C160.22 195.997 160.288 195.531 160.288 195.531C160.288 195.531 186.346 191.307 187.391 192.262C187.633 192.485 187.798 193.274 187.889 194.357C188.169 197.98 187.67 205.082 186.554 207.886Z" fill="#444053"/>
<path opacity="0.1" d="M176.704 228.297C176.825 228.297 179.701 228.54 180.749 228.328C181.798 228.115 176.704 228.297 176.704 228.297Z" fill="black"/>
<path opacity="0.1" d="M176.917 229.994C176.917 229.994 180.881 230.693 181.094 230.332C181.306 229.971 176.917 229.994 176.917 229.994Z" fill="black"/>
<path opacity="0.1" d="M164.781 229.269C164.781 229.269 166.838 229.36 167.957 229.873C169.076 230.386 164.781 229.269 164.781 229.269Z" fill="black"/>
<path d="M157.304 178.321C157.304 178.321 157.641 184.651 157.456 185.771C157.456 185.771 158.184 190.892 158.787 192.181C159.329 193.218 159.968 194.202 160.695 195.12L162.482 182.562L162.061 178.261L157.304 178.321Z" fill="#EFB7B9"/>
<path d="M176.071 149.486C179.932 149.486 183.062 146.353 183.062 142.488C183.062 138.624 179.932 135.491 176.071 135.491C172.209 135.491 169.079 138.624 169.079 142.488C169.079 146.353 172.209 149.486 176.071 149.486Z" fill="#EFB7B9"/>
<path d="M172.437 145.761C172.437 145.761 170.259 150.029 168.078 152.03C165.897 154.03 181.154 156.301 181.518 156.301C181.882 156.301 178.794 147.212 179.337 146.122C179.88 145.032 172.437 145.761 172.437 145.761Z" fill="#EFB7B9"/>
<path opacity="0.1" d="M187.873 194.391C187.531 194.653 187.154 194.865 186.753 195.022C183.969 196.111 180.942 197.626 178.882 197.019C176.823 196.412 172.477 197.019 172.477 197.019C172.477 197.019 163.713 196.294 161.946 196.715C161.353 196.894 160.722 196.907 160.123 196.752C160.203 196.02 160.271 195.555 160.271 195.555C160.271 195.555 186.329 191.331 187.374 192.286C187.616 192.508 187.782 193.281 187.873 194.391Z" fill="black"/>
<path d="M189.787 190.342C189.787 190.342 189.545 193.378 186.753 194.461C183.962 195.544 180.942 197.066 178.882 196.462C176.823 195.858 172.477 196.462 172.477 196.462C172.477 196.462 163.713 195.733 161.946 196.158C160.18 196.584 159.283 196.037 159.826 195.248C160.369 194.458 160.311 191.874 160.311 190.767C160.311 189.661 159.705 185.254 160.251 184.465C160.797 183.675 161.262 180.649 162.371 180.163C162.534 180.094 162.679 179.989 162.796 179.856C162.912 179.722 162.998 179.565 163.045 179.394C163.139 179.031 163.139 178.65 163.045 178.287C163.045 178.287 162.863 178.136 162.607 177.91C161.967 177.336 160.881 176.273 161.232 175.926C161.714 175.44 161.232 172.289 161.232 172.289C161.232 172.289 160.079 169.867 160.504 168.959C160.928 168.051 156.795 163.264 156.795 163.264C156.795 163.264 156.795 155.025 161.761 154.661C161.761 154.661 165.27 154.782 165.695 153.207C166.12 151.631 168.904 150.724 168.904 150.724L175.258 152.117C175.258 152.117 180.888 153.328 181.916 152.603C182.944 151.877 183.72 153.568 183.72 153.568C183.72 153.568 187.229 153.75 187.593 154.475C187.957 155.201 186.443 162.289 186.443 162.289C186.443 162.289 183.902 162.049 184.084 164.775C184.266 167.501 183.113 170.953 183.113 170.953C183.113 170.953 182.931 172.954 183.052 173.375C183.173 173.797 182.813 175.292 182.759 175.528V175.558C182.759 175.558 182.509 176.57 182.836 176.931C182.866 176.965 182.901 176.992 182.941 177.012C183.426 177.252 184.154 179.617 184.154 179.617C184.531 180.075 184.725 180.657 184.697 181.25C184.637 182.221 185.001 184.522 186.575 185.855C188.149 187.188 189.787 190.342 189.787 190.342Z" fill="#7319D5"/>
<path d="M162.782 176.321V176.577L162.671 179.411C162.671 179.411 158.963 179.715 156.94 179.199C154.918 178.682 155.767 176.446 155.845 175.977C155.905 175.551 156.451 172.006 156.451 171.432C156.451 170.859 156.451 168.494 156.36 167.404C156.269 166.314 156.812 163.284 156.812 163.284L157.206 162.799L161.474 164.435L162.782 176.321Z" fill="#7319D5"/>
<path opacity="0.1" d="M162.772 176.577L162.661 179.411C162.661 179.411 158.953 179.715 156.93 179.199C154.907 178.683 155.757 176.446 155.834 175.977L162.772 176.577Z" fill="black"/>
<path opacity="0.1" d="M163.042 179.398C163.135 179.035 163.135 178.654 163.042 178.291C163.042 178.291 162.86 178.139 162.604 177.913C165.813 177.468 178.505 175.724 182.782 175.552V175.582C182.782 175.582 182.533 176.594 182.86 176.955L163.042 179.398Z" fill="black"/>
<path opacity="0.1" d="M183.241 181.591C183.241 181.591 184.029 186.044 181.093 187.62C181.093 187.62 182.759 185.41 183.241 181.591Z" fill="black"/>
<path opacity="0.1" d="M164.022 187.741C164.022 187.741 171.102 186.53 172.497 187.468C173.893 188.406 164.022 187.741 164.022 187.741Z" fill="black"/>
<path opacity="0.1" d="M180.79 160.147C180.79 160.147 179.701 164.631 180.517 165.66C181.333 166.689 180.79 160.147 180.79 160.147Z" fill="black"/>
<path opacity="0.1" d="M160.271 156.483C160.271 156.483 161.282 158.146 160.665 159.874C160.048 161.601 160.271 156.483 160.271 156.483Z" fill="black"/>
<path d="M158.214 171.081C158.214 171.081 159.485 171.841 159.06 173.021C158.636 174.202 158.214 171.081 158.214 171.081Z" fill="#7319D5"/>
<path opacity="0.1" d="M158.1 167.63C158.1 167.63 159.279 168.264 159.431 169.202C159.583 170.14 158.1 167.63 158.1 167.63Z" fill="black"/>
<path opacity="0.1" d="M175.585 203.854C175.585 203.854 183.002 204.613 184.481 202.842C184.481 202.856 177.793 204.175 175.585 203.854Z" fill="black"/>
<path opacity="0.1" d="M162.782 203.429C162.782 203.429 170.741 205.308 172.315 203.824C172.315 203.837 165.476 204.34 162.782 203.429Z" fill="black"/>
<path opacity="0.1" d="M176.158 206.307C176.158 206.307 179.489 206.307 181.033 206.398C182.577 206.489 176.158 206.307 176.158 206.307Z" fill="black"/>
<path opacity="0.1" d="M163.328 207.731C163.328 207.731 164.963 209.58 166.807 209.246C168.651 208.912 163.328 207.731 163.328 207.731Z" fill="black"/>
<path d="M166.527 132.064C166.015 132.86 165.998 133.781 165.853 134.665C165.486 136.827 164.473 138.826 162.947 140.4C161.498 141.945 159.505 143.346 159.128 145.231C158.774 147.023 159.981 148.747 160.614 150.491C162.3 155.09 159.94 159.914 159.266 164.661C159.077 165.974 159.303 167.65 160.918 168.086C161.423 168.22 162 168.204 162.455 168.423C163.062 168.713 163.247 169.32 163.358 169.863C163.764 171.814 163.905 173.81 163.776 175.798C163.702 176.915 163.621 178.197 164.673 178.966C165.21 179.298 165.801 179.533 166.419 179.661C168.078 180.11 170.222 180.464 171.341 179.418C171.809 178.979 171.985 178.359 172.571 178.011C173.448 177.492 174.692 177.842 175.794 177.896C176.84 177.94 177.878 177.701 178.8 177.206C179.722 176.71 180.494 175.976 181.036 175.079C181.929 173.467 181.852 171.638 181.521 169.904C181.191 168.17 180.618 166.456 180.577 164.702C180.525 164.088 180.661 163.474 180.968 162.94C181.643 161.895 183.21 161.419 184.286 160.599C186.308 159.061 186.288 156.551 185.56 154.425C184.832 152.3 183.514 150.296 183.352 148.113C183.28 147.586 183.385 147.05 183.648 146.588C184.012 146.16 184.433 145.784 184.899 145.471C187.835 142.991 187.488 138.916 185.061 136.129C182.371 133.025 170.201 126.369 166.527 132.064Z" fill="#E3787D"/>
<g opacity="0.1">
<path opacity="0.1" d="M161.009 152.428C161.295 150.596 161.135 148.722 160.544 146.965C160.227 146.085 159.761 145.211 159.421 144.331C159.254 144.65 159.131 144.99 159.057 145.343C158.703 147.134 159.91 148.858 160.544 150.602C160.759 151.194 160.915 151.805 161.009 152.428Z" fill="black"/>
<path opacity="0.1" d="M163.712 172.272C163.841 170.284 163.701 168.288 163.294 166.338C163.183 165.795 162.998 165.187 162.391 164.897C161.936 164.678 161.359 164.695 160.854 164.56C160.546 164.484 160.258 164.339 160.014 164.136C159.769 163.933 159.574 163.678 159.441 163.389C159.35 163.848 159.269 164.31 159.202 164.769C159.013 166.081 159.239 167.758 160.854 168.193C161.359 168.328 161.936 168.312 162.391 168.531C162.998 168.824 163.183 169.428 163.294 169.975C163.481 170.879 163.612 171.794 163.685 172.714C163.692 172.566 163.702 172.417 163.712 172.272Z" fill="black"/>
<path opacity="0.1" d="M180.972 171.554C180.431 172.45 179.659 173.185 178.736 173.681C177.814 174.176 176.776 174.415 175.73 174.371C174.628 174.317 173.37 173.966 172.507 174.486C171.924 174.823 171.746 175.454 171.277 175.892C170.158 176.938 168.014 176.584 166.355 176.135C165.738 176.008 165.147 175.772 164.613 175.437C164.155 175.1 163.846 174.6 163.75 174.04C163.75 174.661 163.75 175.285 163.712 175.906C163.638 177.023 163.557 178.305 164.613 179.074C165.148 179.406 165.738 179.641 166.355 179.769C168.014 180.218 170.158 180.572 171.277 179.529C171.746 179.087 171.924 178.467 172.507 178.119C173.384 177.6 174.628 177.95 175.73 178.004C176.776 178.048 177.814 177.81 178.736 177.314C179.659 176.819 180.431 176.084 180.972 175.187C181.832 173.639 181.795 171.888 181.494 170.214C181.38 170.682 181.204 171.132 180.972 171.554Z" fill="black"/>
<path opacity="0.1" d="M184.808 141.918C184.348 142.24 183.936 142.625 183.584 143.062C183.32 143.524 183.216 144.06 183.287 144.587C183.347 145.251 183.487 145.904 183.706 146.534C184.042 146.173 184.411 145.844 184.808 145.552C186.793 143.865 187.275 141.47 186.632 139.226C186.293 140.279 185.66 141.214 184.808 141.918Z" fill="black"/>
<path opacity="0.1" d="M184.221 157.074C183.146 157.893 181.578 158.369 180.904 159.412C180.598 159.946 180.461 160.562 180.513 161.176C180.539 161.885 180.626 162.591 180.773 163.285C180.81 163.202 180.854 163.123 180.904 163.049C181.578 162.003 183.146 161.527 184.221 160.707C186.055 159.3 186.21 157.077 185.667 155.093C185.39 155.881 184.887 156.569 184.221 157.074Z" fill="black"/>
</g>
<path d="M198.043 157.816C196.802 160.967 195.194 162.201 195.194 162.201H194.301L186.45 162.282L185.543 159.799L186.814 154.438L187.599 154.469C188.071 154.719 188.584 154.883 189.113 154.955C189.689 154.955 190.798 154.924 191.135 155.076C191.182 155.096 191.233 155.103 191.284 155.096C191.58 155.066 191.891 154.621 191.891 154.621C191.891 154.621 199.28 154.664 198.043 157.816Z" fill="#7319D5"/>
<path opacity="0.1" d="M198.043 157.816C196.802 160.967 195.194 162.202 195.194 162.202H194.301C194.769 160.953 195.75 158.393 196.135 157.816C196.519 157.239 193.212 155.862 191.291 155.117C191.587 155.086 191.897 154.641 191.897 154.641C191.897 154.641 199.28 154.664 198.043 157.816Z" fill="black"/>
<defs>
<linearGradient id="paint0_linear" x1="193.623" y1="160.272" x2="193.623" y2="130.333" gradientUnits="userSpaceOnUse">
<stop stop-color="#808080" stop-opacity="0.25"/>
<stop offset="0.54" stop-color="#808080" stop-opacity="0.12"/>
<stop offset="1" stop-color="#808080" stop-opacity="0.1"/>
</linearGradient>
<linearGradient id="paint1_linear" x1="5380.54" y1="6313.19" x2="5380.54" y2="6161.54" gradientUnits="userSpaceOnUse">
<stop stop-color="#808080" stop-opacity="0.25"/>
<stop offset="0.54" stop-color="#808080" stop-opacity="0.12"/>
<stop offset="1" stop-color="#808080" stop-opacity="0.1"/>
</linearGradient>
<linearGradient id="paint2_linear" x1="5072.2" y1="6284.01" x2="5072.2" y2="6132.3" gradientUnits="userSpaceOnUse">
<stop stop-color="#808080" stop-opacity="0.25"/>
<stop offset="0.54" stop-color="#808080" stop-opacity="0.12"/>
<stop offset="1" stop-color="#808080" stop-opacity="0.1"/>
</linearGradient>
<linearGradient id="paint3_linear" x1="3171.31" y1="2563.57" x2="3171.31" y2="2541.1" gradientUnits="userSpaceOnUse">
<stop stop-color="#808080" stop-opacity="0.25"/>
<stop offset="0.54" stop-color="#808080" stop-opacity="0.12"/>
<stop offset="1" stop-color="#808080" stop-opacity="0.1"/>
</linearGradient>
<linearGradient id="paint4_linear" x1="3571.48" y1="2653.13" x2="3571.48" y2="2628.82" gradientUnits="userSpaceOnUse">
<stop stop-color="#808080" stop-opacity="0.25"/>
<stop offset="0.54" stop-color="#808080" stop-opacity="0.12"/>
<stop offset="1" stop-color="#808080" stop-opacity="0.1"/>
</linearGradient>
<linearGradient id="paint5_linear" x1="16884.3" y1="60614.3" x2="16884.3" y2="45090.9" gradientUnits="userSpaceOnUse">
<stop stop-color="#808080" stop-opacity="0.25"/>
<stop offset="0.54" stop-color="#808080" stop-opacity="0.12"/>
<stop offset="1" stop-color="#808080" stop-opacity="0.1"/>
</linearGradient>
<linearGradient id="paint6_linear" x1="2737.92" y1="368.759" x2="2737.92" y2="368.649" gradientUnits="userSpaceOnUse">
<stop stop-color="#808080" stop-opacity="0.25"/>
<stop offset="0.54" stop-color="#808080" stop-opacity="0.12"/>
<stop offset="1" stop-color="#808080" stop-opacity="0.1"/>
</linearGradient>
<linearGradient id="paint7_linear" x1="2729.84" y1="555.035" x2="2729.84" y2="554.455" gradientUnits="userSpaceOnUse">
<stop stop-color="#808080" stop-opacity="0.25"/>
<stop offset="0.54" stop-color="#808080" stop-opacity="0.12"/>
<stop offset="1" stop-color="#808080" stop-opacity="0.1"/>
</linearGradient>
<linearGradient id="paint8_linear" x1="2086.97" y1="777.208" x2="2086.97" y2="775.556" gradientUnits="userSpaceOnUse">
<stop stop-color="#808080" stop-opacity="0.25"/>
<stop offset="0.54" stop-color="#808080" stop-opacity="0.12"/>
<stop offset="1" stop-color="#808080" stop-opacity="0.1"/>
</linearGradient>
<linearGradient id="paint9_linear" x1="3007.81" y1="10884.3" x2="3007.81" y2="10026.8" gradientUnits="userSpaceOnUse">
<stop stop-color="#808080" stop-opacity="0.25"/>
<stop offset="0.54" stop-color="#808080" stop-opacity="0.12"/>
<stop offset="1" stop-color="#808080" stop-opacity="0.1"/>
</linearGradient>
<linearGradient id="paint10_linear" x1="7591.07" y1="6345.11" x2="7591.07" y2="5755.07" gradientUnits="userSpaceOnUse">
<stop stop-color="#808080" stop-opacity="0.25"/>
<stop offset="0.54" stop-color="#808080" stop-opacity="0.12"/>
<stop offset="1" stop-color="#808080" stop-opacity="0.1"/>
</linearGradient>
<linearGradient id="paint11_linear" x1="8330.21" y1="5722.98" x2="8330.21" y2="5372.98" gradientUnits="userSpaceOnUse">
<stop stop-color="#808080" stop-opacity="0.25"/>
<stop offset="0.54" stop-color="#808080" stop-opacity="0.12"/>
<stop offset="1" stop-color="#808080" stop-opacity="0.1"/>
</linearGradient>
<linearGradient id="paint12_linear" x1="16659.6" y1="3395.92" x2="16659.6" y2="3320.53" gradientUnits="userSpaceOnUse">
<stop stop-color="#808080" stop-opacity="0.25"/>
<stop offset="0.54" stop-color="#808080" stop-opacity="0.12"/>
<stop offset="1" stop-color="#808080" stop-opacity="0.1"/>
</linearGradient>
<linearGradient id="paint13_linear" x1="19692" y1="29462.2" x2="19692" y2="23121.7" gradientUnits="userSpaceOnUse">
<stop stop-color="#808080" stop-opacity="0.25"/>
<stop offset="0.54" stop-color="#808080" stop-opacity="0.12"/>
<stop offset="1" stop-color="#808080" stop-opacity="0.1"/>
</linearGradient>
<linearGradient id="paint14_linear" x1="4110.88" y1="9966.37" x2="4110.88" y2="9125.77" gradientUnits="userSpaceOnUse">
<stop stop-color="#808080" stop-opacity="0.25"/>
<stop offset="0.54" stop-color="#808080" stop-opacity="0.12"/>
<stop offset="1" stop-color="#808080" stop-opacity="0.1"/>
</linearGradient>
<linearGradient id="paint15_linear" x1="4110.73" y1="2245.62" x2="4110.73" y2="2208.21" gradientUnits="userSpaceOnUse">
<stop stop-color="#808080" stop-opacity="0.25"/>
<stop offset="0.54" stop-color="#808080" stop-opacity="0.12"/>
<stop offset="1" stop-color="#808080" stop-opacity="0.1"/>
</linearGradient>
<linearGradient id="paint16_linear" x1="12125.5" y1="2444.27" x2="12125.5" y2="2399.26" gradientUnits="userSpaceOnUse">
<stop stop-color="#808080" stop-opacity="0.25"/>
<stop offset="0.54" stop-color="#808080" stop-opacity="0.12"/>
<stop offset="1" stop-color="#808080" stop-opacity="0.1"/>
</linearGradient>
<linearGradient id="paint17_linear" x1="1572.37" y1="3866.98" x2="1572.37" y2="3757.55" gradientUnits="userSpaceOnUse">
<stop stop-color="#808080" stop-opacity="0.25"/>
<stop offset="0.54" stop-color="#808080" stop-opacity="0.12"/>
<stop offset="1" stop-color="#808080" stop-opacity="0.1"/>
</linearGradient>
<linearGradient id="paint18_linear" x1="5132.84" y1="711.98" x2="5132.84" y2="709.768" gradientUnits="userSpaceOnUse">
<stop stop-color="#808080" stop-opacity="0.25"/>
<stop offset="0.54" stop-color="#808080" stop-opacity="0.12"/>
<stop offset="1" stop-color="#808080" stop-opacity="0.1"/>
</linearGradient>
<linearGradient id="paint19_linear" x1="643.169" y1="3229.31" x2="643.169" y2="3134.1" gradientUnits="userSpaceOnUse">
<stop stop-color="#808080" stop-opacity="0.25"/>
<stop offset="0.54" stop-color="#808080" stop-opacity="0.12"/>
<stop offset="1" stop-color="#808080" stop-opacity="0.1"/>
</linearGradient>
<linearGradient id="paint20_linear" x1="503.711" y1="2139.28" x2="503.711" y2="2096.94" gradientUnits="userSpaceOnUse">
<stop stop-color="#808080" stop-opacity="0.25"/>
<stop offset="0.54" stop-color="#808080" stop-opacity="0.12"/>
<stop offset="1" stop-color="#808080" stop-opacity="0.1"/>
</linearGradient>
<linearGradient id="paint21_linear" x1="668.588" y1="1426.03" x2="668.588" y2="1411.34" gradientUnits="userSpaceOnUse">
<stop stop-color="#808080" stop-opacity="0.25"/>
<stop offset="0.54" stop-color="#808080" stop-opacity="0.12"/>
<stop offset="1" stop-color="#808080" stop-opacity="0.1"/>
</linearGradient>
<linearGradient id="paint22_linear" x1="890.21" y1="1161.46" x2="890.21" y2="1151.85" gradientUnits="userSpaceOnUse">
<stop stop-color="#808080" stop-opacity="0.25"/>
<stop offset="0.54" stop-color="#808080" stop-opacity="0.12"/>
<stop offset="1" stop-color="#808080" stop-opacity="0.1"/>
</linearGradient>
<linearGradient id="paint23_linear" x1="5631.02" y1="973.855" x2="5631.02" y2="969.774" gradientUnits="userSpaceOnUse">
<stop stop-color="#808080" stop-opacity="0.25"/>
<stop offset="0.54" stop-color="#808080" stop-opacity="0.12"/>
<stop offset="1" stop-color="#808080" stop-opacity="0.1"/>
</linearGradient>
<linearGradient id="paint24_linear" x1="5641.71" y1="841.363" x2="5641.71" y2="838.565" gradientUnits="userSpaceOnUse">
<stop stop-color="#808080" stop-opacity="0.25"/>
<stop offset="0.54" stop-color="#808080" stop-opacity="0.12"/>
<stop offset="1" stop-color="#808080" stop-opacity="0.1"/>
</linearGradient>
<linearGradient id="paint25_linear" x1="3291.32" y1="283.125" x2="3291.32" y2="283.085" gradientUnits="userSpaceOnUse">
<stop stop-color="#808080" stop-opacity="0.25"/>
<stop offset="0.54" stop-color="#808080" stop-opacity="0.12"/>
<stop offset="1" stop-color="#808080" stop-opacity="0.1"/>
</linearGradient>
<linearGradient id="paint26_linear" x1="2359.03" y1="1260.78" x2="2359.03" y2="1253.49" gradientUnits="userSpaceOnUse">
<stop stop-color="#808080" stop-opacity="0.25"/>
<stop offset="0.54" stop-color="#808080" stop-opacity="0.12"/>
<stop offset="1" stop-color="#808080" stop-opacity="0.1"/>
</linearGradient>
<linearGradient id="paint27_linear" x1="16671.9" y1="29768.1" x2="16671.9" y2="22148.9" gradientUnits="userSpaceOnUse">
<stop stop-color="#808080" stop-opacity="0.25"/>
<stop offset="0.54" stop-color="#808080" stop-opacity="0.12"/>
<stop offset="1" stop-color="#808080" stop-opacity="0.1"/>
</linearGradient>
<linearGradient id="paint28_linear" x1="1346.46" y1="4240.36" x2="1346.46" y2="4042.78" gradientUnits="userSpaceOnUse">
<stop stop-color="#808080" stop-opacity="0.25"/>
<stop offset="0.54" stop-color="#808080" stop-opacity="0.12"/>
<stop offset="1" stop-color="#808080" stop-opacity="0.1"/>
</linearGradient>
<linearGradient id="paint29_linear" x1="2724.49" y1="5449.02" x2="2724.49" y2="5187.06" gradientUnits="userSpaceOnUse">
<stop stop-color="#808080" stop-opacity="0.25"/>
<stop offset="0.54" stop-color="#808080" stop-opacity="0.12"/>
<stop offset="1" stop-color="#808080" stop-opacity="0.1"/>
</linearGradient>
<linearGradient id="paint30_linear" x1="10801.6" y1="6063.53" x2="10801.6" y2="5762.49" gradientUnits="userSpaceOnUse">
<stop stop-color="#808080" stop-opacity="0.25"/>
<stop offset="0.54" stop-color="#808080" stop-opacity="0.12"/>
<stop offset="1" stop-color="#808080" stop-opacity="0.1"/>
</linearGradient>
<linearGradient id="paint31_linear" x1="2467.49" y1="3705.82" x2="2467.49" y2="3544.89" gradientUnits="userSpaceOnUse">
<stop stop-color="#808080" stop-opacity="0.25"/>
<stop offset="0.54" stop-color="#808080" stop-opacity="0.12"/>
<stop offset="1" stop-color="#808080" stop-opacity="0.1"/>
</linearGradient>
<linearGradient id="paint32_linear" x1="3569.19" y1="4568.34" x2="3569.19" y2="4366.08" gradientUnits="userSpaceOnUse">
<stop stop-color="#808080" stop-opacity="0.25"/>
<stop offset="0.54" stop-color="#808080" stop-opacity="0.12"/>
<stop offset="1" stop-color="#808080" stop-opacity="0.1"/>
</linearGradient>
<linearGradient id="paint33_linear" x1="8393.77" y1="4351.55" x2="8393.77" y2="4166.34" gradientUnits="userSpaceOnUse">
<stop stop-color="#808080" stop-opacity="0.25"/>
<stop offset="0.54" stop-color="#808080" stop-opacity="0.12"/>
<stop offset="1" stop-color="#808080" stop-opacity="0.1"/>
</linearGradient>
<linearGradient id="paint34_linear" x1="4728.14" y1="4213.66" x2="4728.14" y2="4040.43" gradientUnits="userSpaceOnUse">
<stop stop-color="#808080" stop-opacity="0.25"/>
<stop offset="0.54" stop-color="#808080" stop-opacity="0.12"/>
<stop offset="1" stop-color="#808080" stop-opacity="0.1"/>
</linearGradient>
</defs>
</svg>
