<svg width="24" height="24" viewBox="0 0 24 24" fill="none" xmlns="http://www.w3.org/2000/svg">
<path d="M12 3C16.95 3 21 7.05 21 12C21 16.95 16.95 21 12 21C7.05 21 3 16.95 3 12C3 7.05 7.05 3 12 3ZM12 1.5C6.225 1.5 1.5 6.225 1.5 12C1.5 17.775 6.225 22.5 12 22.5C17.775 22.5 22.5 17.775 22.5 12C22.5 6.225 17.775 1.5 12 1.5Z" fill="#7319D5"/>
<path d="M15.7125 7.22703L12.0002 10.9393L8.28786 7.22703L7.2272 8.28769L10.9395 12L7.2272 15.7123L8.28786 16.773L12.0002 13.0607L15.7125 16.773L16.7731 15.7123L13.0608 12L16.7731 8.28769L15.7125 7.22703Z" fill="#7319D5"/>
</svg>
