<svg width="260" height="187" viewBox="0 0 260 187" fill="none" xmlns="http://www.w3.org/2000/svg">
<g clip-path="url(#clip0_12161_123286)">
<path d="M259.624 185.566H0.375723C0.276075 185.566 0.180508 185.526 0.110046 185.456C0.0395847 185.386 0 185.291 0 185.191C0 185.092 0.0395847 184.997 0.110046 184.927C0.180508 184.857 0.276075 184.817 0.375723 184.817H259.624C259.724 184.817 259.819 184.857 259.89 184.927C259.96 184.997 260 185.092 260 185.191C260 185.291 259.96 185.386 259.89 185.456C259.819 185.526 259.724 185.566 259.624 185.566Z" fill="#999999"/>
<path d="M233.964 120.323H81.4207C80.773 120.323 80.1518 120.579 79.6938 121.035C79.2358 121.491 78.9785 122.11 78.9785 122.755C78.9785 123.4 79.2358 124.018 79.6938 124.474C80.1518 124.93 80.773 125.186 81.4207 125.186H85.7415V183.358C85.7415 184.003 85.9988 184.621 86.4568 185.077C86.9148 185.533 87.536 185.789 88.1837 185.789C88.8314 185.789 89.4526 185.533 89.9106 185.077C90.3686 184.621 90.6259 184.003 90.6259 183.358L90.663 125.186H224.383V183.358C224.383 184.003 224.64 184.621 225.098 185.077C225.556 185.533 226.178 185.789 226.825 185.789C227.473 185.789 228.094 185.533 228.552 185.077C229.01 184.621 229.268 184.003 229.268 183.358V126.469L229.978 125.186H233.964C234.612 125.186 235.233 124.93 235.691 124.474C236.149 124.018 236.406 123.4 236.406 122.755C236.406 122.11 236.149 121.491 235.691 121.035C235.233 120.579 234.612 120.323 233.964 120.323Z" fill="#999999"/>
<path d="M165.992 121.596H119.785C118.891 121.595 118.033 121.241 117.4 120.611C116.768 119.981 116.412 119.127 116.411 118.236V92.9069C116.412 92.0161 116.768 91.162 117.4 90.5321C118.033 89.9022 118.891 89.5479 119.785 89.5469H165.992C166.887 89.5479 167.745 89.9022 168.377 90.5321C169.01 91.162 169.366 92.0161 169.367 92.9069V118.236C169.366 119.127 169.01 119.981 168.377 120.611C167.745 121.241 166.887 121.595 165.992 121.596Z" fill="#3F3D56"/>
<path d="M165.992 92.1328H119.785C119.579 92.1332 119.381 92.215 119.236 92.3601C119.09 92.5052 119.008 92.7019 119.007 92.9072V118.237C119.008 118.442 119.09 118.639 119.236 118.784C119.381 118.929 119.579 119.011 119.785 119.011H165.992C166.198 119.011 166.395 118.929 166.541 118.784C166.687 118.639 166.769 118.442 166.769 118.237V92.9072C166.769 92.7019 166.687 92.5052 166.541 92.3601C166.395 92.215 166.198 92.1332 165.992 92.1328Z" fill="white"/>
<path d="M146.829 110.066C146.829 110.066 141.298 108.797 138.255 111.124C135.213 113.45 142.127 118.738 142.127 118.738L146.829 110.066Z" fill="#333333"/>
<path d="M143.16 107.668C146.041 107.668 148.377 105.343 148.377 102.473C148.377 99.6042 146.041 97.2783 143.16 97.2783C140.278 97.2783 137.942 99.6042 137.942 102.473C137.942 105.343 140.278 107.668 143.16 107.668Z" fill="#A0616A"/>
<path d="M139.125 95.1807C139.473 94.5927 139.977 94.1119 140.582 93.7913C141.187 93.4708 141.87 93.3229 142.554 93.3642C143.269 93.4536 143.968 93.6482 144.626 93.9418L148.037 95.2665C148.92 95.6093 149.886 96.0292 150.269 96.892C150.625 97.6927 150.359 98.6175 150.091 99.4512L148.815 103.414C148.674 102.517 148.431 101.639 148.092 100.796C147.747 99.948 147.124 99.2407 146.324 98.7897C145.438 98.3372 144.394 98.3465 143.399 98.3942C141.991 98.4617 140.459 98.6401 139.458 99.6294C138.927 100.191 138.567 100.892 138.419 101.649C138.275 102.403 138.202 103.168 138.202 103.936C137.624 102.947 137.137 101.908 136.748 100.832C136.427 100.031 136.245 99.1819 136.208 98.3203C136.174 97.4514 136.464 96.6006 137.021 95.931C137.304 95.6038 137.673 95.3617 138.086 95.2321C138.5 95.1025 138.942 95.0905 139.362 95.1974L139.125 95.1807Z" fill="#333333"/>
<path d="M155.618 114.571C155.569 114.395 155.469 114.238 155.331 114.119C155.192 114 155.022 113.924 154.84 113.901C154.828 113.893 154.816 113.885 154.803 113.878L147.014 109.532C146.791 109.408 146.529 109.374 146.282 109.437C146.035 109.501 145.822 109.656 145.688 109.872L143.558 113.306L140.349 110.111L140.298 110.061C140.133 109.897 139.916 109.796 139.684 109.775C139.452 109.755 139.22 109.817 139.029 109.95L132.628 114.413C132.616 114.413 132.605 114.417 132.594 114.417C132.288 114.468 132.008 114.621 131.801 114.852C131.594 115.083 131.472 115.376 131.455 115.685L131.29 119.011H156.854L155.618 114.571Z" fill="#119A24"/>
<path d="M169.886 118.494H164.954C164.954 118.357 164.899 118.226 164.802 118.129C164.704 118.032 164.572 117.978 164.434 117.978H162.877C162.739 117.978 162.607 118.032 162.51 118.129C162.412 118.226 162.358 118.357 162.358 118.494H160.8C160.8 118.357 160.745 118.226 160.648 118.129C160.551 118.032 160.419 117.978 160.281 117.978H158.723C158.586 117.978 158.454 118.032 158.356 118.129C158.259 118.226 158.204 118.357 158.204 118.494H156.647C156.647 118.357 156.592 118.226 156.495 118.129C156.397 118.032 156.265 117.978 156.128 117.978H154.57C154.432 117.978 154.3 118.032 154.203 118.129C154.106 118.226 154.051 118.357 154.051 118.494H152.493C152.493 118.357 152.439 118.226 152.341 118.129C152.244 118.032 152.112 117.978 151.974 117.978H150.417C150.279 117.978 150.147 118.032 150.049 118.129C149.952 118.226 149.897 118.357 149.897 118.494H148.34C148.34 118.357 148.285 118.226 148.188 118.129C148.09 118.032 147.958 117.978 147.821 117.978H146.263C146.125 117.978 145.993 118.032 145.896 118.129C145.799 118.226 145.744 118.357 145.744 118.494H144.186C144.186 118.357 144.132 118.226 144.034 118.129C143.937 118.032 143.805 117.978 143.667 117.978H142.11C141.972 117.978 141.84 118.032 141.743 118.129C141.645 118.226 141.59 118.357 141.59 118.494H140.033C140.033 118.357 139.978 118.226 139.881 118.129C139.783 118.032 139.651 117.978 139.514 117.978H137.956C137.819 117.978 137.686 118.032 137.589 118.129C137.492 118.226 137.437 118.357 137.437 118.494H135.88C135.88 118.357 135.825 118.226 135.727 118.129C135.63 118.032 135.498 117.978 135.36 117.978H133.803C133.665 117.978 133.533 118.032 133.436 118.129C133.338 118.226 133.284 118.357 133.284 118.494H131.726C131.726 118.357 131.671 118.226 131.574 118.129C131.477 118.032 131.345 117.978 131.207 117.978H129.649C129.512 117.978 129.38 118.032 129.282 118.129C129.185 118.226 129.13 118.357 129.13 118.494H127.573C127.573 118.357 127.518 118.226 127.421 118.129C127.323 118.032 127.191 117.978 127.053 117.978H125.496C125.358 117.978 125.226 118.032 125.129 118.129C125.031 118.226 124.977 118.357 124.977 118.494H123.419C123.419 118.357 123.364 118.226 123.267 118.129C123.17 118.032 123.038 117.978 122.9 117.978H121.342C121.205 117.978 121.073 118.032 120.975 118.129C120.878 118.226 120.823 118.357 120.823 118.494H115.891C115.478 118.495 115.083 118.659 114.791 118.95C114.5 119.24 114.336 119.634 114.336 120.045C114.336 120.456 114.5 120.85 114.791 121.141C115.083 121.432 115.478 121.595 115.891 121.596H169.886C170.299 121.596 170.695 121.433 170.987 121.142C171.279 120.851 171.443 120.457 171.443 120.045C171.443 119.634 171.279 119.24 170.987 118.949C170.695 118.658 170.299 118.494 169.886 118.494Z" fill="#3F3D56"/>
<path d="M107.862 109.488V119.786H81.9513C81.2571 119.81 80.5651 119.694 79.9166 119.446C79.2682 119.199 78.6765 118.823 78.1768 118.343C77.6772 117.862 77.2798 117.286 77.0084 116.65C76.737 116.013 76.5972 115.329 76.5972 114.637C76.5972 113.945 76.737 113.261 77.0084 112.624C77.2798 111.988 77.6772 111.412 78.1768 110.931C78.6765 110.451 79.2682 110.076 79.9166 109.828C80.5651 109.58 81.2571 109.464 81.9513 109.488H107.862Z" fill="#F1F1F1"/>
<path d="M108.499 119.707C108.499 119.812 108.457 119.912 108.382 119.987C108.307 120.061 108.206 120.103 108.101 120.103H81.49C80.0447 120.103 78.6586 119.531 77.6366 118.513C76.6147 117.496 76.0405 116.116 76.0405 114.677C76.0405 113.238 76.6147 111.858 77.6366 110.84C78.6586 109.823 80.0447 109.251 81.49 109.251H108.101C108.206 109.251 108.307 109.293 108.382 109.367C108.457 109.441 108.499 109.542 108.499 109.647C108.499 109.752 108.457 109.853 108.382 109.927C108.307 110.001 108.206 110.043 108.101 110.043H81.49C80.2564 110.044 79.0737 110.533 78.2019 111.402C77.33 112.271 76.8402 113.449 76.8402 114.677C76.8402 115.905 77.33 117.083 78.2019 117.952C79.0737 118.821 80.2564 119.309 81.49 119.311H108.101C108.206 119.311 108.307 119.352 108.382 119.427C108.457 119.501 108.499 119.602 108.499 119.707Z" fill="#7319D5"/>
<path d="M107.862 111.864H80.0181C80.0076 111.865 79.9972 111.863 79.9875 111.859C79.9778 111.855 79.9689 111.849 79.9615 111.841C79.954 111.834 79.9481 111.825 79.9441 111.816C79.9401 111.806 79.938 111.796 79.938 111.785C79.938 111.775 79.9401 111.764 79.9441 111.755C79.9481 111.745 79.954 111.736 79.9615 111.729C79.9689 111.722 79.9778 111.716 79.9875 111.712C79.9972 111.708 80.0076 111.706 80.0181 111.706H107.862C107.883 111.706 107.903 111.715 107.918 111.729C107.933 111.744 107.941 111.764 107.941 111.785C107.941 111.806 107.933 111.826 107.918 111.841C107.903 111.856 107.883 111.864 107.862 111.864Z" fill="#999999"/>
<path d="M107.862 113.766H80.0181C80.0076 113.766 79.9972 113.764 79.9875 113.76C79.9778 113.756 79.9689 113.75 79.9615 113.743C79.954 113.735 79.9481 113.727 79.9441 113.717C79.9401 113.707 79.938 113.697 79.938 113.687C79.938 113.676 79.9401 113.666 79.9441 113.656C79.9481 113.647 79.954 113.638 79.9615 113.63C79.9689 113.623 79.9778 113.617 79.9875 113.613C79.9972 113.609 80.0076 113.607 80.0181 113.607H107.862C107.883 113.608 107.903 113.616 107.918 113.631C107.933 113.646 107.941 113.666 107.941 113.687C107.941 113.708 107.933 113.728 107.918 113.742C107.903 113.757 107.883 113.766 107.862 113.766Z" fill="#999999"/>
<path d="M107.862 115.667H80.0181C80.0076 115.667 79.9972 115.665 79.9875 115.661C79.9778 115.657 79.9689 115.652 79.9615 115.644C79.954 115.637 79.9481 115.628 79.9441 115.618C79.9401 115.609 79.938 115.598 79.938 115.588C79.938 115.578 79.9401 115.567 79.9441 115.558C79.9481 115.548 79.954 115.539 79.9615 115.532C79.9689 115.524 79.9778 115.519 79.9875 115.515C79.9972 115.511 80.0076 115.509 80.0181 115.509H107.862C107.883 115.509 107.903 115.517 107.918 115.532C107.933 115.547 107.941 115.567 107.941 115.588C107.941 115.609 107.933 115.629 107.918 115.644C107.903 115.659 107.883 115.667 107.862 115.667Z" fill="#999999"/>
<path d="M107.862 117.568H80.0181C80.0076 117.568 79.9972 117.566 79.9875 117.562C79.9778 117.558 79.9689 117.552 79.9615 117.545C79.954 117.537 79.9481 117.528 79.9441 117.519C79.9401 117.509 79.938 117.499 79.938 117.488C79.938 117.478 79.9401 117.468 79.9441 117.458C79.9481 117.448 79.954 117.44 79.9615 117.432C79.9689 117.425 79.9778 117.419 79.9875 117.415C79.9972 117.411 80.0076 117.409 80.0181 117.409H107.862C107.883 117.409 107.903 117.418 107.918 117.433C107.933 117.447 107.941 117.467 107.941 117.488C107.941 117.509 107.933 117.529 107.918 117.544C107.903 117.559 107.883 117.567 107.862 117.568Z" fill="#999999"/>
<path d="M102.978 98.6398V108.937H77.067C76.3728 108.961 75.6808 108.846 75.0324 108.598C74.3839 108.35 73.7922 107.974 73.2925 107.494C72.7929 107.014 72.3955 106.438 72.1241 105.801C71.8528 105.165 71.7129 104.48 71.7129 103.788C71.7129 103.097 71.8528 102.412 72.1241 101.776C72.3955 101.139 72.7929 100.563 73.2925 100.083C73.7922 99.6024 74.3839 99.227 75.0324 98.9791C75.6808 98.7312 76.3728 98.6158 77.067 98.6398H102.978Z" fill="#F1F1F1"/>
<path d="M103.614 108.858C103.614 108.963 103.572 109.064 103.497 109.138C103.423 109.212 103.322 109.254 103.216 109.254H76.6052C75.8896 109.254 75.181 109.114 74.5198 108.841C73.8586 108.568 73.2579 108.169 72.7519 107.665C72.2458 107.161 71.8444 106.563 71.5706 105.905C71.2967 105.246 71.1558 104.541 71.1558 103.828C71.1558 103.116 71.2967 102.41 71.5706 101.752C71.8444 101.093 72.2458 100.495 72.7519 99.9915C73.2579 99.4877 73.8586 99.088 74.5198 98.8154C75.181 98.5427 75.8896 98.4023 76.6052 98.4023H103.216C103.322 98.4023 103.423 98.4441 103.497 98.5183C103.572 98.5926 103.614 98.6934 103.614 98.7984C103.614 98.9034 103.572 99.0042 103.497 99.0784C103.423 99.1527 103.322 99.1944 103.216 99.1944H76.6052C75.3716 99.1955 74.189 99.6842 73.3171 100.553C72.4452 101.422 71.9555 102.6 71.9555 103.828C71.9555 105.056 72.4452 106.234 73.3171 107.103C74.189 107.972 75.3716 108.461 76.6052 108.462H103.216C103.322 108.462 103.423 108.504 103.497 108.578C103.572 108.652 103.614 108.753 103.614 108.858Z" fill="#D50000"/>
<path d="M102.978 101.016H75.1338C75.1233 101.016 75.1129 101.014 75.1032 101.01C75.0935 101.006 75.0847 101 75.0772 100.993C75.0698 100.985 75.0639 100.977 75.0598 100.967C75.0558 100.957 75.0537 100.947 75.0537 100.937C75.0537 100.926 75.0558 100.916 75.0598 100.906C75.0639 100.897 75.0698 100.888 75.0772 100.88C75.0847 100.873 75.0935 100.867 75.1032 100.863C75.1129 100.859 75.1233 100.857 75.1338 100.857H102.978C102.999 100.858 103.019 100.866 103.034 100.881C103.048 100.896 103.057 100.916 103.057 100.937C103.057 100.958 103.048 100.978 103.034 100.992C103.019 101.007 102.999 101.016 102.978 101.016Z" fill="#999999"/>
<path d="M102.978 102.917H75.1338C75.1233 102.917 75.1129 102.915 75.1032 102.911C75.0935 102.907 75.0847 102.902 75.0772 102.894C75.0698 102.887 75.0639 102.878 75.0598 102.868C75.0558 102.859 75.0537 102.848 75.0537 102.838C75.0537 102.828 75.0558 102.817 75.0598 102.808C75.0639 102.798 75.0698 102.789 75.0772 102.782C75.0847 102.774 75.0935 102.769 75.1032 102.765C75.1129 102.761 75.1233 102.759 75.1338 102.759H102.978C102.999 102.759 103.019 102.767 103.034 102.782C103.048 102.797 103.057 102.817 103.057 102.838C103.057 102.859 103.048 102.879 103.034 102.894C103.019 102.909 102.999 102.917 102.978 102.917Z" fill="#999999"/>
<path d="M102.978 104.819H75.1338C75.1233 104.819 75.1129 104.817 75.1032 104.813C75.0935 104.809 75.0847 104.803 75.0772 104.796C75.0698 104.788 75.0639 104.779 75.0598 104.77C75.0558 104.76 75.0537 104.75 75.0537 104.739C75.0537 104.729 75.0558 104.719 75.0598 104.709C75.0639 104.699 75.0698 104.691 75.0772 104.683C75.0847 104.676 75.0935 104.67 75.1032 104.666C75.1129 104.662 75.1233 104.66 75.1338 104.66H102.978C102.999 104.66 103.019 104.669 103.034 104.684C103.048 104.698 103.057 104.718 103.057 104.739C103.057 104.76 103.048 104.78 103.034 104.795C103.019 104.81 102.999 104.818 102.978 104.819Z" fill="#999999"/>
<path d="M102.978 106.719H75.1338C75.1233 106.719 75.1129 106.717 75.1032 106.713C75.0935 106.709 75.0847 106.703 75.0772 106.696C75.0698 106.689 75.0639 106.68 75.0598 106.67C75.0558 106.661 75.0537 106.65 75.0537 106.64C75.0537 106.629 75.0558 106.619 75.0598 106.609C75.0639 106.6 75.0698 106.591 75.0772 106.584C75.0847 106.576 75.0935 106.57 75.1032 106.566C75.1129 106.562 75.1233 106.56 75.1338 106.561H102.978C102.999 106.561 103.019 106.569 103.034 106.584C103.048 106.599 103.057 106.619 103.057 106.64C103.057 106.661 103.048 106.681 103.034 106.696C103.019 106.71 102.999 106.719 102.978 106.719Z" fill="#999999"/>
<path d="M133.12 156.387V147.408C133.12 147.012 132.962 146.631 132.68 146.35C132.398 146.07 132.016 145.912 131.617 145.912H97.4262C97.0276 145.912 96.6454 146.07 96.3635 146.35C96.0817 146.631 95.9233 147.012 95.9233 147.408V156.387H133.12Z" fill="#999999"/>
<path d="M133.12 159.754H95.9233V171.351H133.12V159.754Z" fill="#999999"/>
<path d="M95.9233 174.717V183.695C95.9233 184.092 96.0817 184.472 96.3635 184.753C96.6454 185.034 97.0276 185.191 97.4262 185.191H131.617C132.016 185.191 132.398 185.034 132.68 184.753C132.962 184.472 133.12 184.092 133.12 183.695V174.717H95.9233Z" fill="#999999"/>
<path d="M114.334 152.646C114.956 152.646 115.461 152.143 115.461 151.524C115.461 150.904 114.956 150.401 114.334 150.401C113.711 150.401 113.207 150.904 113.207 151.524C113.207 152.143 113.711 152.646 114.334 152.646Z" fill="white"/>
<path d="M114.334 167.61C114.956 167.61 115.461 167.107 115.461 166.488C115.461 165.868 114.956 165.365 114.334 165.365C113.711 165.365 113.207 165.868 113.207 166.488C113.207 167.107 113.711 167.61 114.334 167.61Z" fill="white"/>
<path d="M114.394 182.256C115.016 182.256 115.521 181.754 115.521 181.134C115.521 180.514 115.016 180.012 114.394 180.012C113.771 180.012 113.267 180.514 113.267 181.134C113.267 181.754 113.771 182.256 114.394 182.256Z" fill="white"/>
<path d="M128.902 135.675V145.972H102.992C102.298 145.996 101.606 145.881 100.957 145.633C100.309 145.385 99.717 145.01 99.2173 144.529C98.7177 144.049 98.3204 143.473 98.049 142.836C97.7776 142.2 97.6377 141.515 97.6377 140.824C97.6377 140.132 97.7776 139.447 98.049 138.811C98.3204 138.174 98.7177 137.598 99.2173 137.118C99.717 136.638 100.309 136.262 100.957 136.014C101.606 135.766 102.298 135.651 102.992 135.675H128.902Z" fill="#F1F1F1"/>
<path d="M129.539 145.893C129.539 145.998 129.497 146.099 129.422 146.173C129.348 146.247 129.246 146.289 129.141 146.289H102.53C101.814 146.29 101.105 146.15 100.443 145.877C99.7817 145.605 99.1804 145.205 98.6739 144.702C98.1674 144.198 97.7656 143.599 97.4914 142.941C97.2173 142.282 97.0762 141.576 97.0762 140.863C97.0762 140.15 97.2173 139.444 97.4914 138.786C97.7656 138.127 98.1674 137.529 98.6739 137.025C99.1804 136.521 99.7817 136.122 100.443 135.849C101.105 135.577 101.814 135.437 102.53 135.438H129.141C129.246 135.438 129.348 135.479 129.422 135.553C129.497 135.628 129.539 135.728 129.539 135.834C129.539 135.939 129.497 136.039 129.422 136.114C129.348 136.188 129.246 136.23 129.141 136.23H102.53C101.297 136.231 100.114 136.719 99.242 137.588C98.3702 138.457 97.8804 139.635 97.8804 140.863C97.8804 142.092 98.3702 143.269 99.242 144.138C100.114 145.007 101.297 145.496 102.53 145.497H129.141C129.246 145.497 129.348 145.539 129.422 145.613C129.497 145.687 129.539 145.788 129.539 145.893Z" fill="#3F3D56"/>
<path d="M128.903 138.051H101.059C101.048 138.051 101.038 138.049 101.028 138.045C101.018 138.041 101.009 138.035 101.002 138.028C100.995 138.021 100.989 138.012 100.985 138.002C100.981 137.993 100.979 137.982 100.979 137.972C100.979 137.961 100.981 137.951 100.985 137.941C100.989 137.932 100.995 137.923 101.002 137.916C101.009 137.908 101.018 137.902 101.028 137.898C101.038 137.894 101.048 137.893 101.059 137.893H128.903C128.924 137.893 128.944 137.901 128.958 137.916C128.973 137.931 128.982 137.951 128.982 137.972C128.982 137.993 128.973 138.013 128.958 138.028C128.944 138.042 128.924 138.051 128.903 138.051Z" fill="#999999"/>
<path d="M128.903 139.952H101.059C101.048 139.952 101.038 139.95 101.028 139.947C101.018 139.943 101.009 139.937 101.002 139.929C100.995 139.922 100.989 139.913 100.985 139.904C100.981 139.894 100.979 139.884 100.979 139.873C100.979 139.863 100.981 139.852 100.985 139.843C100.989 139.833 100.995 139.824 101.002 139.817C101.009 139.81 101.018 139.804 101.028 139.8C101.038 139.796 101.048 139.794 101.059 139.794H128.903C128.924 139.794 128.944 139.802 128.958 139.817C128.973 139.832 128.982 139.852 128.982 139.873C128.982 139.894 128.973 139.914 128.958 139.929C128.944 139.944 128.924 139.952 128.903 139.952Z" fill="#999999"/>
<path d="M128.903 141.854H101.059C101.048 141.854 101.038 141.852 101.028 141.848C101.018 141.844 101.009 141.838 101.002 141.831C100.995 141.823 100.989 141.815 100.985 141.805C100.981 141.795 100.979 141.785 100.979 141.775C100.979 141.764 100.981 141.754 100.985 141.744C100.989 141.734 100.995 141.726 101.002 141.718C101.009 141.711 101.018 141.705 101.028 141.701C101.038 141.697 101.048 141.695 101.059 141.695H128.903C128.924 141.695 128.944 141.704 128.958 141.719C128.973 141.734 128.982 141.754 128.982 141.775C128.982 141.795 128.973 141.815 128.958 141.83C128.944 141.845 128.924 141.854 128.903 141.854Z" fill="#999999"/>
<path d="M128.903 143.754H101.059C101.048 143.754 101.038 143.752 101.028 143.748C101.018 143.744 101.009 143.739 101.002 143.731C100.995 143.724 100.989 143.715 100.985 143.705C100.981 143.696 100.979 143.685 100.979 143.675C100.979 143.664 100.981 143.654 100.985 143.644C100.989 143.635 100.995 143.626 101.002 143.619C101.009 143.611 101.018 143.606 101.028 143.602C101.038 143.598 101.048 143.596 101.059 143.596H128.903C128.924 143.596 128.944 143.604 128.958 143.619C128.973 143.634 128.982 143.654 128.982 143.675C128.982 143.696 128.973 143.716 128.958 143.731C128.944 143.746 128.924 143.754 128.903 143.754Z" fill="#999999"/>
<path d="M93.9722 68.4669V2.81371C93.973 2.06773 94.271 1.35255 94.8008 0.825057C95.3306 0.297568 96.0489 0.00084853 96.7981 0H148.922C149.671 0.00085347 150.389 0.297575 150.919 0.825062C151.449 1.35255 151.747 2.06773 151.748 2.81371V68.4669C151.747 69.2129 151.449 69.9281 150.919 70.4555C150.389 70.983 149.671 71.2797 148.922 71.2806H96.7981C96.0489 71.2797 95.3306 70.983 94.8008 70.4555C94.271 69.9281 93.973 69.2129 93.9722 68.4669ZM96.7981 0.62527C96.2154 0.625919 95.6567 0.856697 95.2447 1.26697C94.8326 1.67724 94.6008 2.2335 94.6002 2.81371V68.4669C94.6008 69.0471 94.8326 69.6034 95.2447 70.0136C95.6567 70.4239 96.2154 70.6547 96.7981 70.6553H148.922C149.504 70.6547 150.063 70.4239 150.475 70.0136C150.887 69.6034 151.119 69.0471 151.12 68.4669V2.81371C151.119 2.2335 150.887 1.67724 150.475 1.26697C150.063 0.856697 149.504 0.62592 148.922 0.62527H96.7981Z" fill="#CCCCCC"/>
<path d="M125.783 30.1512V16.6705C125.783 16.2975 125.932 15.9399 126.197 15.6762C126.462 15.4124 126.821 15.2641 127.196 15.2637H138.669C139.044 15.2641 139.403 15.4124 139.668 15.6762C139.933 15.9399 140.082 16.2975 140.082 16.6705V30.1512C140.082 30.5242 139.933 30.8818 139.668 31.1455C139.403 31.4093 139.044 31.5576 138.669 31.5581H127.196C126.821 31.5576 126.462 31.4093 126.197 31.1455C125.932 30.8818 125.783 30.5242 125.783 30.1512Z" fill="#E7FFAC"/>
<path d="M103.489 36.4041V22.9235C103.49 22.5505 103.639 22.1929 103.904 21.9291C104.168 21.6654 104.528 21.517 104.902 21.5166H116.376C116.75 21.517 117.109 21.6654 117.374 21.9291C117.639 22.1929 117.788 22.5505 117.789 22.9235V36.4041C117.788 36.7771 117.639 37.1347 117.374 37.3985C117.109 37.6622 116.75 37.8106 116.376 37.811H104.902C104.528 37.8106 104.168 37.6622 103.904 37.3985C103.639 37.1347 103.49 36.7771 103.489 36.4041Z" fill="#999999"/>
<path d="M121.387 55.4744V41.9938C121.387 41.6208 121.536 41.2632 121.801 40.9994C122.066 40.7357 122.425 40.5873 122.8 40.5869H134.273C134.648 40.5873 135.007 40.7357 135.272 40.9994C135.537 41.2632 135.686 41.6208 135.686 41.9938V55.4744C135.686 55.8474 135.537 56.205 135.272 56.4688C135.007 56.7325 134.648 56.8809 134.273 56.8813H122.8C122.425 56.8809 122.066 56.7325 121.801 56.4688C121.536 56.205 121.387 55.8474 121.387 55.4744Z" fill="#CAB0FF"/>
<path d="M189.952 117.107H178.146C178.034 117.107 177.924 117.133 177.823 117.182L174.844 118.667C174.746 118.709 174.662 118.778 174.603 118.867C174.545 118.955 174.513 119.059 174.513 119.165C174.513 119.271 174.545 119.375 174.603 119.463C174.662 119.552 174.746 119.621 174.844 119.663L177.823 121.148C177.924 121.197 178.034 121.223 178.146 121.222H189.952C190.114 121.232 190.274 121.177 190.396 121.07C190.519 120.963 190.594 120.812 190.605 120.65V117.68C190.594 117.518 190.519 117.367 190.396 117.26C190.274 117.153 190.114 117.098 189.952 117.107Z" fill="#3F3D56"/>
<path d="M190.605 117.679V120.649C190.594 120.811 190.519 120.962 190.396 121.069C190.274 121.176 190.114 121.231 189.952 121.222H187.6V117.106H189.952C190.114 117.097 190.274 117.152 190.396 117.259C190.519 117.366 190.594 117.517 190.605 117.679Z" fill="#7319D5"/>
<path d="M189.862 94.8857C190.397 94.656 190.974 94.5413 191.557 94.5492C192.139 94.5571 192.713 94.6875 193.241 94.9317C193.77 95.1759 194.24 95.5285 194.622 95.9663C195.004 96.4042 195.288 96.9174 195.457 97.4724C195.51 97.6484 195.55 97.8277 195.577 98.0092L212.086 106.16L215.906 103.639L220.66 109.088L214.826 113.805C214.125 114.368 213.26 114.691 212.36 114.725C211.459 114.76 210.572 114.504 209.829 113.997L193.079 102.465C192.955 102.517 192.827 102.563 192.698 102.603C192.141 102.771 191.554 102.82 190.976 102.746C190.398 102.672 189.843 102.478 189.346 102.175C188.849 101.873 188.422 101.47 188.092 100.991C187.763 100.513 187.538 99.971 187.434 99.4004C187.403 99.2349 187.383 99.0675 187.373 98.8993C187.326 98.0573 187.54 97.2212 187.985 96.5037C188.43 95.7861 189.085 95.2215 189.862 94.8857Z" fill="#FFB8B8"/>
<path d="M224.247 145.07H206.209C206.209 145.587 187.618 146.006 187.618 146.006C187.326 146.224 187.06 146.475 186.825 146.754C186.119 147.592 185.733 148.652 185.735 149.746V150.495C185.736 151.735 186.231 152.924 187.111 153.801C187.992 154.678 189.186 155.17 190.432 155.171H224.247C225.492 155.17 226.686 154.677 227.567 153.8C228.447 152.923 228.942 151.735 228.943 150.495V149.746C228.942 148.507 228.446 147.318 227.566 146.442C226.686 145.565 225.492 145.072 224.247 145.07Z" fill="#3F3D56"/>
<path d="M204.625 186.408H209.51V154.984H204.625V186.408Z" fill="#3F3D56"/>
<path d="M190.724 186.237C190.724 186.763 198.125 186.441 207.255 186.441C216.386 186.441 223.787 186.763 223.787 186.237C223.787 185.712 216.386 181.545 207.255 181.545C198.125 181.545 190.724 185.712 190.724 186.237Z" fill="#3F3D56"/>
<path d="M195.133 182.555L190.527 182.554L188.335 170.659L195.133 170.66L195.133 182.555Z" fill="#FFB8B8"/>
<path d="M196.308 187L181.455 187V186.813C181.455 186.057 181.605 185.308 181.895 184.61C182.186 183.911 182.611 183.277 183.148 182.742C183.685 182.208 184.322 181.784 185.024 181.495C185.725 181.205 186.477 181.057 187.236 181.057H187.237L196.308 181.057L196.308 187Z" fill="#333333"/>
<path d="M188.243 175.178L179.06 154.675C178.293 152.947 178.209 150.995 178.823 149.207C179.437 147.42 180.704 145.928 182.373 145.029L202.292 134.395L211.381 133.625L219.765 132.866L219.825 132.968C219.903 133.098 221.705 136.198 220.487 139.598C219.563 142.176 217.158 144.19 213.341 145.584C204.431 148.837 194.138 151.617 190.127 152.661C189.949 152.706 189.784 152.788 189.64 152.902C189.497 153.015 189.38 153.157 189.296 153.319C189.212 153.479 189.162 153.655 189.149 153.835C189.136 154.015 189.161 154.196 189.222 154.366L197.753 173.45C197.843 173.693 197.875 173.952 197.847 174.208C197.82 174.464 197.734 174.711 197.595 174.929C197.457 175.147 197.27 175.33 197.05 175.465C196.829 175.6 196.58 175.682 196.322 175.706L189.947 176.168C189.893 176.173 189.839 176.176 189.786 176.176C189.459 176.176 189.14 176.081 188.866 175.904C188.592 175.727 188.376 175.475 188.243 175.178Z" fill="#333333"/>
<path d="M197.387 182.555L192.781 182.554L190.589 170.659L197.388 170.66L197.387 182.555Z" fill="#FFB8B8"/>
<path d="M198.562 187L183.709 187V186.813C183.709 186.057 183.859 185.308 184.15 184.61C184.44 183.911 184.866 183.277 185.403 182.742C185.94 182.208 186.577 181.784 187.278 181.495C187.98 181.205 188.731 181.057 189.491 181.057H189.491L198.562 181.057L198.562 187Z" fill="#333333"/>
<path d="M190.873 176.3L181.69 155.797C180.923 154.069 180.838 152.117 181.452 150.329C182.067 148.542 183.334 147.05 185.003 146.151L204.922 135.517L214.011 134.747L222.395 133.988L222.455 134.09C222.533 134.22 224.335 137.32 223.117 140.72C222.193 143.298 219.788 145.312 215.971 146.706C207.061 149.959 196.768 152.739 192.756 153.783C192.579 153.828 192.414 153.91 192.27 154.024C192.127 154.137 192.01 154.279 191.926 154.441C191.841 154.601 191.791 154.777 191.779 154.957C191.766 155.137 191.791 155.318 191.852 155.488L200.383 174.573C200.472 174.815 200.504 175.074 200.477 175.33C200.45 175.586 200.364 175.833 200.225 176.051C200.087 176.269 199.9 176.452 199.679 176.587C199.459 176.722 199.21 176.804 198.952 176.828L192.577 177.29C192.523 177.295 192.469 177.298 192.416 177.298C192.089 177.298 191.77 177.203 191.496 177.026C191.222 176.849 191.006 176.597 190.873 176.3Z" fill="#333333"/>
<path d="M186.296 113.666C182.437 108.556 179.387 102.887 177.25 96.8576C177.127 96.497 177.135 96.1043 177.275 95.7495C177.415 95.3946 177.677 95.1007 178.014 94.9201L191.219 87.8753C191.432 87.7605 191.669 87.6957 191.912 87.6859C192.155 87.6761 192.396 87.7215 192.618 87.8187C192.845 87.9167 193.046 88.0648 193.206 88.2517C193.366 88.4387 193.482 88.6596 193.543 88.8976C195.08 94.7079 197.969 100.076 201.977 104.569C202.142 104.751 202.262 104.969 202.33 105.206C202.398 105.442 202.41 105.691 202.367 105.933C202.325 106.171 202.229 106.396 202.086 106.592C201.944 106.788 201.758 106.948 201.544 107.062L188.339 114.107C188.001 114.286 187.611 114.34 187.237 114.259C186.862 114.179 186.529 113.969 186.296 113.666Z" fill="#999999"/>
<path d="M187.197 112.992C187.268 113.08 187.368 113.141 187.479 113.164C187.591 113.187 187.707 113.17 187.807 113.117L201.012 106.072C201.076 106.039 201.131 105.991 201.174 105.933C201.217 105.875 201.245 105.808 201.257 105.737C201.271 105.662 201.267 105.585 201.246 105.512C201.225 105.438 201.187 105.371 201.135 105.315C197.009 100.69 194.035 95.1636 192.453 89.1821C192.435 89.1082 192.4 89.0395 192.35 88.9814C192.301 88.9234 192.239 88.8774 192.168 88.8473C192.102 88.8178 192.03 88.8041 191.958 88.807C191.885 88.81 191.815 88.8297 191.751 88.8645L178.546 95.9092C178.446 95.963 178.368 96.0499 178.326 96.1549C178.283 96.2599 178.279 96.3764 178.314 96.4842C180.412 102.406 183.408 107.973 187.197 112.992Z" fill="white"/>
<path d="M230.165 111.786L219.823 115.699L217.298 108.716C216.963 107.789 216.968 106.773 217.312 105.849C217.656 104.925 218.317 104.152 219.178 103.666C220.049 103.175 221.068 103.009 222.051 103.2C223.033 103.391 223.915 103.926 224.536 104.708L230.165 111.786Z" fill="#7319D5"/>
<path d="M203.861 139.455C203.643 139.301 203.461 139.104 203.326 138.875C203.191 138.646 203.106 138.391 203.078 138.127C201.753 125.816 202.676 116.181 205.898 108.673C206.466 107.378 207.32 106.228 208.399 105.309C209.477 104.39 210.75 103.727 212.123 103.368L220.482 102.948L220.525 102.969C222.412 103.889 223.95 105.39 224.913 107.249C225.875 109.108 226.21 111.226 225.868 113.29C223.179 120.346 220.928 127.693 222.645 133.62C222.717 133.868 222.738 134.128 222.707 134.384C222.675 134.64 222.593 134.887 222.463 135.11C222.337 135.326 222.169 135.514 221.968 135.663C221.766 135.811 221.536 135.917 221.292 135.974L205.37 139.745C205.112 139.806 204.844 139.812 204.584 139.762C204.324 139.712 204.077 139.607 203.861 139.455Z" fill="#7319D5"/>
<path d="M217.692 99.8391C222.789 99.8391 226.92 95.7254 226.92 90.651C226.92 85.5765 222.789 81.4629 217.692 81.4629C212.595 81.4629 208.464 85.5765 208.464 90.651C208.464 95.7254 212.595 99.8391 217.692 99.8391Z" fill="#FFB8B8"/>
<path d="M192.086 97.9287L184.894 101.09C184.62 101.209 184.31 101.216 184.031 101.109C183.753 101.001 183.528 100.788 183.407 100.516L183.229 100.115C183.109 99.8426 183.102 99.5338 183.21 99.2564C183.318 98.9789 183.532 98.7555 183.805 98.635L190.997 95.4741C191.271 95.3542 191.581 95.3473 191.86 95.4548C192.138 95.5623 192.363 95.7755 192.484 96.0476L192.662 96.4488C192.782 96.7211 192.789 97.0299 192.681 97.3073C192.573 97.5848 192.359 97.8082 192.086 97.9287Z" fill="#999999"/>
<path d="M194.715 102.792L187.524 105.953C187.25 106.073 186.94 106.08 186.661 105.972C186.383 105.865 186.158 105.651 186.037 105.379L185.859 104.978C185.739 104.706 185.732 104.397 185.84 104.12C185.948 103.842 186.162 103.619 186.435 103.498L193.627 100.337C193.901 100.218 194.211 100.211 194.489 100.318C194.768 100.426 194.993 100.639 195.114 100.911L195.291 101.312C195.412 101.584 195.419 101.893 195.311 102.171C195.203 102.448 194.989 102.672 194.715 102.792Z" fill="#999999"/>
<path d="M200.262 121.787L184.228 109.192C184.1 109.237 183.97 109.275 183.839 109.307C183.273 109.439 182.685 109.45 182.115 109.341C181.544 109.232 181.002 109.005 180.526 108.674C180.046 108.343 179.642 107.913 179.343 107.415C179.043 106.916 178.853 106.359 178.787 105.781C178.68 104.858 178.889 103.925 179.381 103.135C179.872 102.344 180.618 101.743 181.496 101.427C182.044 101.231 182.628 101.153 183.208 101.198C183.789 101.242 184.354 101.408 184.865 101.685C185.377 101.962 185.824 102.343 186.178 102.804C186.531 103.265 186.783 103.795 186.916 104.359C186.958 104.538 186.986 104.72 187.002 104.902L202.963 114.07L206.936 111.794L211.336 117.529L205.168 121.906C204.446 122.414 203.579 122.677 202.695 122.655C201.811 122.634 200.958 122.329 200.262 121.787Z" fill="#FFB8B8"/>
<path d="M213.292 119.316L204.144 113.122L208.443 107.059C209.014 106.254 209.853 105.676 210.81 105.427C211.768 105.178 212.783 105.273 213.677 105.698C214.581 106.126 215.301 106.863 215.707 107.774C216.113 108.686 216.178 109.711 215.891 110.666L213.292 119.316Z" fill="#7319D5"/>
<path d="M214.309 89.2823C211.937 90.8985 208.823 92.56 206.4 90.8388C204.81 89.7086 204.309 87.6158 204.954 85.7792C206.114 82.4765 209.301 81.0225 212.348 79.908C216.31 78.4591 220.624 77.3065 224.714 78.3441C228.803 79.3817 232.418 83.3243 231.68 87.4618C231.086 90.7891 227.934 93.5576 228.381 96.9075C228.832 100.279 232.64 102.053 236.001 102.656C239.363 103.259 243.125 103.452 245.541 105.856C248.623 108.924 247.854 114.406 244.954 117.644C242.053 120.882 237.677 122.35 233.436 123.348C227.818 124.67 221.74 125.365 216.404 123.171C211.068 120.976 206.915 115.07 208.461 109.531C209.114 107.192 210.652 105.215 212.139 103.29C213.625 101.365 215.13 99.3521 215.698 96.9905C216.17 95.0225 215.82 92.7376 214.51 91.2613C214.271 91.003 214.121 90.676 214.081 90.3274C214.041 89.9788 214.113 89.6265 214.286 89.3211L214.309 89.2823Z" fill="#333333"/>
<path d="M40.981 133.924C38.6031 134.756 36.05 134.965 33.5677 134.529C31.0854 134.094 28.7575 133.029 26.8083 131.438C21.8443 127.29 20.2879 120.455 19.0215 114.127C17.773 107.888 16.5244 101.648 15.2759 95.4092L23.1178 100.785C28.7573 104.652 34.5238 108.642 38.4285 114.242C42.3333 119.842 44.0377 127.487 40.9004 133.546" fill="#CCCCCC"/>
<path d="M40.3105 156.587C41.1042 150.83 41.9204 145 41.3636 139.182C40.8692 134.015 39.2859 128.968 36.0626 124.83C34.3517 122.638 32.2698 120.76 29.9106 119.28C29.2954 118.893 28.7292 119.864 29.3417 120.249C33.4238 122.818 36.5812 126.611 38.3586 131.081C40.3217 136.053 40.6369 141.472 40.2987 146.753C40.0941 149.947 39.6605 153.12 39.2236 156.288C39.1891 156.432 39.2106 156.583 39.2837 156.711C39.3568 156.839 39.476 156.935 39.6172 156.979C39.7613 157.017 39.9149 156.998 40.0447 156.924C40.1745 156.851 40.27 156.73 40.3105 156.587H40.3105Z" fill="#F1F1F1"/>
<path d="M32.6657 146.4C31.6458 147.944 30.244 149.2 28.5952 150.047C26.9464 150.894 25.1063 151.304 23.252 151.238C18.4867 151.013 14.5139 147.701 10.9377 144.557L0.359863 135.258L7.36063 134.925C12.3952 134.685 17.5596 134.461 22.3548 136.007C27.15 137.553 31.5724 141.273 32.4493 146.215" fill="#CCCCCC"/>
<path d="M42.5535 159.896C38.7333 153.165 34.3021 145.685 26.3844 143.295C24.1829 142.632 21.8744 142.395 19.5834 142.595C18.8613 142.657 19.0416 143.766 19.7624 143.704C23.6027 143.386 27.4355 144.396 30.6157 146.563C33.6759 148.637 36.0586 151.52 38.0753 154.578C39.3106 156.451 40.4171 158.403 41.5238 160.353C41.8775 160.976 42.9113 160.526 42.5535 159.896Z" fill="#F1F1F1"/>
<path d="M48.6747 166.98C48.546 165.495 48.0105 164.073 47.1265 162.87C46.2426 161.668 45.0441 160.729 43.6615 160.158V156.267H37.1071V160.28C35.7926 160.88 34.6613 161.816 33.8286 162.993C32.9959 164.17 32.4915 165.545 32.3669 166.98L30.8257 184.818H50.2159L48.6747 166.98Z" fill="#CCCCCC"/>
</g>
<defs>
<clipPath id="clip0_12161_123286">
<rect width="260" height="187" fill="white"/>
</clipPath>
</defs>
</svg>
