[
  {
    "name": "CRM",
    "searches": 356
  },
  {
    "name": "Microservicios",
    "searches": 301
  },
  {
    "name": "Consultoría de Ne...",
    "searches": 287
  },
  {
    "name": "Experiencia de Us...",
    "searches": 125
  },
  {
    "name": "Investigación de M...",
    "searches": 87
  }
]