[
    {
        "id": 1,
        "name": "Menos de 1MM"
    },
    {
        "id": 2,
        "name": "Entre 1MM - 5MM"
    },
    {
        "id": 3,
        "name": "Entre 5MM - 15MM"
    },
    {
        "id": 4,
        "name": "Entre 15MM - 50MM"
    },
    {
        "id": 5,
        "name": "Entre 50MM - 100MM"
    },
    {
        "id": 6,
        "name": "Más de 100MM"
    }
]