<svg width="32" height="33" viewBox="0 0 32 33" fill="none" xmlns="http://www.w3.org/2000/svg">
<path d="M4 2.5H2V28.5C2 29.0304 2.21071 29.5391 2.58579 29.9142C2.96086 30.2893 3.46957 30.5 4 30.5H30V28.5H4V2.5Z" fill="#4A148C"/>
<path d="M30 9.5H23V11.5H26.59L19 19.09L14.71 14.79C14.617 14.6963 14.5064 14.6219 14.3846 14.5711C14.2627 14.5203 14.132 14.4942 14 14.4942C13.868 14.4942 13.7373 14.5203 13.6154 14.5711C13.4936 14.6219 13.383 14.6963 13.29 14.79L6 22.09L7.41 23.5L14 16.91L18.29 21.21C18.383 21.3037 18.4936 21.3781 18.6154 21.4289C18.7373 21.4797 18.868 21.5058 19 21.5058C19.132 21.5058 19.2627 21.4797 19.3846 21.4289C19.5064 21.3781 19.617 21.3037 19.71 21.21L28 12.91V16.5H30V9.5Z" fill="#4A148C"/>
</svg>
