<svg width="96" height="160" viewBox="0 0 96 160" fill="none" xmlns="http://www.w3.org/2000/svg">
<g opacity="0.1">
<path d="M-3.99998 20C0.94455 20 5.77804 21.4662 9.88927 24.2133C14.0005 26.9603 17.2048 30.8648 19.097 35.4329C20.9892 40.0011 21.4843 45.0277 20.5196 49.8773C19.555 54.7268 17.174 59.1814 13.6777 62.6777C10.1814 66.174 5.7268 68.555 0.877274 69.5196C-3.97225 70.4843 -8.99891 69.9892 -13.5671 68.097C-18.1352 66.2048 -22.0397 63.0005 -24.7867 58.8893C-27.5338 54.778 -29 49.9445 -29 45C-29 38.3696 -26.3661 32.0107 -21.6777 27.3223C-16.9892 22.6339 -10.6304 20 -3.99998 20ZM-3.99998 10C-10.9223 10 -17.6892 12.0527 -23.4449 15.8986C-29.2007 19.7444 -33.6867 25.2107 -36.3358 31.6061C-38.9848 38.0015 -39.678 45.0388 -38.3275 51.8282C-36.977 58.6175 -33.6436 64.8539 -28.7487 69.7487C-23.8539 74.6436 -17.6175 77.977 -10.8281 79.3275C-4.03881 80.678 2.99852 79.9848 9.39394 77.3358C15.7893 74.6867 21.2556 70.2007 25.1015 64.445C28.9473 58.6892 31 51.9223 31 45C31 35.7174 27.3125 26.815 20.7487 20.2513C14.185 13.6875 5.28259 10 -3.99998 10Z" fill="#999999"/>
<path d="M46 150H36V125C36 118.37 33.3661 112.011 28.6777 107.322C23.9893 102.634 17.6304 100 11 100H-19C-25.6304 100 -31.9893 102.634 -36.6777 107.322C-41.3661 112.011 -44 118.37 -44 125V150H-54V125C-54 115.717 -50.3125 106.815 -43.7487 100.251C-37.185 93.6875 -28.2826 90 -19 90H11C20.2826 90 29.185 93.6875 35.7487 100.251C42.3125 106.815 46 115.717 46 125V150Z" fill="#999999"/>
<path d="M61 80.8992L48.05 67.9492L41 74.9992L61 94.9992L96 59.9992L88.95 52.9492L61 80.8992Z" fill="#999999"/>
</g>
</svg>
