<svg width="48" height="48" viewBox="0 0 48 48" fill="none" xmlns="http://www.w3.org/2000/svg">
<path d="M24 3C19.8466 3 15.7865 4.23163 12.333 6.53914C8.8796 8.84665 6.18798 12.1264 4.59854 15.9636C3.0091 19.8009 2.59323 24.0233 3.40352 28.0969C4.21381 32.1705 6.21386 35.9123 9.15077 38.8492C12.0877 41.7861 15.8295 43.7862 19.9031 44.5965C23.9767 45.4068 28.1991 44.9909 32.0364 43.4015C35.8736 41.812 39.1534 39.1204 41.4609 35.667C43.7684 32.2135 45 28.1534 45 24C45 18.4305 42.7875 13.089 38.8493 9.15076C34.911 5.21249 29.5696 3 24 3ZM15 39.57V36.57C14.9341 35.3033 15.3692 34.0616 16.2111 33.1129C17.0531 32.1643 18.2345 31.5849 19.5 31.5H28.5C29.7683 31.5849 30.952 32.1664 31.7944 33.1183C32.6368 34.0702 33.07 35.3158 33 36.585V39.585C30.2677 41.1767 27.1621 42.0153 24 42.0153C20.8379 42.0153 17.7323 41.1767 15 39.585V39.57ZM36 37.38V36.465C36.0409 34.42 35.2784 32.4404 33.8762 30.9513C32.474 29.4621 30.5438 28.582 28.5 28.5H19.5C17.4549 28.5782 15.5225 29.4571 14.1194 30.9471C12.7164 32.4371 11.9552 34.4189 12 36.465V37.35C9.28285 34.9197 7.36765 31.7217 6.50784 28.1791C5.64803 24.6364 5.88413 20.9163 7.18491 17.5108C8.48568 14.1053 10.7898 11.1751 13.7924 9.10776C16.795 7.04047 20.3546 5.93359 24 5.93359C27.6455 5.93359 31.205 7.04047 34.2076 9.10776C37.2102 11.1751 39.5143 14.1053 40.8151 17.5108C42.1159 20.9163 42.352 24.6364 41.4922 28.1791C40.6324 31.7217 38.7172 34.9197 36 37.35V37.38Z" fill="#7319D5"/>
<path d="M24 10.5C22.5166 10.5 21.0666 10.9399 19.8332 11.764C18.5999 12.5881 17.6386 13.7594 17.0709 15.1299C16.5032 16.5003 16.3547 18.0083 16.6441 19.4632C16.9335 20.918 17.6478 22.2544 18.6967 23.3033C19.7456 24.3522 21.082 25.0665 22.5368 25.3559C23.9917 25.6453 25.4997 25.4968 26.8701 24.9291C28.2406 24.3614 29.4119 23.4001 30.236 22.1668C31.0601 20.9334 31.5 19.4834 31.5 18C31.5 16.0109 30.7098 14.1032 29.3033 12.6967C27.8968 11.2902 25.9891 10.5 24 10.5ZM24 22.5C23.11 22.5 22.24 22.2361 21.4999 21.7416C20.7599 21.2471 20.1831 20.5443 19.8425 19.7221C19.502 18.8998 19.4128 17.995 19.5865 17.1221C19.7601 16.2492 20.1887 15.4474 20.818 14.818C21.4474 14.1887 22.2492 13.7601 23.1221 13.5865C23.995 13.4128 24.8998 13.5019 25.7221 13.8425C26.5443 14.1831 27.2472 14.7599 27.7416 15.4999C28.2361 16.24 28.5 17.11 28.5 18C28.5 19.1935 28.0259 20.3381 27.182 21.182C26.3381 22.0259 25.1935 22.5 24 22.5Z" fill="#7319D5"/>
</svg>
