<svg width="40" height="40" viewBox="0 0 40 40" fill="none" xmlns="http://www.w3.org/2000/svg">
<path d="M32.5 5H27.5V2.5H25V5H15V2.5H12.5V5H7.5C6.125 5 5 6.125 5 7.5V32.5C5 33.875 6.125 35 7.5 35H32.5C33.875 35 35 33.875 35 32.5V7.5C35 6.125 33.875 5 32.5 5ZM32.5 32.5H7.5V15H32.5V32.5ZM32.5 12.5H7.5V7.5H12.5V10H15V7.5H25V10H27.5V7.5H32.5V12.5Z" fill="#7319D5"/>
</svg>
