<svg width="622" height="193" viewBox="0 0 622 193" fill="none" xmlns="http://www.w3.org/2000/svg">
<path d="M118 1L118 192" stroke="#B585E9"/>
<path d="M218.601 1V192" stroke="#B585E9" stroke-dasharray="1 3"/>
<path d="M319.2 1V192" stroke="#B585E9" stroke-dasharray="1 3"/>
<path d="M520.4 1V192" stroke="#B585E9" stroke-dasharray="1 3"/>
<path d="M419.8 1V192" stroke="#B585E9" stroke-dasharray="1 3"/>
<path d="M620.999 1V192" stroke="#B585E9"/>
<path d="M620.999 1L118 1" stroke="#B585E9"/>
<path d="M621 192L118.001 192" stroke="#B585E9"/>
<path d="M356.83 10V34.3831L118.002 34.3831V10L356.83 10Z" fill="#16C62E"/>
<path d="M349.592 48.4653V72.8484L118.001 72.8484V48.4653L349.592 48.4653Z" fill="#16C62E"/>
<path d="M339.943 85.6041V109.987L118.002 109.987V85.6041L339.943 85.6041Z" fill="#16C62E"/>
<path d="M349.592 122.743V147.126H118.001V122.743L349.592 122.743Z" fill="#16C62E"/>
<path d="M453.326 159.882V184.265L118.001 184.265V159.882L453.326 159.882Z" fill="#16C62E"/>
<path d="M467.226 174.556H461.78V173.286L464.281 170.106C464.598 169.666 464.831 169.281 464.979 168.951C465.131 168.616 465.208 168.297 465.208 167.992C465.208 167.582 465.136 167.26 464.992 167.027C464.852 166.794 464.649 166.678 464.382 166.678C464.09 166.678 463.858 166.814 463.684 167.084C463.515 167.355 463.43 167.736 463.43 168.227H461.627C461.627 167.66 461.744 167.141 461.977 166.672C462.214 166.202 462.544 165.838 462.967 165.58C463.394 165.318 463.877 165.186 464.414 165.186C465.239 165.186 465.878 165.415 466.331 165.872C466.788 166.325 467.017 166.97 467.017 167.808C467.017 168.328 466.89 168.857 466.636 169.395C466.386 169.928 465.931 170.586 465.271 171.369L464.084 173.064H467.226V174.556ZM468.553 173.641C468.553 173.354 468.648 173.117 468.838 172.931C469.033 172.744 469.285 172.651 469.594 172.651C469.894 172.651 470.144 172.744 470.343 172.931C470.542 173.113 470.641 173.349 470.641 173.641C470.641 173.938 470.54 174.177 470.336 174.359C470.138 174.536 469.89 174.625 469.594 174.625C469.293 174.625 469.044 174.534 468.845 174.352C468.65 174.17 468.553 173.933 468.553 173.641ZM475.624 170.982C475.243 171.371 474.826 171.566 474.374 171.566C473.671 171.566 473.117 171.284 472.71 170.722C472.308 170.155 472.107 169.399 472.107 168.455C472.107 167.846 472.222 167.29 472.45 166.786C472.679 166.278 472.996 165.885 473.402 165.605C473.813 165.326 474.27 165.186 474.773 165.186C475.294 165.186 475.757 165.341 476.164 165.65C476.57 165.959 476.885 166.403 477.109 166.983C477.334 167.558 477.446 168.214 477.446 168.951V169.604C477.446 171.179 477.099 172.41 476.405 173.299C475.715 174.183 474.735 174.634 473.466 174.651H473.282V173.102H473.402C474.105 173.098 474.632 172.916 474.983 172.556C475.338 172.196 475.552 171.672 475.624 170.982ZM474.831 170.157C475.178 170.157 475.451 169.92 475.649 169.446V168.62C475.649 168.015 475.567 167.541 475.402 167.199C475.237 166.852 475.023 166.678 474.761 166.678C474.503 166.678 474.293 166.849 474.132 167.192C473.976 167.531 473.897 167.946 473.897 168.436C473.897 168.97 473.98 169.391 474.145 169.7C474.31 170.004 474.539 170.157 474.831 170.157Z" fill="#7319D5"/>
<path d="M363.494 138.743H358.047V137.474L360.548 134.293C360.866 133.853 361.098 133.468 361.247 133.138C361.399 132.804 361.475 132.484 361.475 132.18C361.475 131.769 361.403 131.447 361.259 131.215C361.12 130.982 360.917 130.866 360.65 130.866C360.358 130.866 360.125 131.001 359.952 131.272C359.782 131.543 359.698 131.924 359.698 132.414H357.895C357.895 131.847 358.011 131.329 358.244 130.859C358.481 130.39 358.811 130.026 359.234 129.767C359.662 129.505 360.144 129.374 360.682 129.374C361.507 129.374 362.146 129.602 362.599 130.059C363.056 130.512 363.284 131.158 363.284 131.995C363.284 132.516 363.157 133.045 362.903 133.582C362.654 134.116 362.199 134.774 361.539 135.557L360.352 137.251H363.494V138.743Z" fill="#7319D5"/>
<path d="M353.558 102.931H351.755V95.8719L349.997 96.5511V95.0531L353.367 93.6757H353.558V102.931ZM356.376 102.016C356.376 101.729 356.471 101.492 356.662 101.306C356.856 101.119 357.108 101.026 357.417 101.026C357.717 101.026 357.967 101.119 358.166 101.306C358.365 101.488 358.464 101.724 358.464 102.016C358.464 102.313 358.363 102.552 358.16 102.734C357.961 102.911 357.713 103 357.417 103C357.117 103 356.867 102.909 356.668 102.727C356.473 102.545 356.376 102.308 356.376 102.016ZM365.142 96.1449C365.142 96.5935 365.047 96.9913 364.856 97.3383C364.666 97.6853 364.404 97.9624 364.069 98.1698C364.45 98.3856 364.751 98.684 364.971 99.0648C365.191 99.4414 365.301 99.8858 365.301 100.398C365.301 101.219 365.064 101.868 364.59 102.347C364.116 102.821 363.471 103.057 362.654 103.057C361.837 103.057 361.188 102.821 360.705 102.347C360.223 101.868 359.981 101.219 359.981 100.398C359.981 99.8858 360.091 99.4393 360.312 99.0585C360.532 98.6776 360.834 98.3814 361.219 98.1698C360.881 97.9624 360.616 97.6853 360.426 97.3383C360.235 96.9913 360.14 96.5935 360.14 96.1449C360.14 95.3366 360.367 94.704 360.819 94.2469C361.272 93.7899 361.879 93.5614 362.641 93.5614C363.411 93.5614 364.021 93.792 364.469 94.2533C364.918 94.7146 365.142 95.3451 365.142 96.1449ZM362.654 101.566C362.925 101.566 363.132 101.452 363.276 101.223C363.424 100.99 363.498 100.669 363.498 100.258C363.498 99.8477 363.422 99.5261 363.27 99.2933C363.117 99.0606 362.908 98.9442 362.641 98.9442C362.375 98.9442 362.163 99.0606 362.006 99.2933C361.854 99.5261 361.778 99.8477 361.778 100.258C361.778 100.669 361.854 100.99 362.006 101.223C362.163 101.452 362.379 101.566 362.654 101.566ZM363.352 96.2401C363.352 95.8804 363.293 95.5927 363.174 95.3768C363.06 95.161 362.882 95.0531 362.641 95.0531C362.413 95.0531 362.239 95.1589 362.121 95.3705C362.002 95.5778 361.943 95.8677 361.943 96.2401C361.943 96.604 362.002 96.8982 362.121 97.1224C362.239 97.3425 362.417 97.4525 362.654 97.4525C362.891 97.4525 363.066 97.3425 363.181 97.1224C363.295 96.8982 363.352 96.604 363.352 96.2401Z" fill="#7319D5"/>
<path d="M362.288 64.4653H356.841V63.1957L359.342 60.0156C359.66 59.5755 359.892 59.1904 360.041 58.8603C360.193 58.526 360.269 58.2065 360.269 57.9018C360.269 57.4913 360.197 57.1697 360.053 56.937C359.914 56.7042 359.71 56.5878 359.444 56.5878C359.152 56.5878 358.919 56.7232 358.746 56.9941C358.576 57.2649 358.492 57.6458 358.492 58.1367H356.689C356.689 57.5696 356.805 57.0512 357.038 56.5815C357.275 56.1118 357.605 55.7478 358.028 55.4897C358.456 55.2273 358.938 55.0961 359.476 55.0961C360.301 55.0961 360.94 55.3246 361.393 55.7817C361.85 56.2345 362.078 56.8798 362.078 57.7177C362.078 58.2382 361.951 58.7672 361.697 59.3046C361.448 59.8378 360.993 60.4959 360.333 61.2787L359.146 62.9736H362.288V64.4653Z" fill="#7319D5"/>
<path d="M371.937 26H366.491V24.7305L368.992 21.5503C369.309 21.1102 369.542 20.7251 369.69 20.395C369.842 20.0607 369.918 19.7412 369.918 19.4365C369.918 19.026 369.847 18.7044 369.703 18.4717C369.563 18.2389 369.36 18.1226 369.093 18.1226C368.801 18.1226 368.569 18.258 368.395 18.5288C368.226 18.7996 368.141 19.1805 368.141 19.6714H366.338C366.338 19.1043 366.455 18.5859 366.688 18.1162C366.924 17.6465 367.255 17.2826 367.678 17.0244C368.105 16.762 368.588 16.6309 369.125 16.6309C369.95 16.6309 370.589 16.8594 371.042 17.3164C371.499 17.7692 371.728 18.4146 371.728 19.2524C371.728 19.7729 371.601 20.3019 371.347 20.8394C371.097 21.3726 370.642 22.0306 369.982 22.8135L368.795 24.5083H371.937V26ZM373.264 25.0859C373.264 24.7982 373.359 24.5612 373.549 24.375C373.744 24.1888 373.996 24.0957 374.305 24.0957C374.605 24.0957 374.855 24.1888 375.054 24.375C375.253 24.557 375.352 24.7939 375.352 25.0859C375.352 25.3822 375.25 25.6213 375.047 25.8032C374.848 25.981 374.601 26.0698 374.305 26.0698C374.004 26.0698 373.755 25.9788 373.556 25.7969C373.361 25.6149 373.264 25.3779 373.264 25.0859ZM380.805 26H379.002V18.9414L377.244 19.6206V18.1226L380.614 16.7451H380.805V26Z" fill="#7319D5"/>
<path d="M60.6133 21.2305C60.5664 22.1445 60.3086 22.8438 59.8398 23.3281C59.375 23.8125 58.7168 24.0547 57.8652 24.0547C57.0098 24.0547 56.3301 23.7305 55.8262 23.082C55.3223 22.4297 55.0703 21.5469 55.0703 20.4336V18.8867C55.0703 17.7773 55.3281 16.9004 55.8438 16.2559C56.3633 15.6113 57.0703 15.2891 57.9648 15.2891C58.7891 15.2891 59.4258 15.5371 59.875 16.0332C60.3281 16.5254 60.5742 17.2305 60.6133 18.1484H59.5293C59.4824 17.4531 59.3359 16.957 59.0898 16.6602C58.8438 16.3633 58.4688 16.2148 57.9648 16.2148C57.3828 16.2148 56.9355 16.4434 56.623 16.9004C56.3105 17.3535 56.1543 18.0195 56.1543 18.8984V20.4629C56.1543 21.3262 56.2988 21.9883 56.5879 22.4492C56.8809 22.9102 57.3066 23.1406 57.8652 23.1406C58.4238 23.1406 58.8262 23.002 59.0723 22.7246C59.3184 22.4473 59.4707 21.9492 59.5293 21.2305H60.6133ZM67.6211 20.4219C67.6211 21.5859 67.373 22.4824 66.877 23.1113C66.3809 23.7402 65.6758 24.0547 64.7617 24.0547C63.8828 24.0547 63.1875 23.75 62.6758 23.1406C62.168 22.5273 61.9043 21.6621 61.8848 20.5449V18.9395C61.8848 17.7988 62.1367 16.9062 62.6406 16.2617C63.1445 15.6133 63.8477 15.2891 64.75 15.2891C65.6484 15.2891 66.3477 15.5996 66.8477 16.2207C67.3516 16.8379 67.6094 17.7207 67.6211 18.8691V20.4219ZM66.5488 18.9277C66.5488 18.0254 66.4004 17.3555 66.1035 16.918C65.8105 16.4766 65.3594 16.2559 64.75 16.2559C64.1602 16.2559 63.7129 16.4785 63.4082 16.9238C63.1074 17.3691 62.9551 18.0254 62.9512 18.8926V20.4219C62.9512 21.293 63.1016 21.957 63.4023 22.4141C63.707 22.8711 64.1602 23.0996 64.7617 23.0996C65.3633 23.0996 65.8086 22.8887 66.0977 22.4668C66.3867 22.0449 66.5371 21.3984 66.5488 20.5273V18.9277ZM74.8516 23.9375H73.7734L70.3574 17.3633V23.9375H69.2793V15.4062H70.3574L73.7852 22.0098V15.4062H74.8516V23.9375ZM80.7988 19.9941H77.7812V23.0176H81.2969V23.9375H76.709V15.4062H81.2383V16.332H77.7812V19.0742H80.7988V19.9941ZM85.0703 18.6758L86.6758 15.4062H87.9355L85.7148 19.6367L87.9824 23.9375H86.7109L85.0703 20.6094L83.4238 23.9375H82.1523L84.4316 19.6367L82.1992 15.4062H83.4531L85.0703 18.6758ZM90.4023 23.9375H89.3301V15.4062H90.4023V23.9375ZM97.832 20.4219C97.832 21.5859 97.584 22.4824 97.0879 23.1113C96.5918 23.7402 95.8867 24.0547 94.9727 24.0547C94.0938 24.0547 93.3984 23.75 92.8867 23.1406C92.3789 22.5273 92.1152 21.6621 92.0957 20.5449V18.9395C92.0957 17.7988 92.3477 16.9062 92.8516 16.2617C93.3555 15.6133 94.0586 15.2891 94.9609 15.2891C95.8594 15.2891 96.5586 15.5996 97.0586 16.2207C97.5625 16.8379 97.8203 17.7207 97.832 18.8691V20.4219ZM96.7598 18.9277C96.7598 18.0254 96.6113 17.3555 96.3145 16.918C96.0215 16.4766 95.5703 16.2559 94.9609 16.2559C94.3711 16.2559 93.9238 16.4785 93.6191 16.9238C93.3184 17.3691 93.166 18.0254 93.1621 18.8926V20.4219C93.1621 21.293 93.3125 21.957 93.6133 22.4141C93.918 22.8711 94.3711 23.0996 94.9727 23.0996C95.5742 23.0996 96.0195 22.8887 96.3086 22.4668C96.5977 22.0449 96.748 21.3984 96.7598 20.5273V18.9277ZM95.5176 13.1094H96.8301L95.2598 14.832H94.3867L95.5176 13.1094ZM105.062 23.9375H103.984L100.568 17.3633V23.9375H99.4902V15.4062H100.568L103.996 22.0098V15.4062H105.062V23.9375Z" fill="black"/>
<path d="M14.7695 58.6602V62H13.6973V53.4688H16.416C17.209 53.4688 17.832 53.707 18.2852 54.1836C18.7383 54.6562 18.9648 55.2871 18.9648 56.0762C18.9648 56.8965 18.748 57.5293 18.3145 57.9746C17.8848 58.416 17.2773 58.6445 16.4922 58.6602H14.7695ZM14.7695 57.7402H16.416C16.8926 57.7402 17.2578 57.5977 17.5117 57.3125C17.7656 57.0273 17.8926 56.6191 17.8926 56.0879C17.8926 55.5762 17.7617 55.166 17.5 54.8574C17.2383 54.5488 16.8789 54.3945 16.4219 54.3945H14.7695V57.7402ZM24.4434 58.0566H21.4258V61.0801H24.9414V62H20.3535V53.4688H24.8828V54.3945H21.4258V57.1367H24.4434V58.0566ZM28.8965 58.5488H27.3965V62H26.3184V53.4688H28.709C29.5449 53.4688 30.1777 53.6875 30.6074 54.125C31.0371 54.5586 31.252 55.1953 31.252 56.0352C31.252 56.5625 31.1348 57.0234 30.9004 57.418C30.6699 57.8086 30.3418 58.1035 29.916 58.3027L31.5684 61.9297V62H30.4141L28.8965 58.5488ZM27.3965 57.6289H28.6973C29.1465 57.6289 29.5039 57.4844 29.7695 57.1953C30.0391 56.9062 30.1738 56.5195 30.1738 56.0352C30.1738 54.9414 29.6777 54.3945 28.6855 54.3945H27.3965V57.6289ZM36.4199 59.8438C36.4199 59.418 36.3047 59.0918 36.0742 58.8652C35.8438 58.6387 35.4277 58.418 34.8262 58.2031C34.2246 57.9883 33.7637 57.7637 33.4434 57.5293C33.127 57.291 32.8887 57.0215 32.7285 56.7207C32.5723 56.416 32.4941 56.0684 32.4941 55.6777C32.4941 55.002 32.7188 54.4453 33.168 54.0078C33.6211 53.5703 34.2129 53.3516 34.9434 53.3516C35.4434 53.3516 35.8887 53.4648 36.2793 53.6914C36.6699 53.9141 36.9707 54.2246 37.1816 54.623C37.3926 55.0215 37.498 55.459 37.498 55.9355H36.4199C36.4199 55.4082 36.293 55 36.0391 54.7109C35.7852 54.4219 35.4199 54.2773 34.9434 54.2773C34.5098 54.2773 34.1738 54.3984 33.9355 54.6406C33.6973 54.8828 33.5781 55.2227 33.5781 55.6602C33.5781 56.0195 33.707 56.3203 33.9648 56.5625C34.2227 56.8047 34.6211 57.0215 35.1602 57.2129C36 57.4902 36.5996 57.832 36.959 58.2383C37.3223 58.6445 37.5039 59.1758 37.5039 59.832C37.5039 60.5234 37.2793 61.0781 36.8301 61.4961C36.3809 61.9102 35.7695 62.1172 34.9961 62.1172C34.5 62.1172 34.041 62.0098 33.6191 61.7949C33.2012 61.5762 32.8711 61.2715 32.6289 60.8809C32.3906 60.4863 32.2715 60.0352 32.2715 59.5273H33.3496C33.3496 60.0547 33.4961 60.4648 33.7891 60.7578C34.0859 61.0508 34.4883 61.1973 34.9961 61.1973C35.4688 61.1973 35.8242 61.0762 36.0625 60.834C36.3008 60.5918 36.4199 60.2617 36.4199 59.8438ZM44.4648 58.4844C44.4648 59.6484 44.2168 60.5449 43.7207 61.1738C43.2246 61.8027 42.5195 62.1172 41.6055 62.1172C40.7266 62.1172 40.0312 61.8125 39.5195 61.2031C39.0117 60.5898 38.748 59.7246 38.7285 58.6074V57.002C38.7285 55.8613 38.9805 54.9688 39.4844 54.3242C39.9883 53.6758 40.6914 53.3516 41.5938 53.3516C42.4922 53.3516 43.1914 53.6621 43.6914 54.2832C44.1953 54.9004 44.4531 55.7832 44.4648 56.9316V58.4844ZM43.3926 56.9902C43.3926 56.0879 43.2441 55.418 42.9473 54.9805C42.6543 54.5391 42.2031 54.3184 41.5938 54.3184C41.0039 54.3184 40.5566 54.541 40.252 54.9863C39.9512 55.4316 39.7988 56.0879 39.7949 56.9551V58.4844C39.7949 59.3555 39.9453 60.0195 40.2461 60.4766C40.5508 60.9336 41.0039 61.1621 41.6055 61.1621C42.207 61.1621 42.6523 60.9512 42.9414 60.5293C43.2305 60.1074 43.3809 59.4609 43.3926 58.5898V56.9902ZM51.6953 62H50.6172L47.2012 55.4258V62H46.123V53.4688H47.2012L50.6289 60.0723V53.4688H51.6953V62ZM57.6367 59.7734H54.7539L54.0918 62H52.9902L55.7383 53.4688H56.6582L59.4121 62H58.3105L57.6367 59.7734ZM55.0352 58.8477H57.3613L56.1953 54.9688L55.0352 58.8477ZM61.6504 61.0801H64.9961V62H60.5723V53.4688H61.6504V61.0801ZM67.3984 62H66.3262V53.4688H67.3984V62ZM70.082 61.0801H74.1309V62H68.8926V61.1562L72.7773 54.3945H68.9336V53.4688H73.9727V54.2949L70.082 61.0801ZM79.6094 59.7734H76.7266L76.0645 62H74.9629L77.7109 53.4688H78.6309L81.3848 62H80.2832L79.6094 59.7734ZM77.0078 58.8477H79.334L78.168 54.9688L77.0078 58.8477ZM87.8242 59.293C87.7773 60.207 87.5195 60.9062 87.0508 61.3906C86.5859 61.875 85.9277 62.1172 85.0762 62.1172C84.2207 62.1172 83.541 61.793 83.0371 61.1445C82.5332 60.4922 82.2812 59.6094 82.2812 58.4961V56.9492C82.2812 55.8398 82.5391 54.9629 83.0547 54.3184C83.5742 53.6738 84.2812 53.3516 85.1758 53.3516C86 53.3516 86.6367 53.5996 87.0859 54.0957C87.5391 54.5879 87.7852 55.293 87.8242 56.2109H86.7402C86.6934 55.5156 86.5469 55.0195 86.3008 54.7227C86.0547 54.4258 85.6797 54.2773 85.1758 54.2773C84.5938 54.2773 84.1465 54.5059 83.834 54.9629C83.5215 55.416 83.3652 56.082 83.3652 56.9609V58.5254C83.3652 59.3887 83.5098 60.0508 83.7988 60.5117C84.0918 60.9727 84.5176 61.2031 85.0762 61.2031C85.6348 61.2031 86.0371 61.0645 86.2832 60.7871C86.5293 60.5098 86.6816 60.0117 86.7402 59.293H87.8242ZM90.4023 62H89.3301V53.4688H90.4023V62ZM97.832 58.4844C97.832 59.6484 97.584 60.5449 97.0879 61.1738C96.5918 61.8027 95.8867 62.1172 94.9727 62.1172C94.0938 62.1172 93.3984 61.8125 92.8867 61.2031C92.3789 60.5898 92.1152 59.7246 92.0957 58.6074V57.002C92.0957 55.8613 92.3477 54.9688 92.8516 54.3242C93.3555 53.6758 94.0586 53.3516 94.9609 53.3516C95.8594 53.3516 96.5586 53.6621 97.0586 54.2832C97.5625 54.9004 97.8203 55.7832 97.832 56.9316V58.4844ZM96.7598 56.9902C96.7598 56.0879 96.6113 55.418 96.3145 54.9805C96.0215 54.5391 95.5703 54.3184 94.9609 54.3184C94.3711 54.3184 93.9238 54.541 93.6191 54.9863C93.3184 55.4316 93.166 56.0879 93.1621 56.9551V58.4844C93.1621 59.3555 93.3125 60.0195 93.6133 60.4766C93.918 60.9336 94.3711 61.1621 94.9727 61.1621C95.5742 61.1621 96.0195 60.9512 96.3086 60.5293C96.5977 60.1074 96.748 59.4609 96.7598 58.5898V56.9902ZM95.5176 51.1719H96.8301L95.2598 52.8945H94.3867L95.5176 51.1719ZM105.062 62H103.984L100.568 55.4258V62H99.4902V53.4688H100.568L103.996 60.0723V53.4688H105.062V62Z" fill="black"/>
<path d="M42.9414 97.2324H40.0586V101H38.9863V92.4688H43.4277V93.3945H40.0586V96.3125H42.9414V97.2324ZM45.8711 101H44.7988V92.4688H45.8711V101ZM47.752 101V92.4688H49.7852C50.7812 92.4688 51.5547 92.7812 52.1055 93.4062C52.6562 94.0273 52.9316 94.9023 52.9316 96.0312V97.4609C52.9316 98.5898 52.6523 99.4629 52.0938 100.08C51.5352 100.693 50.7246 101 49.6621 101H47.752ZM48.8242 93.3945V100.08H49.6855C50.4395 100.08 50.9902 99.8652 51.3379 99.4355C51.6855 99.002 51.8633 98.3613 51.8711 97.5137V96.002C51.8711 95.1035 51.6973 94.4453 51.3496 94.0273C51.0059 93.6055 50.4844 93.3945 49.7852 93.3945H48.8242ZM58.6973 97.0566H55.6797V100.08H59.1953V101H54.6074V92.4688H59.1367V93.3945H55.6797V96.1367H58.6973V97.0566ZM61.6504 100.08H64.9961V101H60.5723V92.4688H61.6504V100.08ZM67.3984 101H66.3262V92.4688H67.3984V101ZM70.082 100.08H74.1309V101H68.8926V100.156L72.7773 93.3945H68.9336V92.4688H73.9727V93.2949L70.082 100.08ZM79.6094 98.7734H76.7266L76.0645 101H74.9629L77.7109 92.4688H78.6309L81.3848 101H80.2832L79.6094 98.7734ZM77.0078 97.8477H79.334L78.168 93.9688L77.0078 97.8477ZM87.8242 98.293C87.7773 99.207 87.5195 99.9062 87.0508 100.391C86.5859 100.875 85.9277 101.117 85.0762 101.117C84.2207 101.117 83.541 100.793 83.0371 100.145C82.5332 99.4922 82.2812 98.6094 82.2812 97.4961V95.9492C82.2812 94.8398 82.5391 93.9629 83.0547 93.3184C83.5742 92.6738 84.2812 92.3516 85.1758 92.3516C86 92.3516 86.6367 92.5996 87.0859 93.0957C87.5391 93.5879 87.7852 94.293 87.8242 95.2109H86.7402C86.6934 94.5156 86.5469 94.0195 86.3008 93.7227C86.0547 93.4258 85.6797 93.2773 85.1758 93.2773C84.5938 93.2773 84.1465 93.5059 83.834 93.9629C83.5215 94.416 83.3652 95.082 83.3652 95.9609V97.5254C83.3652 98.3887 83.5098 99.0508 83.7988 99.5117C84.0918 99.9727 84.5176 100.203 85.0762 100.203C85.6348 100.203 86.0371 100.064 86.2832 99.7871C86.5293 99.5098 86.6816 99.0117 86.7402 98.293H87.8242ZM90.4023 101H89.3301V92.4688H90.4023V101ZM97.832 97.4844C97.832 98.6484 97.584 99.5449 97.0879 100.174C96.5918 100.803 95.8867 101.117 94.9727 101.117C94.0938 101.117 93.3984 100.812 92.8867 100.203C92.3789 99.5898 92.1152 98.7246 92.0957 97.6074V96.002C92.0957 94.8613 92.3477 93.9688 92.8516 93.3242C93.3555 92.6758 94.0586 92.3516 94.9609 92.3516C95.8594 92.3516 96.5586 92.6621 97.0586 93.2832C97.5625 93.9004 97.8203 94.7832 97.832 95.9316V97.4844ZM96.7598 95.9902C96.7598 95.0879 96.6113 94.418 96.3145 93.9805C96.0215 93.5391 95.5703 93.3184 94.9609 93.3184C94.3711 93.3184 93.9238 93.541 93.6191 93.9863C93.3184 94.4316 93.166 95.0879 93.1621 95.9551V97.4844C93.1621 98.3555 93.3125 99.0195 93.6133 99.4766C93.918 99.9336 94.3711 100.162 94.9727 100.162C95.5742 100.162 96.0195 99.9512 96.3086 99.5293C96.5977 99.1074 96.748 98.4609 96.7598 97.5898V95.9902ZM95.5176 90.1719H96.8301L95.2598 91.8945H94.3867L95.5176 90.1719ZM105.062 101H103.984L100.568 94.4258V101H99.4902V92.4688H100.568L103.996 99.0723V92.4688H105.062V101Z" fill="black"/>
<path d="M34.0938 136.293C34.0469 137.207 33.7891 137.906 33.3203 138.391C32.8555 138.875 32.1973 139.117 31.3457 139.117C30.4902 139.117 29.8105 138.793 29.3066 138.145C28.8027 137.492 28.5508 136.609 28.5508 135.496V133.949C28.5508 132.84 28.8086 131.963 29.3242 131.318C29.8438 130.674 30.5508 130.352 31.4453 130.352C32.2695 130.352 32.9062 130.6 33.3555 131.096C33.8086 131.588 34.0547 132.293 34.0938 133.211H33.0098C32.9629 132.516 32.8164 132.02 32.5703 131.723C32.3242 131.426 31.9492 131.277 31.4453 131.277C30.8633 131.277 30.416 131.506 30.1035 131.963C29.791 132.416 29.6348 133.082 29.6348 133.961V135.525C29.6348 136.389 29.7793 137.051 30.0684 137.512C30.3613 137.973 30.7871 138.203 31.3457 138.203C31.9043 138.203 32.3066 138.064 32.5527 137.787C32.7988 137.51 32.9512 137.012 33.0098 136.293H34.0938ZM41.1016 135.484C41.1016 136.648 40.8535 137.545 40.3574 138.174C39.8613 138.803 39.1562 139.117 38.2422 139.117C37.3633 139.117 36.668 138.812 36.1562 138.203C35.6484 137.59 35.3848 136.725 35.3652 135.607V134.002C35.3652 132.861 35.6172 131.969 36.1211 131.324C36.625 130.676 37.3281 130.352 38.2305 130.352C39.1289 130.352 39.8281 130.662 40.3281 131.283C40.832 131.9 41.0898 132.783 41.1016 133.932V135.484ZM40.0293 133.99C40.0293 133.088 39.8809 132.418 39.584 131.98C39.291 131.539 38.8398 131.318 38.2305 131.318C37.6406 131.318 37.1934 131.541 36.8887 131.986C36.5879 132.432 36.4355 133.088 36.4316 133.955V135.484C36.4316 136.355 36.582 137.02 36.8828 137.477C37.1875 137.934 37.6406 138.162 38.2422 138.162C38.8438 138.162 39.2891 137.951 39.5781 137.529C39.8672 137.107 40.0176 136.461 40.0293 135.59V133.99ZM43.8379 138.08H47.1836V139H42.7598V130.469H43.8379V138.08ZM52.5625 136.773H49.6797L49.0176 139H47.916L50.6641 130.469H51.584L54.3379 139H53.2363L52.5625 136.773ZM49.9609 135.848H52.2871L51.1211 131.969L49.9609 135.848ZM55.498 139V130.469H57.9297C58.707 130.469 59.291 130.658 59.6816 131.037C60.0762 131.416 60.2734 131.984 60.2734 132.742C60.2734 133.141 60.1738 133.492 59.9746 133.797C59.7754 134.102 59.5059 134.338 59.166 134.506C59.5566 134.623 59.8652 134.863 60.0918 135.227C60.3223 135.59 60.4375 136.027 60.4375 136.539C60.4375 137.305 60.2266 137.906 59.8047 138.344C59.3867 138.781 58.7891 139 58.0117 139H55.498ZM56.5703 135.01V138.08H58.0352C58.4414 138.08 58.7637 137.947 59.002 137.682C59.2402 137.412 59.3594 137.035 59.3594 136.551C59.3594 135.523 58.9258 135.01 58.0586 135.01H56.5703ZM56.5703 134.107H57.9473C58.3184 134.107 58.6172 133.982 58.8438 133.732C59.0742 133.482 59.1895 133.15 59.1895 132.736C59.1895 132.268 59.0859 131.928 58.8789 131.717C58.6719 131.502 58.3555 131.395 57.9297 131.395H56.5703V134.107ZM67.5977 135.484C67.5977 136.648 67.3496 137.545 66.8535 138.174C66.3574 138.803 65.6523 139.117 64.7383 139.117C63.8594 139.117 63.1641 138.812 62.6523 138.203C62.1445 137.59 61.8809 136.725 61.8613 135.607V134.002C61.8613 132.861 62.1133 131.969 62.6172 131.324C63.1211 130.676 63.8242 130.352 64.7266 130.352C65.625 130.352 66.3242 130.662 66.8242 131.283C67.3281 131.9 67.5859 132.783 67.5977 133.932V135.484ZM66.5254 133.99C66.5254 133.088 66.377 132.418 66.0801 131.98C65.7871 131.539 65.3359 131.318 64.7266 131.318C64.1367 131.318 63.6895 131.541 63.3848 131.986C63.084 132.432 62.9316 133.088 62.9277 133.955V135.484C62.9277 136.355 63.0781 137.02 63.3789 137.477C63.6836 137.934 64.1367 138.162 64.7383 138.162C65.3398 138.162 65.7852 137.951 66.0742 137.529C66.3633 137.107 66.5137 136.461 66.5254 135.59V133.99ZM71.834 135.549H70.334V139H69.2559V130.469H71.6465C72.4824 130.469 73.1152 130.688 73.5449 131.125C73.9746 131.559 74.1895 132.195 74.1895 133.035C74.1895 133.562 74.0723 134.023 73.8379 134.418C73.6074 134.809 73.2793 135.104 72.8535 135.303L74.5059 138.93V139H73.3516L71.834 135.549ZM70.334 134.629H71.6348C72.084 134.629 72.4414 134.484 72.707 134.195C72.9766 133.906 73.1113 133.52 73.1113 133.035C73.1113 131.941 72.6152 131.395 71.623 131.395H70.334V134.629ZM79.6094 136.773H76.7266L76.0645 139H74.9629L77.7109 130.469H78.6309L81.3848 139H80.2832L79.6094 136.773ZM77.0078 135.848H79.334L78.168 131.969L77.0078 135.848ZM87.8242 136.293C87.7773 137.207 87.5195 137.906 87.0508 138.391C86.5859 138.875 85.9277 139.117 85.0762 139.117C84.2207 139.117 83.541 138.793 83.0371 138.145C82.5332 137.492 82.2812 136.609 82.2812 135.496V133.949C82.2812 132.84 82.5391 131.963 83.0547 131.318C83.5742 130.674 84.2812 130.352 85.1758 130.352C86 130.352 86.6367 130.6 87.0859 131.096C87.5391 131.588 87.7852 132.293 87.8242 133.211H86.7402C86.6934 132.516 86.5469 132.02 86.3008 131.723C86.0547 131.426 85.6797 131.277 85.1758 131.277C84.5938 131.277 84.1465 131.506 83.834 131.963C83.5215 132.416 83.3652 133.082 83.3652 133.961V135.525C83.3652 136.389 83.5098 137.051 83.7988 137.512C84.0918 137.973 84.5176 138.203 85.0762 138.203C85.6348 138.203 86.0371 138.064 86.2832 137.787C86.5293 137.51 86.6816 137.012 86.7402 136.293H87.8242ZM90.4023 139H89.3301V130.469H90.4023V139ZM97.832 135.484C97.832 136.648 97.584 137.545 97.0879 138.174C96.5918 138.803 95.8867 139.117 94.9727 139.117C94.0938 139.117 93.3984 138.812 92.8867 138.203C92.3789 137.59 92.1152 136.725 92.0957 135.607V134.002C92.0957 132.861 92.3477 131.969 92.8516 131.324C93.3555 130.676 94.0586 130.352 94.9609 130.352C95.8594 130.352 96.5586 130.662 97.0586 131.283C97.5625 131.9 97.8203 132.783 97.832 133.932V135.484ZM96.7598 133.99C96.7598 133.088 96.6113 132.418 96.3145 131.98C96.0215 131.539 95.5703 131.318 94.9609 131.318C94.3711 131.318 93.9238 131.541 93.6191 131.986C93.3184 132.432 93.166 133.088 93.1621 133.955V135.484C93.1621 136.355 93.3125 137.02 93.6133 137.477C93.918 137.934 94.3711 138.162 94.9727 138.162C95.5742 138.162 96.0195 137.951 96.3086 137.529C96.5977 137.107 96.748 136.461 96.7598 135.59V133.99ZM95.5176 128.172H96.8301L95.2598 129.895H94.3867L95.5176 128.172ZM105.062 139H103.984L100.568 132.426V139H99.4902V130.469H100.568L103.996 137.072V130.469H105.062V139Z" fill="black"/>
<path d="M35.4961 175.572H32.6133L31.9512 177.799H30.8496L33.5977 169.267H34.5176L37.2715 177.799H36.1699L35.4961 175.572ZM32.8945 174.646H35.2207L34.0547 170.767L32.8945 174.646ZM43.7109 175.092C43.6641 176.006 43.4062 176.705 42.9375 177.189C42.4727 177.674 41.8145 177.916 40.9629 177.916C40.1074 177.916 39.4277 177.592 38.9238 176.943C38.4199 176.291 38.168 175.408 38.168 174.295V172.748C38.168 171.638 38.4258 170.761 38.9414 170.117C39.4609 169.472 40.168 169.15 41.0625 169.15C41.8867 169.15 42.5234 169.398 42.9727 169.894C43.4258 170.386 43.6719 171.092 43.7109 172.01H42.627C42.5801 171.314 42.4336 170.818 42.1875 170.521C41.9414 170.224 41.5664 170.076 41.0625 170.076C40.4805 170.076 40.0332 170.304 39.7207 170.761C39.4082 171.215 39.252 171.881 39.252 172.76V174.324C39.252 175.187 39.3965 175.849 39.6855 176.31C39.9785 176.771 40.4043 177.002 40.9629 177.002C41.5215 177.002 41.9238 176.863 42.1699 176.586C42.416 176.308 42.5684 175.81 42.627 175.092H43.7109ZM50.5195 175.092C50.4727 176.006 50.2148 176.705 49.7461 177.189C49.2812 177.674 48.623 177.916 47.7715 177.916C46.916 177.916 46.2363 177.592 45.7324 176.943C45.2285 176.291 44.9766 175.408 44.9766 174.295V172.748C44.9766 171.638 45.2344 170.761 45.75 170.117C46.2695 169.472 46.9766 169.15 47.8711 169.15C48.6953 169.15 49.332 169.398 49.7812 169.894C50.2344 170.386 50.4805 171.092 50.5195 172.01H49.4355C49.3887 171.314 49.2422 170.818 48.9961 170.521C48.75 170.224 48.375 170.076 47.8711 170.076C47.2891 170.076 46.8418 170.304 46.5293 170.761C46.2168 171.215 46.0605 171.881 46.0605 172.76V174.324C46.0605 175.187 46.2051 175.849 46.4941 176.31C46.7871 176.771 47.2129 177.002 47.7715 177.002C48.3301 177.002 48.7324 176.863 48.9785 176.586C49.2246 176.308 49.377 175.81 49.4355 175.092H50.5195ZM56.0684 173.855H53.0508V176.879H56.5664V177.799H51.9785V169.267H56.5078V170.193H53.0508V172.935H56.0684V173.855ZM61.6699 175.642C61.6699 175.217 61.5547 174.89 61.3242 174.664C61.0938 174.437 60.6777 174.217 60.0762 174.002C59.4746 173.787 59.0137 173.562 58.6934 173.328C58.377 173.09 58.1387 172.82 57.9785 172.519C57.8223 172.215 57.7441 171.867 57.7441 171.476C57.7441 170.801 57.9688 170.244 58.418 169.806C58.8711 169.369 59.4629 169.15 60.1934 169.15C60.6934 169.15 61.1387 169.263 61.5293 169.49C61.9199 169.713 62.2207 170.023 62.4316 170.422C62.6426 170.82 62.748 171.258 62.748 171.734H61.6699C61.6699 171.207 61.543 170.799 61.2891 170.51C61.0352 170.22 60.6699 170.076 60.1934 170.076C59.7598 170.076 59.4238 170.197 59.1855 170.439C58.9473 170.681 58.8281 171.021 58.8281 171.459C58.8281 171.818 58.957 172.119 59.2148 172.361C59.4727 172.603 59.8711 172.82 60.4102 173.011C61.25 173.289 61.8496 173.631 62.209 174.037C62.5723 174.443 62.7539 174.974 62.7539 175.631C62.7539 176.322 62.5293 176.877 62.0801 177.295C61.6309 177.709 61.0195 177.916 60.2461 177.916C59.75 177.916 59.291 177.808 58.8691 177.594C58.4512 177.375 58.1211 177.07 57.8789 176.679C57.6406 176.285 57.5215 175.834 57.5215 175.326H58.5996C58.5996 175.853 58.7461 176.263 59.0391 176.556C59.3359 176.849 59.7383 176.996 60.2461 176.996C60.7188 176.996 61.0742 176.875 61.3125 176.633C61.5508 176.39 61.6699 176.06 61.6699 175.642ZM65.2852 177.799H64.2129V169.267H65.2852V177.799ZM67.166 177.799V169.267H69.5977C70.375 169.267 70.959 169.457 71.3496 169.836C71.7441 170.215 71.9414 170.783 71.9414 171.541C71.9414 171.939 71.8418 172.291 71.6426 172.595C71.4434 172.9 71.1738 173.136 70.834 173.304C71.2246 173.422 71.5332 173.662 71.7598 174.025C71.9902 174.388 72.1055 174.826 72.1055 175.338C72.1055 176.103 71.8945 176.705 71.4727 177.142C71.0547 177.58 70.457 177.799 69.6797 177.799H67.166ZM68.2383 173.808V176.879H69.7031C70.1094 176.879 70.4316 176.746 70.6699 176.48C70.9082 176.211 71.0273 175.834 71.0273 175.349C71.0273 174.322 70.5938 173.808 69.7266 173.808H68.2383ZM68.2383 172.906H69.6152C69.9863 172.906 70.2852 172.781 70.5117 172.531C70.7422 172.281 70.8574 171.949 70.8574 171.535C70.8574 171.066 70.7539 170.726 70.5469 170.515C70.3398 170.301 70.0234 170.193 69.5977 170.193H68.2383V172.906ZM74.8359 177.799H73.7637V169.267H74.8359V177.799ZM77.7949 176.879H81.1406V177.799H76.7168V169.267H77.7949V176.879ZM83.543 177.799H82.4707V169.267H83.543V177.799ZM85.4238 177.799V169.267H87.457C88.4531 169.267 89.2266 169.58 89.7773 170.205C90.3281 170.826 90.6035 171.701 90.6035 172.83V174.26C90.6035 175.388 90.3242 176.261 89.7656 176.879C89.207 177.492 88.3965 177.799 87.334 177.799H85.4238ZM86.4961 170.193V176.879H87.3574C88.1113 176.879 88.6621 176.664 89.0098 176.234C89.3574 175.801 89.5352 175.16 89.543 174.312V172.801C89.543 171.902 89.3691 171.244 89.0215 170.826C88.6777 170.404 88.1562 170.193 87.457 170.193H86.4961ZM96.1289 175.572H93.2461L92.584 177.799H91.4824L94.2305 169.267H95.1504L97.9043 177.799H96.8027L96.1289 175.572ZM93.5273 174.646H95.8535L94.6875 170.767L93.5273 174.646ZM99.0645 177.799V169.267H101.098C102.094 169.267 102.867 169.58 103.418 170.205C103.969 170.826 104.244 171.701 104.244 172.83V174.26C104.244 175.388 103.965 176.261 103.406 176.879C102.848 177.492 102.037 177.799 100.975 177.799H99.0645ZM100.137 170.193V176.879H100.998C101.752 176.879 102.303 176.664 102.65 176.234C102.998 175.801 103.176 175.16 103.184 174.312V172.801C103.184 171.902 103.01 171.244 102.662 170.826C102.318 170.404 101.797 170.193 101.098 170.193H100.137Z" fill="black"/>
</svg>
