<svg width="16" height="16" viewBox="0 0 16 16" fill="none" xmlns="http://www.w3.org/2000/svg">
<g clip-path="url(#clip0)">
<path d="M11.3502 10.9272C11.4568 11.0356 11.6298 11.0322 11.7321 10.9198C12.3348 10.2566 14.0048 8.22538 14.0048 6.08411C14.0048 4.83634 13.6464 0.76548 9.03555 0.76548C5.59996 0.76548 4 2.39125 4 5.88191C4 8.31887 5.87362 10.262 6.49027 10.8351C6.55094 10.8916 6.58394 10.9695 6.58394 11.0532V13.0725C6.58394 13.2287 6.70827 13.355 6.86193 13.355H11.2218V15.3747H7.04759C6.90126 15.3747 6.78293 15.4953 6.78293 15.644V15.6443C6.78293 15.793 6.90126 15.9136 7.04759 15.9136H11.4738C11.6275 15.9136 11.7518 15.7869 11.7518 15.6308V13.0993C11.7518 12.9432 11.6275 12.8165 11.4738 12.8165H9.4052V8.51701C9.46887 8.51396 11.5532 6.39741 11.5532 6.39741C11.6568 6.29241 11.6568 6.12171 11.5532 6.01671C11.4498 5.91137 11.2818 5.91137 11.1782 6.01671L9.16788 8.05976C9.16688 8.06078 9.16654 8.06247 9.16554 8.06349L6.56561 5.53203C6.46161 5.43042 6.29695 5.43245 6.19495 5.53609C6.08995 5.64312 6.09195 5.81654 6.19895 5.9212L8.75389 8.40896C8.80655 8.4601 8.83688 8.53089 8.83688 8.60473V12.8165H7.11393V10.6695L7.01693 10.5885C6.99226 10.5678 4.52999 8.48483 4.52999 5.88191C4.52999 2.71606 5.91962 1.30401 9.03555 1.30401C13.0421 1.30401 13.4748 4.647 13.4748 6.08411C13.4748 8.04079 11.9041 9.93888 11.3425 10.5553C11.2455 10.6613 11.2495 10.8249 11.3502 10.9272Z" fill="#CCCCCC"/>
</g>
<defs>
<clipPath id="clip0">
<rect width="16" height="16" fill="white"/>
</clipPath>
</defs>
</svg>
