<svg width="160" height="160" viewBox="0 0 160 160" fill="none" xmlns="http://www.w3.org/2000/svg">
<path opacity="0.1" d="M142.549 102.615C100.794 86.8402 59.2713 86.4351 18 102.615V44H142.549V102.615Z" fill="#333333"/>
<path d="M69.1895 112.957L70.3252 116.462C70.3252 116.462 69.2977 119.751 69.7844 123.417C70.2712 127.084 70.0008 127.191 70.0008 127.191C70.0008 127.191 65.1373 126.912 65.6241 128.368C66.1108 129.824 70.8661 128.971 70.8661 128.971C70.8661 128.971 71.7794 128.726 72.212 126.137C72.6447 123.549 73.7325 118.565 73.7325 118.565L72.7096 113.859L69.1895 112.957Z" fill="#FFB8B8"/>
<path d="M69.5708 105.785C69.5708 105.785 67.5156 106.54 67.5156 108.589C67.5156 110.638 68.2728 113.442 68.7595 113.603C69.2463 113.765 72.4913 115.976 73.0862 114.412C73.6811 112.848 69.5708 105.785 69.5708 105.785Z" fill="#D0CDE1"/>
<path d="M86.7662 130.047L91.0928 129.886L94.3919 129.4L93.4184 132.635L85.4141 132.851L86.7662 130.047Z" fill="#FFB8B8"/>
<path d="M92.9871 130.481C92.9871 130.481 92.933 129.294 92.4463 129.348C91.9595 129.402 92.284 128.917 92.7167 128.809C93.1493 128.701 94.3933 128.162 94.3933 128.162L99.3148 128.486C99.3148 128.486 102.506 131.289 101.208 132.799C99.9098 134.309 96.5566 132.961 96.5566 132.961L92.933 133.015C92.933 133.015 91.7432 131.074 92.9871 130.481Z" fill="#2F2E41"/>
<path d="M94.9336 126.329L96.502 133.662L99.747 133.015L97.9082 123.849L95.9612 122.824L94.9336 126.329Z" fill="#FFB8B8"/>
<path d="M76.2745 125.413C76.2745 125.413 67.1885 129.511 71.0284 133.663C71.0284 133.663 71.0284 135.604 75.0847 135.227C79.1409 134.849 86.983 134.148 87.3616 134.364C87.7402 134.58 88.93 130.104 87.9024 129.889C86.8748 129.673 85.6309 129.403 85.6309 129.403C85.6309 129.403 86.7126 129.242 86.7126 128.325C86.7126 128.325 89.7953 128.109 90.7147 126.168C91.6342 124.227 92.4995 122.771 92.4995 122.771L94.6087 128.163C94.6087 128.163 97.0425 123.688 98.8813 125.683C98.8813 125.683 96.8262 112.797 95.2577 111.61C93.6893 110.424 92.6077 110.047 91.1474 111.125C89.6872 112.203 88.3351 114.953 88.3351 114.953L76.2745 125.413Z" fill="#2F2E41"/>
<path d="M97.9607 131.45C97.5825 131.734 97.2214 132.04 96.879 132.366C96.4463 132.798 95.8514 132.582 95.7973 132.366C95.7433 132.151 94.7698 132.528 94.6616 134.092C94.5534 135.655 93.9044 137.057 95.6351 137.542C97.3658 138.028 97.3117 139.43 97.3117 139.43C98.6811 140.084 100.253 140.181 101.692 139.699C104.126 138.89 103.261 138.028 103.261 138.028L100.016 132.69C100.016 132.69 99.1505 131.072 97.9607 131.45Z" fill="#2F2E41"/>
<path d="M88.9828 104.707C88.9828 104.707 94.1748 106.486 94.7156 106.864C95.2564 107.241 97.6902 109.02 96.5004 109.937C95.3105 110.854 94.337 111.447 92.0114 110.746C89.6858 110.045 87.0898 107.888 87.0898 107.888L88.9828 104.707Z" fill="#FFB8B8"/>
<path d="M83.793 102.336C83.793 102.336 85.8481 101.959 87.3084 102.767C88.7686 103.576 90.0125 105.194 90.0125 105.194C90.0125 105.194 88.6605 108.051 87.687 108.483C86.7135 108.914 84.9287 106.757 84.9287 106.757L83.793 102.336Z" fill="#D0CDE1"/>
<path d="M74.3263 100.771C74.3263 100.771 74.3804 102.874 74.1641 103.09C73.9477 103.305 76.7601 109.668 79.8428 106.864C82.9256 104.06 80.5459 102.928 80.5459 102.928C80.5459 102.928 79.4102 100.825 79.4642 100.61C79.5183 100.394 74.4345 100.61 74.4345 100.61L74.3263 100.771Z" fill="#FFB8B8"/>
<path opacity="0.1" d="M74.3263 100.771C74.3263 100.771 74.3804 102.874 74.1641 103.09C73.9477 103.305 76.7601 109.668 79.8428 106.864C82.9256 104.06 80.5459 102.928 80.5459 102.928C80.5459 102.928 79.4102 100.825 79.4642 100.61C79.5183 100.394 74.4345 100.61 74.4345 100.61L74.3263 100.771Z" fill="black"/>
<path d="M75.1947 104.814C75.1947 104.814 77.2498 106.216 78.1152 105.893C78.9805 105.569 80.0622 104.167 80.1703 104.059C80.2785 103.952 85.795 115.005 85.795 115.005C85.795 115.005 84.9837 119.049 82.8204 120.235C80.6571 121.421 80.6841 122.365 80.4137 123.173C80.1433 123.982 76.6549 120.612 76.6549 120.612L74.4375 111.23V105.515L75.1947 104.814Z" fill="#D0CDE1"/>
<path d="M74.2991 102.306C74.2991 102.306 73.623 102.171 72.9199 102.764C72.2168 103.358 68.9178 105.568 69.08 105.784C69.2423 106 70.7025 109.073 71.027 110.313C71.3515 111.553 71.8383 111.715 71.8383 111.715C71.8383 111.715 72.974 112.524 72.8118 113.117C72.6495 113.71 71.9464 121.798 72.9199 123.577C73.8934 125.356 73.7312 126.92 73.4608 127.351C73.1903 127.782 76.0568 126.111 76.0568 126.111C76.0568 126.111 80.3294 122.66 80.6539 121.636C80.8637 120.932 81.0085 120.21 81.0865 119.479C81.0865 119.479 78.3283 108.588 77.4629 107.994C76.5976 107.401 74.2991 102.306 74.2991 102.306Z" fill="#575A89"/>
<path d="M80.2395 102.352C80.2395 102.352 81.5722 101.527 81.8426 101.743C82.113 101.959 84.6549 101.959 84.709 102.174C84.7631 102.39 84.8713 107.566 86.7101 108.914C88.5489 110.262 87.3591 112.958 87.3591 112.958L88.7112 115.115C88.7112 115.115 81.356 122.177 81.8426 119.752C81.8696 119.617 81.8426 119.59 81.8426 119.59C81.8426 119.59 78.9762 107.35 79.3548 106.703C79.7333 106.056 80.4212 103.122 80.2395 102.352Z" fill="#575A89"/>
<path d="M91.5783 107.295L84.223 109.829C84.223 109.829 76.9217 111.554 78.0575 113.549C79.1932 115.544 84.0067 112.148 84.0067 112.148L93.8015 111.053C93.8015 111.053 97.6897 107.78 91.5783 107.295Z" fill="#FFB8B8"/>
<path d="M77.2483 102.767C79.4586 102.767 81.2504 100.981 81.2504 98.777C81.2504 96.5735 79.4586 94.7871 77.2483 94.7871C75.0379 94.7871 73.2461 96.5735 73.2461 98.777C73.2461 100.981 75.0379 102.767 77.2483 102.767Z" fill="#FFB8B8"/>
<path d="M74.0599 94.8113L73.3195 94.5429C73.3195 94.5429 74.8675 92.9997 77.0211 93.1339L76.4154 92.5301C76.4154 92.5301 77.896 91.9933 79.2421 93.4023C79.9496 94.143 80.7683 95.0136 81.2787 95.9944H82.0715L81.7406 96.6542L82.8988 97.3139L81.71 97.1954C81.8227 97.765 81.7839 98.3541 81.5976 98.9042L81.3284 99.6422C81.3284 99.6422 80.2516 97.4952 80.2516 97.2268V97.8977C80.2516 97.8977 79.5113 97.2939 79.5113 96.8913L79.1075 97.3609L78.9056 96.6229L76.4154 97.3609L76.8192 96.7571L75.2713 96.9584L75.877 96.2203C75.877 96.2203 74.1272 97.0926 74.0599 97.8306C73.9926 98.5687 73.1177 99.508 73.1177 99.508L72.7139 98.8371C72.7139 98.8371 72.1081 95.8178 74.0599 94.8113Z" fill="#2F2E41"/>
<path d="M126.276 128.952L126.027 128.947C126.123 126.191 126.418 123.446 126.91 120.733C127.985 114.923 129.772 111.108 132.223 109.393L132.366 109.595C126.641 113.602 126.279 128.799 126.276 128.952Z" fill="#D0CDE1"/>
<path d="M129.381 128.893L129.133 128.888C129.138 128.614 129.294 122.145 131.848 120.357L131.991 120.56C129.539 122.276 129.383 128.827 129.381 128.893Z" fill="#D0CDE1"/>
<path d="M133.782 109.619C134.469 109.619 135.025 109.064 135.025 108.38C135.025 107.695 134.469 107.141 133.782 107.141C133.096 107.141 132.539 107.695 132.539 108.38C132.539 109.064 133.096 109.619 133.782 109.619Z" fill="#AEEA00"/>
<path d="M133.165 120.275C133.851 120.275 134.408 119.72 134.408 119.036C134.408 118.352 133.851 117.797 133.165 117.797C132.478 117.797 131.922 118.352 131.922 119.036C131.922 119.72 132.478 120.275 133.165 120.275Z" fill="#AEEA00"/>
<path d="M128.806 110.36C129.04 111.847 128.431 113.178 128.431 113.178C128.431 113.178 127.443 112.097 127.21 110.609C126.976 109.122 127.585 107.791 127.585 107.791C127.585 107.791 128.573 108.872 128.806 110.36Z" fill="#AEEA00"/>
<path d="M132.866 113.96C131.438 114.449 130.02 114.088 130.02 114.088C130.02 114.088 130.917 112.936 132.346 112.448C133.775 111.959 135.193 112.319 135.193 112.319C135.193 112.319 134.295 113.472 132.866 113.96Z" fill="#D0CDE1"/>
<path d="M132.911 123.411C132.264 123.613 131.576 123.643 130.914 123.497C131.334 122.963 131.9 122.563 132.543 122.343C133.187 122.123 133.88 122.093 134.54 122.257C134.108 122.777 133.546 123.175 132.911 123.411Z" fill="#D0CDE1"/>
<path d="M118.186 106.693C117.867 106.693 117.554 106.598 117.288 106.421C117.023 106.244 116.816 105.993 116.693 105.698C116.571 105.404 116.539 105.08 116.601 104.767C116.664 104.455 116.818 104.168 117.044 103.943C117.27 103.717 117.558 103.564 117.871 103.502C118.184 103.439 118.509 103.471 118.805 103.593C119.1 103.715 119.352 103.922 119.53 104.187C119.707 104.452 119.802 104.763 119.802 105.082C119.802 105.509 119.631 105.918 119.328 106.22C119.025 106.522 118.615 106.692 118.186 106.693ZM118.186 103.719C117.916 103.719 117.651 103.798 117.427 103.948C117.202 104.098 117.026 104.311 116.923 104.56C116.82 104.809 116.792 105.083 116.845 105.348C116.898 105.612 117.028 105.855 117.219 106.046C117.411 106.236 117.654 106.366 117.919 106.419C118.185 106.471 118.46 106.444 118.709 106.341C118.959 106.238 119.173 106.063 119.323 105.839C119.473 105.615 119.554 105.351 119.554 105.082C119.553 104.72 119.409 104.374 119.153 104.118C118.896 103.863 118.549 103.719 118.186 103.719Z" fill="#D0CDE1"/>
<path d="M110.608 115.078C111.157 115.078 111.602 114.635 111.602 114.087C111.602 113.54 111.157 113.096 110.608 113.096C110.058 113.096 109.613 113.54 109.613 114.087C109.613 114.635 110.058 115.078 110.608 115.078Z" fill="#D0CDE1"/>
<path d="M122.215 75C120.986 75 119.784 75.3634 118.762 76.0442C117.74 76.7251 116.943 77.6927 116.473 78.8249C116.003 79.9571 115.88 81.2029 116.119 82.4048C116.359 83.6067 116.951 84.7108 117.82 85.5773C118.69 86.4438 119.797 87.034 121.003 87.273C122.208 87.5121 123.458 87.3894 124.593 86.9204C125.729 86.4515 126.7 85.6573 127.383 84.6384C128.066 83.6194 128.43 82.4215 128.43 81.196C128.43 79.5528 127.775 77.9768 126.61 76.8148C125.444 75.6528 123.863 75 122.215 75ZM121.143 83.9688L118.47 81.3036L119.219 80.556L121.145 82.4761L125.211 78.4233L125.961 79.1709L121.143 83.9688Z" fill="#16C62E"/>
<path d="M50.4872 51H26V52.1153H50.4872V51Z" fill="#D0CDE1"/>
<path d="M50.4872 53.8496H26V54.9649H50.4872V53.8496Z" fill="#D0CDE1"/>
<path d="M50.4872 56.6992H26V57.8145H50.4872V56.6992Z" fill="#D0CDE1"/>
<path d="M32.5876 61.4062H30.1016V63.8847H32.5876V61.4062Z" fill="#D0CDE1"/>
<path d="M39.5446 61.4062H37.0586V63.8847H39.5446V61.4062Z" fill="#7319D5"/>
<path d="M46.5095 61.4062H44.0234V63.8847H46.5095V61.4062Z" fill="#AEEA00"/>
<path d="M48.7458 70.7012H27.8633V74.2796H48.7458V70.7012Z" fill="#D0CDE1"/>
<path d="M48.7458 76.1934H27.8633V79.7718H48.7458V76.1934Z" fill="#7319D5"/>
<path d="M48.7458 81.6855H27.8633V85.264H48.7458V81.6855Z" fill="#16C62E"/>
<path opacity="0.15" d="M36.5022 70.7012H27.8633V74.2796H36.5022V70.7012Z" fill="black"/>
<path opacity="0.15" d="M30.66 76.1934H27.8633V79.7718H30.66V76.1934Z" fill="black"/>
<path opacity="0.15" d="M41.7849 81.6855H27.8633V85.264H41.7849V81.6855Z" fill="black"/>
<path d="M80.75 47V87.8939C86.1895 87.8939 91.4062 85.7396 95.2525 81.9051C99.0988 78.0706 101.26 72.8698 101.26 67.4469C101.26 62.0241 99.0988 56.8233 95.2525 52.9888C91.4062 49.1542 86.1895 47 80.75 47Z" fill="#AEEA00"/>
<path d="M79.3831 47.9004C75.8878 47.8997 72.4611 48.8683 69.4864 50.6981C66.5117 52.5278 64.1063 55.1465 62.5391 58.2613L79.3831 68.2014V47.9004Z" fill="#D0CDE1"/>
<path d="M61.174 58.5273C59.6069 61.6451 58.8654 65.1106 59.0201 68.5945C59.1747 72.0785 60.2204 75.4651 62.0577 78.4327C63.895 81.4002 66.4629 83.8502 69.5174 85.5497C72.5719 87.2492 76.0116 88.1419 79.5096 88.1428V69.3478L61.174 58.5273Z" fill="#7319D5"/>
<path d="M127.613 57.6562H115.059V58.7715H127.613V57.6562Z" fill="#D0CDE1"/>
<path d="M113.443 56.9121H110.957V59.3905H113.443V56.9121Z" fill="#7319D5"/>
<path d="M127.613 61.375H115.059V62.4903H127.613V61.375Z" fill="#D0CDE1"/>
<path d="M113.443 60.6309H110.957V63.1093H113.443V60.6309Z" fill="#7319D5"/>
<path d="M127.613 65.0918H115.059V66.2071H127.613V65.0918Z" fill="#D0CDE1"/>
<path d="M113.443 64.3496H110.957V66.828H113.443V64.3496Z" fill="#7319D5"/>
<path d="M74.1289 75.2174L73.9531 75.0421L87.0411 61.9941H109.84V62.242H87.144L74.1289 75.2174Z" fill="#2F2E41"/>
<circle opacity="0.1" cx="80.2487" cy="80.2487" r="64.2487" fill="#7319D5"/>
</svg>
