<svg width="280" height="196" viewBox="0 0 280 196" fill="none" xmlns="http://www.w3.org/2000/svg">
<path d="M255.536 183.612C259.658 183.612 263 183.264 263 182.836C263 182.407 259.658 182.06 255.536 182.06C251.413 182.06 248.071 182.407 248.071 182.836C248.071 183.264 251.413 183.612 255.536 183.612Z" fill="#E6E6E6"/>
<path d="M198.534 183.964C204.53 183.964 209.391 183.459 209.391 182.836C209.391 182.213 204.53 181.708 198.534 181.708C192.538 181.708 187.677 182.213 187.677 182.836C187.677 183.459 192.538 183.964 198.534 183.964Z" fill="#E6E6E6"/>
<path d="M230.654 183.964C236.651 183.964 241.512 183.459 241.512 182.836C241.512 182.213 236.651 181.708 230.654 181.708C224.658 181.708 219.797 182.213 219.797 182.836C219.797 183.459 224.658 183.964 230.654 183.964Z" fill="#E6E6E6"/>
<path d="M257.671 176.789C257.619 178.722 257.295 180.639 256.707 182.483C256.693 182.525 256.679 182.567 256.665 182.61H253.066C253.07 182.572 253.074 182.529 253.078 182.483C253.318 179.73 254.701 162.977 253.047 160.113C253.192 160.345 257.95 168.043 257.671 176.789Z" fill="#E7FFAC"/>
<path d="M257.402 182.482C257.372 182.525 257.34 182.568 257.308 182.61H254.608C254.629 182.574 254.653 182.531 254.68 182.482C255.126 181.679 256.446 179.278 257.672 176.788C258.989 174.113 260.197 171.336 260.095 170.331C260.127 170.558 261.038 177.468 257.402 182.482Z" fill="#E7FFAC"/>
<path d="M181.965 121.032H17.9739C17.4506 121.032 16.9489 120.824 16.5788 120.455C16.2088 120.086 16.0006 119.585 16 119.063V14.9693C16.0006 14.4472 16.2088 13.9466 16.5788 13.5774C16.9489 13.2082 17.4506 13.0006 17.9739 13H181.965C182.489 13.0006 182.991 13.2082 183.361 13.5774C183.731 13.9466 183.939 14.4472 183.939 14.9693V119.063C183.939 119.585 183.731 120.086 183.361 120.455C182.991 120.824 182.489 121.032 181.965 121.032ZM17.9739 13.7793C17.6577 13.7796 17.3545 13.9051 17.1308 14.1282C16.9072 14.3513 16.7814 14.6538 16.781 14.9693V119.063C16.7814 119.379 16.9072 119.681 17.1308 119.904C17.3545 120.127 17.6577 120.253 17.9739 120.253H181.965C182.282 120.253 182.585 120.127 182.809 119.904C183.032 119.681 183.158 119.379 183.158 119.063V14.9693C183.158 14.6538 183.032 14.3513 182.809 14.1282C182.585 13.9051 182.282 13.7796 181.965 13.7792L17.9739 13.7793Z" fill="#E6E6E6"/>
<path d="M139.488 28.3462H52.5998C52.173 28.3466 51.7639 28.5159 51.4621 28.817C51.1604 29.1181 50.9907 29.5263 50.9902 29.9521V104.08C50.9907 104.506 51.1604 104.914 51.4621 105.215C51.7639 105.516 52.173 105.686 52.5998 105.686H139.488C139.915 105.686 140.324 105.516 140.625 105.215C140.927 104.914 141.097 104.506 141.097 104.08V29.9521C141.097 29.5263 140.927 29.1181 140.625 28.817C140.324 28.5159 139.915 28.3466 139.488 28.3462ZM140.452 104.08C140.452 104.336 140.351 104.581 140.17 104.762C139.989 104.943 139.744 105.045 139.488 105.046H52.5998C52.3436 105.045 52.098 104.943 51.9171 104.762C51.7363 104.581 51.6349 104.336 51.6353 104.08V29.9521C51.6349 29.6964 51.7363 29.4511 51.9171 29.2701C52.098 29.0891 52.3436 28.9871 52.5998 28.9867H139.488C139.744 28.9876 139.989 29.0897 140.17 29.2707C140.351 29.4516 140.452 29.6966 140.452 29.9521V104.08Z" fill="#3F3D56"/>
<path d="M72.6563 92.5055C72.6563 92.6198 72.6532 92.7341 72.6472 92.8453C72.5596 94.5182 71.8318 96.0938 70.614 97.2471C69.3961 98.4003 67.7811 99.0432 66.1021 99.0432C64.423 99.0432 62.808 98.4003 61.5901 97.2471C60.3723 96.0938 59.6445 94.5182 59.5569 92.8453C59.5509 92.7341 59.5479 92.6198 59.5479 92.5055C59.5473 91.6464 59.7164 90.7956 60.0456 90.0018C60.3747 89.2079 60.8574 88.4866 61.4661 87.8789C62.0747 87.2712 62.7975 86.7892 63.5929 86.4603C64.3884 86.1314 65.241 85.9622 66.1021 85.9622C66.9631 85.9622 67.8157 86.1314 68.6112 86.4603C69.4067 86.7892 70.1294 87.2712 70.738 87.8789C71.3467 88.4866 71.8294 89.2079 72.1585 90.0018C72.4877 90.7956 72.6568 91.6464 72.6563 92.5055Z" fill="#E7FFAC"/>
<path d="M132.737 88.145H81.2374C80.9479 88.1455 80.6705 88.2605 80.4659 88.4649C80.2614 88.6693 80.1465 88.9463 80.1465 89.2351C80.1465 89.524 80.2614 89.801 80.4659 90.0054C80.6705 90.2098 80.9479 90.3248 81.2374 90.3253H132.737C133.026 90.3248 133.304 90.2098 133.508 90.0054C133.713 89.801 133.828 89.524 133.828 89.2351C133.828 88.9463 133.713 88.6693 133.508 88.4649C133.304 88.2605 133.026 88.1455 132.737 88.145Z" fill="#CAB0FF"/>
<path d="M103.397 94.6857H81.2376C80.9482 94.6857 80.6707 94.8004 80.4661 95.0045C80.2614 95.2087 80.1465 95.4856 80.1465 95.7743C80.1465 96.063 80.2614 96.3399 80.4661 96.544C80.6707 96.7482 80.9482 96.8629 81.2376 96.8629H103.397C103.687 96.8629 103.964 96.7482 104.169 96.544C104.374 96.3399 104.488 96.063 104.488 95.7743C104.488 95.4856 104.374 95.2087 104.169 95.0045C103.964 94.8004 103.687 94.6857 103.397 94.6857Z" fill="#E6E6E6"/>
<path d="M90.9384 64.3911C90.6489 64.3916 90.3715 64.5066 90.167 64.7109C89.9625 64.9153 89.8477 65.1922 89.8477 65.481C89.8477 65.7698 89.9625 66.0467 90.167 66.2511C90.3715 66.4554 90.6489 66.5704 90.9384 66.5709H113.098C113.388 66.5704 113.665 66.4554 113.869 66.2511C114.074 66.0467 114.189 65.7698 114.189 65.481C114.189 65.1922 114.074 64.9153 113.869 64.7109C113.665 64.5066 113.388 64.3916 113.098 64.3911H90.9384Z" fill="white"/>
<path d="M23.0066 19.8963C23.7561 19.8963 24.3638 19.29 24.3638 18.5422C24.3638 17.7943 23.7561 17.1881 23.0066 17.1881C22.257 17.1881 21.6494 17.7943 21.6494 18.5422C21.6494 19.29 22.257 19.8963 23.0066 19.8963Z" fill="#CAB0FF"/>
<path d="M27.7566 19.8963C28.5061 19.8963 29.1138 19.29 29.1138 18.5422C29.1138 17.7943 28.5061 17.1881 27.7566 17.1881C27.007 17.1881 26.3994 17.7943 26.3994 18.5422C26.3994 19.29 27.007 19.8963 27.7566 19.8963Z" fill="#CAB0FF"/>
<path d="M32.5076 19.8963C33.2571 19.8963 33.8647 19.29 33.8647 18.5422C33.8647 17.7943 33.2571 17.1881 32.5076 17.1881C31.758 17.1881 31.1504 17.7943 31.1504 18.5422C31.1504 19.29 31.758 19.8963 32.5076 19.8963Z" fill="#CAB0FF"/>
<path d="M216.79 126.688L215.678 132.842C215.588 133.336 215.617 133.844 215.763 134.325C215.909 134.806 216.166 135.246 216.515 135.608C216.864 135.97 217.293 136.245 217.769 136.41C218.244 136.574 218.752 136.624 219.251 136.555C219.69 136.494 220.111 136.343 220.487 136.111C220.864 135.879 221.188 135.571 221.439 135.207C221.69 134.843 221.862 134.431 221.944 133.996C222.026 133.562 222.017 133.116 221.916 132.686L220.505 126.634L225.552 110.331L224.389 92.8817L217.159 95.3759L220.427 108.718L216.79 126.688Z" fill="#FFB8B8"/>
<path d="M213.831 77.5173C217.17 77.5173 219.876 74.8168 219.876 71.4855C219.876 68.1543 217.17 65.4537 213.831 65.4537C210.492 65.4537 207.785 68.1543 207.785 71.4855C207.785 74.8168 210.492 77.5173 213.831 77.5173Z" fill="#FFB8B8"/>
<path d="M211.288 88.7315L223.104 88.5473C220.569 82.4263 218.515 76.6471 219.042 72.7059L210.734 73.9953C211.718 79.5935 212.194 83.6258 211.288 88.7315Z" fill="#FFB8B8"/>
<path d="M201.872 103.652L217.75 106.599C223.103 96.815 226.056 87.9801 221.073 82.2846L211.657 81.7319C205.641 88.1508 200.552 94.3801 204.01 98.8634L201.872 103.652Z" fill="#E7FFAC"/>
<path d="M216.012 95.9693C219.646 97.3563 223.018 96.1508 226.114 92.1975L221.526 83.3665L215.68 84.5224L216.012 95.9693Z" fill="#CAB0FF"/>
<path d="M200.395 176.964L206.672 176.642L210.734 134.229L231.412 176.412L237.874 176.228L225.504 139.203C225.016 126.85 224.506 114.53 219.227 109.178L217.381 105.31L202.611 102.178L200.58 106.047C195.871 117.016 198.636 148.36 200.395 176.964Z" fill="#2F2E41"/>
<path d="M196.834 183.285L204.161 183.986C204.599 184.028 205.041 183.972 205.455 183.823C205.869 183.673 206.244 183.434 206.554 183.121C206.864 182.809 207.1 182.432 207.246 182.018C207.391 181.603 207.443 181.162 207.396 180.725L206.858 175.675C204.827 176.202 202.66 176.079 200.396 175.491L197.626 177.885L196.314 178.295C195.828 178.446 195.399 178.738 195.08 179.133C194.761 179.529 194.567 180.01 194.523 180.516C194.465 181.188 194.675 181.856 195.107 182.375C195.54 182.894 196.161 183.221 196.834 183.285Z" fill="#2F2E41"/>
<path d="M227.851 183.285L235.178 183.986C235.616 184.028 236.058 183.972 236.472 183.823C236.886 183.673 237.261 183.434 237.571 183.121C237.88 182.809 238.117 182.432 238.262 182.018C238.408 181.603 238.459 181.162 238.413 180.725L237.874 175.675C235.844 176.202 233.677 176.079 231.412 175.491L228.643 177.885L227.33 178.295C226.845 178.446 226.415 178.738 226.097 179.133C225.778 179.529 225.584 180.01 225.54 180.516C225.481 181.188 225.691 181.856 226.124 182.375C226.557 182.894 227.177 183.221 227.851 183.285Z" fill="#2F2E41"/>
<path d="M206.673 92.0472C209.259 94.947 212.809 95.4251 217.381 93.3367V83.3897L211.658 81.7319L206.673 92.0472Z" fill="#E7FFAC"/>
<path d="M193.196 119.678L189.37 124.63C189.062 125.028 188.854 125.493 188.761 125.986C188.669 126.48 188.695 126.989 188.837 127.47C188.98 127.952 189.235 128.393 189.581 128.758C189.927 129.122 190.355 129.4 190.83 129.567C191.247 129.715 191.691 129.774 192.132 129.741C192.574 129.708 193.003 129.583 193.394 129.375C193.785 129.167 194.127 128.88 194.401 128.532C194.674 128.185 194.871 127.784 194.981 127.356L196.519 121.335L208.52 109.178L215.535 93.1525L207.966 92.0472L202.796 106.047L193.196 119.678Z" fill="#FFB8B8"/>
<path d="M211.519 62.5857C214.296 61.1925 217.615 60.7779 220.566 61.7492C223.518 62.7205 226.016 65.1557 226.77 68.1636C227.341 70.4374 226.929 72.8227 226.728 75.158C226.526 77.4933 226.59 80.0171 227.939 81.9361C228.785 83.1387 230.048 83.9727 231.292 84.7578C232.536 85.5429 233.819 86.3313 234.738 87.4787C235.657 88.6261 236.153 90.2308 235.599 91.5914C234.891 93.3285 232.851 94.0357 231.042 94.5453C228.464 95.2719 225.851 96.0037 223.172 96.0573C220.493 96.1108 217.697 95.4109 215.728 93.5973C213.051 91.1303 212.408 87.0954 212.916 83.4946C213.423 79.8939 214.892 76.5063 215.818 72.9894C216.175 71.6304 216.383 69.991 215.392 68.9924C214.386 67.978 212.68 68.1769 211.427 67.4876C210.884 67.1884 210.445 66.7302 210.171 66.1747C209.896 65.6192 209.799 64.9931 209.892 64.3807C209.985 63.7683 210.264 63.1991 210.691 62.7498C211.118 62.3004 211.673 61.9924 212.281 61.8674" fill="#2F2E41"/>
<circle cx="95.5" cy="48.5" r="31.5" fill="white"/>
<path d="M127 48.5C127 65.897 112.897 80 95.5 80C78.103 80 64 65.897 64 48.5C64 31.1031 78.103 17 95.5 17C112.897 17 127 31.1031 127 48.5ZM71.8648 48.5C71.8648 61.5534 82.4466 72.1353 95.5 72.1353C108.553 72.1353 119.135 61.5534 119.135 48.5C119.135 35.4467 108.553 24.8648 95.5 24.8648C82.4466 24.8648 71.8648 35.4467 71.8648 48.5Z" fill="#F1F1F1"/>
<path d="M95.5 17C100.05 17 104.545 17.9855 108.677 19.8887C112.81 21.792 116.481 24.5677 119.438 28.025C122.395 31.4824 124.568 35.5393 125.808 39.9166C127.048 44.294 127.324 48.888 126.619 53.3825C125.914 57.877 124.244 62.1655 121.723 65.9529C119.202 69.7403 115.891 72.9367 112.017 75.3223C108.143 77.7078 103.799 79.226 99.282 79.7722C94.7654 80.3184 90.184 79.8798 85.8531 78.4865L88.2655 70.9879C91.5134 72.0328 94.9491 72.3617 98.3362 71.9521C101.723 71.5424 104.982 70.4039 107.887 68.6149C110.792 66.8259 113.275 64.4288 115.166 61.5885C117.056 58.7482 118.309 55.5322 118.837 52.1616C119.366 48.791 119.159 45.3458 118.229 42.0631C117.299 38.7803 115.67 35.7379 113.452 33.1452C111.234 30.5524 108.481 28.4708 105.382 27.0435C102.283 25.6162 98.9118 24.8772 95.5 24.8772V17Z" fill="#CAB0FF"/>
<path d="M85 41.6246C85 40.2521 85.4582 39.1408 86.3747 38.2906C87.2912 37.4302 88.4921 37 89.9774 37C91.4838 37 92.6953 37.4251 93.6117 38.2753C94.5282 39.1152 94.9865 40.2572 94.9865 41.7015V42.8077C94.9865 44.1904 94.5282 45.3018 93.6117 46.1417C92.6953 46.9816 91.4944 47.4015 90.009 47.4015C88.5132 47.4015 87.3017 46.9816 86.3747 46.1417C85.4582 45.2915 85 44.1495 85 42.7155V41.6246ZM88.0339 42.8077C88.0339 43.4222 88.2129 43.919 88.5711 44.298C88.9398 44.6667 89.4191 44.8511 90.009 44.8511C90.5989 44.8511 91.0677 44.6616 91.4153 44.2826C91.763 43.9036 91.9368 43.3966 91.9368 42.7616V41.6246C91.9368 41.0101 91.763 40.5133 91.4153 40.1343C91.0677 39.7553 90.5884 39.5658 89.9774 39.5658C89.398 39.5658 88.9293 39.7553 88.5711 40.1343C88.2129 40.5031 88.0339 41.0203 88.0339 41.6861V42.8077ZM95.9977 54.2078C95.9977 52.825 96.4612 51.7137 97.3883 50.8738C98.3153 50.0237 99.5162 49.5986 100.991 49.5986C102.487 49.5986 103.693 50.0185 104.609 50.8584C105.536 51.6881 106 52.8353 106 54.3V55.4062C106 56.7787 105.547 57.89 104.641 58.7402C103.735 59.5801 102.529 60 101.023 60C99.5056 60 98.2889 59.575 97.3725 58.7248C96.456 57.8747 95.9977 56.748 95.9977 55.3447V54.2078ZM99.0316 55.4062C99.0316 55.9695 99.2212 56.4509 99.6005 56.8504C99.9797 57.2499 100.454 57.4496 101.023 57.4496C102.308 57.4496 102.95 56.7582 102.95 55.3755V54.2078C102.95 53.5932 102.771 53.1016 102.413 52.7328C102.055 52.3539 101.581 52.1644 100.991 52.1644C100.401 52.1644 99.927 52.3539 99.5688 52.7328C99.2107 53.1016 99.0316 53.6086 99.0316 54.2539V55.4062ZM90.9097 58.0181L88.6817 56.8504L99.9165 39.3661L102.144 40.5338L90.9097 58.0181Z" fill="#3F3D56"/>
</svg>
