<svg width="305" height="243" viewBox="0 0 305 243" fill="none" xmlns="http://www.w3.org/2000/svg">
<g clip-path="url(#clip0)">
<rect x="19" y="47" width="129" height="21" fill="#F1F1F1"/>
<rect x="16" y="102" width="129" height="21" fill="#F1F1F1"/>
<rect x="19" y="156" width="129" height="21" fill="#F1F1F1"/>
<path d="M190.021 124.868H170.554V105.571H183.764V106.03H171.018V124.409H189.557V115.219H190.021V124.868Z" fill="#3F3D56"/>
<path d="M305 225.792H0V226.495H305V225.792Z" fill="#3F3D56"/>
<path d="M194.067 101.504L191.136 106.348C191.136 106.348 196.022 106.348 196.999 113.613L200.908 108.77L194.067 101.504Z" fill="#CCCCCC"/>
<path d="M259.05 211.937L259.538 226.467L253.675 229.857L251.232 228.404L251.721 211.937H259.05Z" fill="#FFB8B8"/>
<path d="M224.36 208.062L225.337 223.561L211.657 229.373L212.634 221.139C212.634 221.139 216.543 214.842 215.565 208.062H224.36Z" fill="#FFB8B8"/>
<path d="M245.369 91.333C245.369 91.333 253.186 111.676 254.652 124.269C256.118 136.862 258.561 170.282 258.561 170.282L263.447 213.389L249.766 215.327L243.903 171.735L230.711 128.628L227.78 171.735L225.337 210.968L212.634 211.452L211.656 170.767L206.282 118.941L209.214 94.2391L245.369 91.333Z" fill="#666666"/>
<path d="M252.698 227.436C252.698 227.436 253.499 219.301 259.45 223.853L260.515 223.077L265.401 233.732C265.401 233.732 271.264 241.966 261.004 242.935C250.744 243.904 251.721 233.732 251.721 233.732L250.744 229.373L251.232 226.519L252.698 227.436Z" fill="#2F2E41"/>
<path d="M224.36 217.749C225.563 218.43 226.559 219.419 227.247 220.611C227.934 221.803 228.287 223.156 228.269 224.53C228.269 229.373 227.78 229.858 227.78 229.858L220.451 231.795C220.451 231.795 215.565 231.311 212.634 234.217C209.702 237.123 195.045 239.06 195.045 235.185C195.045 231.311 207.259 225.014 207.259 225.014C207.259 225.014 210.887 218.941 213.47 219.556C216.054 220.171 217.031 221.139 217.031 221.624C217.031 222.108 215.565 225.498 215.565 225.498C215.565 225.498 223.871 223.561 224.36 217.749Z" fill="#2F2E41"/>
<path d="M223.383 31.7578C230.129 31.7578 235.597 26.3366 235.597 19.6491C235.597 12.9616 230.129 7.54028 223.383 7.54028C216.637 7.54028 211.168 12.9616 211.168 19.6491C211.168 26.3366 216.637 31.7578 223.383 31.7578Z" fill="#FFB8B8"/>
<path d="M232.422 22.7976L237.796 34.9064L223.138 55.7335C223.138 55.7335 222.161 32.969 219.23 29.0942C216.298 25.2194 232.422 22.7976 232.422 22.7976Z" fill="#FFB8B8"/>
<path d="M225.581 47.9837L228.024 41.6872L229.979 42.1714L232.422 40.234L235.842 29.5784L240.728 32.9687L247.079 96.4187L207.504 97.3874L212.878 53.3115L217.764 40.7185L221.291 36.0964L223.627 43.1401L225.581 47.9837Z" fill="#CCCCCC"/>
<path d="M236.819 75.1074L238.314 31.2939C238.314 31.2939 241.216 31.5158 242.193 32.9688C243.17 34.4219 259.294 37.328 259.294 37.328L256.362 82.3727C256.362 82.3727 268.577 118.215 264.18 120.152C259.782 122.089 251.965 121.605 251.965 121.605L236.819 75.1074Z" fill="#333333"/>
<path d="M213.122 69.5373L218.305 40.0088L206.771 47.7415L209.702 69.053L207.259 83.5835C207.259 83.5835 197.976 123.785 200.908 125.238C203.839 126.691 207.259 125.238 207.259 125.238L213.122 84.5522V69.5373Z" fill="#333333"/>
<path d="M210.191 46.7727L206.771 47.7414L205.305 67.1155L202.862 84.0678L191.136 104.895C191.136 104.895 196.999 101.02 199.442 112.16L212.356 89.8716L210.191 46.7727Z" fill="#333333"/>
<path d="M248.301 101.504C248.301 101.504 234.62 112.16 241.46 114.582C248.301 117.004 252.698 105.864 252.698 105.864L248.301 101.504Z" fill="#FFB8B8"/>
<path d="M193.579 105.379C193.579 105.379 179.898 116.035 186.739 118.457C193.579 120.879 197.976 109.739 197.976 109.739L193.579 105.379Z" fill="#FFB8B8"/>
<path d="M256.607 106.832L252.209 112.16L246.346 101.989L248.789 97.6296L256.607 106.832Z" fill="#CCCCCC"/>
<path d="M255.629 39.0231L259.538 37.0857C259.538 37.0857 262.47 40.9605 262.958 44.351C263.447 47.7414 265.89 52.1006 265.89 54.5223C265.89 56.9441 272.73 79.7086 272.73 79.7086L257.095 111.191C257.095 111.191 253.675 99.567 246.346 98.5983L258.561 81.646L251.721 69.5372L255.629 39.0231Z" fill="#333333"/>
<path d="M233.608 8.11205L235.912 7.19791C235.912 7.19791 231.095 1.94162 224.395 2.39871L226.279 0.341879C226.279 0.341879 221.673 -1.48638 217.485 3.31282C215.283 5.83565 212.736 8.80112 211.148 12.1417H208.681L209.711 14.3889L206.108 16.6362L209.806 16.2325C209.586 17.4631 209.552 18.7195 209.706 19.96C209.864 21.2009 210.503 22.3321 211.487 23.115C211.487 23.115 214.344 17.2534 214.344 16.3392V18.6246C214.344 18.6246 216.647 16.5678 216.647 15.1966L217.904 16.7963L218.532 14.2824L226.279 16.7963L225.023 14.7395L229.839 15.4251L227.954 12.9112C227.954 12.9112 233.399 15.8822 233.608 18.3961C233.818 20.9099 235.411 23.292 235.411 23.292C235.411 23.292 239.681 11.54 233.608 8.11205Z" fill="#2F2E41"/>
<path d="M233.399 19.4068C234.154 19.4068 234.767 18.6478 234.767 17.7116C234.767 16.7753 234.154 16.0164 233.399 16.0164C232.643 16.0164 232.031 16.7753 232.031 17.7116C232.031 18.6478 232.643 19.4068 233.399 19.4068Z" fill="#FFB8B8"/>
<path d="M16 44V70H84.5H153V44H16ZM68.7719 65.6152L24.7593 65.6376V64.0961H68.7719V65.6152ZM94.7794 58.7792H24.7593V57.26H94.7794V58.7792ZM143.794 51.9431H24.7593V50.424H143.794V51.9431Z" fill="#7319D5"/>
<path d="M16 99V125H84.5H153V99H16ZM68.7719 120.615L24.7593 120.638V119.096H68.7719V120.615ZM94.7794 113.779H24.7593V112.26H94.7794V113.779ZM143.794 106.943H24.7593V105.424H143.794V106.943Z" fill="#7319D5"/>
<path d="M16 153V179H84.5H153V153H16ZM68.7719 174.615L24.7593 174.638V173.096H68.7719V174.615ZM94.7794 167.779H24.7593V166.26H94.7794V167.779ZM143.794 160.943H24.7593V159.424H143.794V160.943Z" fill="#7319D5"/>
<path d="M190.021 70.1918H170.554V50.894H183.764V51.3535H171.018V69.7324H189.557V60.5429H190.021V70.1918Z" fill="#3F3D56"/>
<path d="M180.187 65.1581C179.737 63.8413 174.096 59.3653 177.553 58.6129L180.388 62.36L193.421 49.4402L194.732 50.7396L180.187 65.1581Z" fill="#16C62E"/>
<path d="M180.187 119.835C179.737 118.518 174.096 114.042 177.553 113.29L180.388 117.037L193.421 104.117L194.732 105.416L180.187 119.835Z" fill="#16C62E"/>
<path d="M190.021 179.315H170.554V160.018H183.764V160.477H171.018V178.856H189.557V169.666H190.021V179.315Z" fill="#3F3D56"/>
<path d="M180.187 174.282C179.737 172.965 174.096 168.489 177.553 167.736L180.388 171.484L193.421 158.564L194.732 159.863L180.187 174.282Z" fill="#16C62E"/>
</g>
<defs>
<clipPath id="clip0">
<rect width="305" height="243" fill="white"/>
</clipPath>
</defs>
</svg>
