<svg width="143" height="100" viewBox="0 0 143 100" fill="none" xmlns="http://www.w3.org/2000/svg">
<g clip-path="url(#clip0)">
<path d="M6.36981 38.3759C6.50654 46.8214 9.66169 47.7358 13.5363 46.8549C17.9627 45.8486 21.5957 42.6946 23.3862 38.5216L24.6211 35.6437C25.442 33.7305 25.4697 31.5693 24.6979 29.6356C23.9262 27.702 22.4182 26.1542 20.5058 25.3329H20.5058C19.5589 24.9262 18.5412 24.7101 17.5108 24.6969C16.4804 24.6837 15.4575 24.8737 14.5005 25.256C13.5435 25.6384 12.6711 26.2055 11.9332 26.9251C11.1953 27.6447 10.6062 28.5027 10.1997 29.4501C6.22609 31.0117 5.4413 34.2448 6.36981 38.3759Z" fill="#2F2E41"/>
<path d="M31.2843 21.3777L32.4735 19.3643C32.6188 19.1185 32.7065 18.8429 32.73 18.5583C32.7536 18.2737 32.7125 17.9874 32.6097 17.721C32.5069 17.4546 32.3451 17.2149 32.1365 17.02C31.928 16.825 31.6779 16.6799 31.4053 16.5954C31.1175 16.5062 30.8125 16.4872 30.5159 16.5398C30.2192 16.5924 29.9394 16.7153 29.6999 16.898C29.4603 17.0808 29.2678 17.3182 29.1385 17.5904C29.0092 17.8627 28.9468 18.1619 28.9565 18.4632L29.0264 20.6273L23.4375 35.9509L26.4852 36.5875L31.2843 21.3777Z" fill="#9F616A"/>
<path d="M1.88039 59.1529L0.416571 60.9762C0.23782 61.1988 0.111784 61.4591 0.0479212 61.7374C-0.0159416 62.0157 -0.0159741 62.3049 0.0478261 62.5833C0.111626 62.8616 0.237603 63.1219 0.416304 63.3446C0.595006 63.5673 0.821793 63.7466 1.07965 63.8691C1.35182 63.9984 1.65093 64.0607 1.95205 64.0509C2.25317 64.0411 2.54759 63.9594 2.81077 63.8126C3.07394 63.6659 3.29825 63.4584 3.465 63.2073C3.63175 62.9563 3.7361 62.669 3.76938 62.3694L4.00839 60.2173L11.7224 45.8467L8.79639 44.7822L1.88039 59.1529Z" fill="#9F616A"/>
<path d="M10.9258 74.3219L11.1412 76.9113L11.1918 77.5154L25.5185 76.1368C26.0124 76.0812 26.4861 75.9097 26.9013 75.6364C27.3164 75.363 27.6612 74.9956 27.9077 74.5638C28.1542 74.1321 28.2954 73.6483 28.3198 73.1517C28.3442 72.6551 28.2512 72.1597 28.0482 71.7059L23.4278 61.7822L21.8318 58.3545L14.9158 56.7578C9.21275 61.1249 14.3439 65.9443 20.7997 70.8197C21.0524 71.0113 21.3078 71.2029 21.5658 71.3945L10.9258 74.3219Z" fill="#2F2E41"/>
<path d="M6.09666 83.2888C6.27122 83.3137 6.44926 83.2934 6.61371 83.2297C6.77816 83.166 6.9235 83.0612 7.03581 82.9252L11.7221 77.2496L11.4561 74.5884L9.85824 73.6292C9.72753 73.5507 9.58132 73.5017 9.42975 73.4855C9.27818 73.4692 9.1249 73.4862 8.98056 73.5352C8.83621 73.5842 8.70426 73.6641 8.59388 73.7693C8.4835 73.8745 8.39733 74.0024 8.34137 74.1443L5.28478 81.8912C5.2277 82.0359 5.20411 82.1916 5.2158 82.3467C5.22749 82.5018 5.27415 82.6523 5.35228 82.7868C5.4304 82.9212 5.53796 83.0363 5.66689 83.1232C5.79581 83.2102 5.94275 83.2668 6.09666 83.2888Z" fill="#2F2E41"/>
<path opacity="0.2" d="M10.127 73.7896L10.393 76.9831L11.1404 76.9113L24.7197 75.6046C25.2136 75.5489 25.6873 75.3774 26.1024 75.1041C26.5176 74.8308 26.8624 74.4633 27.1089 74.0316C27.3553 73.5999 27.4965 73.116 27.5209 72.6195C27.5454 72.1229 27.4523 71.6275 27.2494 71.1737L23.427 62.6125V61.7822L21.831 58.3545L14.915 56.7578C9.21192 61.1249 14.3431 65.9444 20.7989 70.8197L20.767 70.8623L10.127 73.7896Z" fill="black"/>
<path d="M4.76658 82.2243C4.94114 82.2492 5.11918 82.2289 5.28363 82.1652C5.44808 82.1016 5.59342 81.9967 5.70572 81.8607L10.3921 76.1852L10.1261 73.5239L8.52817 72.5647C8.39746 72.4863 8.25124 72.4372 8.09967 72.421C7.9481 72.4048 7.79482 72.4218 7.65048 72.4708C7.50613 72.5198 7.37418 72.5997 7.2638 72.7048C7.15342 72.81 7.06725 72.938 7.01129 73.0798L3.95471 80.8267C3.89762 80.9714 3.87404 81.1271 3.88573 81.2822C3.89741 81.4374 3.94407 81.5878 4.0222 81.7223C4.10032 81.8568 4.20788 81.9718 4.33681 82.0587C4.46573 82.1457 4.61266 82.2023 4.76658 82.2243Z" fill="#2F2E41"/>
<path d="M9.5957 73.2575L9.8617 76.4509L24.1885 75.072C24.6823 75.0164 25.156 74.845 25.5712 74.5717C25.9863 74.2985 26.3312 73.9311 26.5777 73.4995C26.8243 73.0678 26.9656 72.5841 26.9902 72.0875C27.0148 71.591 26.922 71.0956 26.7193 70.6417L22.8957 62.0803V57.2901L13.5857 55.6934C7.65826 60.2319 13.4336 65.2595 20.2357 70.3301L9.5957 73.2575Z" fill="#2F2E41"/>
<path d="M18.6384 35.7342C20.8421 35.7342 22.6284 33.947 22.6284 31.7423C22.6284 29.5377 20.8421 27.7505 18.6384 27.7505C16.4348 27.7505 14.6484 29.5377 14.6484 31.7423C14.6484 33.947 16.4348 35.7342 18.6384 35.7342Z" fill="#9F616A"/>
<path d="M13.3184 38.3957L18.9044 42.1214L23.6924 41.0569L21.0324 38.3957V34.4038L16.7764 34.1377C16.687 35.7318 15.774 37.1905 13.3184 38.3957Z" fill="#9F616A"/>
<path d="M12.5205 57.0241L22.8945 58.3547L25.2885 47.1776C26.4006 44.2107 25.7625 41.5894 23.7034 39.2487C23.6247 38.8548 23.4149 38.4992 23.1083 38.2398C22.8016 37.9805 22.4162 37.8327 22.0149 37.8205L21.0325 37.8633C21.1436 41.3928 18.5444 40.5427 14.6485 37.5972L14.178 37.7384C13.5699 37.9209 13.0477 38.3164 12.7072 38.8525C12.3666 39.3886 12.2304 40.0295 12.3235 40.6579L12.7524 43.5547C12.9343 44.7032 13.2169 45.8334 13.5969 46.9323C14.6604 50.1125 14.2804 53.4792 12.5205 57.0241Z" fill="#7319D5"/>
<path d="M7.73242 45.0487L12.5204 46.6454L14.6484 38.9279L13.9275 38.6C13.3298 38.3282 12.6511 38.2941 12.0292 38.5045C11.4073 38.715 10.8887 39.1543 10.5786 39.7333L7.73242 45.0487Z" fill="#7319D5"/>
<path d="M21.8301 37.8634L24.4901 40.7907L27.682 35.7344L23.692 33.6055L21.8301 37.8634Z" fill="#7319D5"/>
<path d="M13.9844 30.545C16.4917 31.4909 19.1675 31.3929 21.9644 30.545V27.3516H13.9844V30.545Z" fill="#2F2E41"/>
<path d="M138.426 85.3641L135.675 86.5108L117.337 61.5133L104.042 86.9695L100.604 86.2815L110.69 51.1934H122.38L138.426 85.3641Z" fill="#2F2E41"/>
<path d="M142.117 91.1955C141.964 91.2371 141.805 91.2481 141.648 91.2279C141.492 91.2077 141.34 91.1567 141.203 91.0778L135.402 87.7362C135.246 87.646 135.112 87.521 135.011 87.3708C134.911 87.2205 134.846 87.0492 134.823 86.87C134.799 86.6908 134.817 86.5085 134.875 86.3373C134.933 86.1662 135.03 86.0106 135.157 85.8828L135.676 85.3641L138.426 85.1348L142.632 89.1735C142.785 89.3204 142.896 89.5053 142.954 89.7092C143.012 89.9132 143.015 90.129 142.963 90.3345C142.911 90.5401 142.805 90.7281 142.656 90.8793C142.508 91.0306 142.321 91.1397 142.117 91.1955Z" fill="#2F2E41"/>
<path d="M97.1411 92.1125C97.2935 92.1541 97.4528 92.1651 97.6095 92.1449C97.7663 92.1247 97.9175 92.0737 98.0545 91.9948L103.856 88.6532C104.012 88.563 104.146 88.438 104.246 88.2877C104.347 88.1375 104.412 87.9662 104.435 87.787C104.459 87.6078 104.441 87.4255 104.383 87.2543C104.325 87.0831 104.228 86.9276 104.101 86.7998L103.582 86.2811L100.831 86.0518L96.6263 90.0905C96.4734 90.2374 96.3621 90.4223 96.3039 90.6262C96.2457 90.8302 96.2426 91.0459 96.2949 91.2515C96.3472 91.4571 96.4531 91.6451 96.6018 91.7963C96.7504 91.9476 96.9365 92.0566 97.1411 92.1125Z" fill="#2F2E41"/>
<path d="M102.896 14.7289L101.75 15.4169L99.3747 11.5555C99.2288 11.3183 99.1421 11.0496 99.1218 10.7719C99.1015 10.4941 99.1483 10.2156 99.2582 9.95975C99.3681 9.70391 99.5378 9.47825 99.7532 9.3018C99.9685 9.12536 100.223 9.00331 100.495 8.94594C100.738 8.89494 100.988 8.89633 101.229 8.95002C101.471 9.00371 101.698 9.10846 101.896 9.25725C102.094 9.40604 102.258 9.59542 102.376 9.8127C102.495 10.03 102.566 10.2701 102.584 10.517L102.896 14.7289Z" fill="#FFB9B9"/>
<path d="M134.645 44.7922L135.12 43.5425L139.373 45.1078C139.635 45.2039 139.869 45.3615 140.056 45.5672C140.244 45.7729 140.379 46.0208 140.451 46.2898C140.523 46.5589 140.529 46.8412 140.469 47.1131C140.409 47.385 140.284 47.6384 140.105 47.852C139.947 48.0419 139.749 48.1956 139.526 48.3029C139.303 48.4101 139.06 48.4685 138.812 48.4739C138.565 48.4793 138.319 48.4318 138.091 48.3344C137.864 48.2371 137.66 48.0922 137.493 47.9094L134.645 44.7922Z" fill="#FFB9B9"/>
<path d="M116.649 28.4889C118.548 28.4889 120.088 26.9488 120.088 25.0489C120.088 23.149 118.548 21.6089 116.649 21.6089C114.75 21.6089 113.211 23.149 113.211 25.0489C113.211 26.9488 114.75 28.4889 116.649 28.4889Z" fill="#FFB9B9"/>
<path d="M119.628 32.3876H114.814V27.113L118.941 26.6543L119.628 32.3876Z" fill="#FFB9B9"/>
<path d="M123.068 52.569H110.002C110.463 45.2754 110.828 38.2269 110.002 34.2223L110.762 30.5738C110.867 30.0683 111.159 29.621 111.578 29.3207C111.998 29.0205 112.516 28.8893 113.028 28.9534L114.816 29.1769C116.026 31.3064 117.49 31.2858 119.171 29.4063H121.324C121.612 29.4063 121.896 29.4636 122.16 29.5748C122.425 29.686 122.665 29.849 122.866 30.0541C123.067 30.2592 123.225 30.5023 123.331 30.7693C123.437 31.0362 123.489 31.3216 123.483 31.6088C124.044 34.1785 124.23 36.8159 124.037 39.439L123.068 52.569Z" fill="#16C62E"/>
<path d="M101.061 14.7293L102.894 13.812L112.751 30.0947L110.001 34.2227L101.061 14.7293Z" fill="#16C62E"/>
<path d="M134.672 45.4448L136.239 44.1223L127.911 32.4481C127.097 31.306 125.974 30.4197 124.674 29.8932C123.374 29.3666 121.951 29.2215 120.571 29.4749L120.309 29.5232L123.457 35.0361L127.605 38.1775L134.672 45.4448Z" fill="#16C62E"/>
<path d="M120.626 23.0183C120.626 23.0183 121.268 21.6042 119.598 20.9613C119.598 20.9613 118.184 18.6473 115.357 20.19C115.357 20.19 113.43 20.9613 113.43 23.0183C113.43 25.0753 112.787 25.461 112.787 25.461C112.787 25.461 113.744 24.4789 114.001 23.7076C114.258 22.9362 116.257 22.7612 117.028 23.5326C117.799 24.3039 119.726 24.1754 119.726 24.1754L119.598 27.0037C119.598 27.0037 120.24 25.3324 120.497 25.3324C120.754 25.3324 121.011 23.0183 120.626 23.0183Z" fill="#2F2E41"/>
<path d="M120.308 100C131.928 100 141.347 99.5094 141.347 98.9039C141.347 98.2984 131.928 97.8076 120.308 97.8076C108.689 97.8076 99.2695 98.2984 99.2695 98.9039C99.2695 99.5094 108.689 100 120.308 100Z" fill="#CCCCCC"/>
<path d="M15.2631 99.4831C21.4049 99.4831 26.3837 99.2237 26.3837 98.9037C26.3837 98.5837 21.4049 98.3242 15.2631 98.3242C9.12142 98.3242 4.14258 98.5837 4.14258 98.9037C4.14258 99.2237 9.12142 99.4831 15.2631 99.4831Z" fill="#CCCCCC"/>
<path d="M100.229 19.2877L32.624 25.3495C32.292 25.3788 31.962 25.2753 31.7063 25.0615C31.4505 24.8478 31.29 24.5412 31.2598 24.2092L29.7568 7.43151C29.7275 7.0994 29.831 6.7692 30.0447 6.51335C30.2583 6.2575 30.5647 6.09688 30.8966 6.06672L98.5019 0.00489833C98.8338 -0.0244725 99.1638 0.0790827 99.4196 0.292848C99.6753 0.506612 99.8359 0.813132 99.866 1.14517L101.369 17.9229C101.398 18.255 101.295 18.5852 101.081 18.841C100.868 19.0969 100.561 19.2575 100.229 19.2877Z" fill="#E8F5E9"/>
<path d="M52.3524 10.3267C52.1203 10.348 51.9061 10.4605 51.7569 10.6396C51.6076 10.8187 51.5354 11.0497 51.5562 11.2819C51.5771 11.5142 51.6891 11.7287 51.8678 11.8783C52.0465 12.028 52.2773 12.1006 52.5095 12.0803L93.8238 8.37581C93.939 8.36565 94.051 8.33286 94.1536 8.27933C94.2561 8.2258 94.3471 8.15256 94.4213 8.06382C94.4955 7.97508 94.5515 7.87257 94.5861 7.76216C94.6207 7.65175 94.6332 7.5356 94.6228 7.42036C94.6125 7.30511 94.5796 7.19303 94.5259 7.09053C94.4723 6.98803 94.3989 6.89712 94.3101 6.823C94.2213 6.74888 94.1188 6.693 94.0084 6.65855C93.898 6.62411 93.7819 6.61179 93.6667 6.62228L52.3524 10.3267Z" fill="white"/>
<path d="M52.8245 15.587C52.7093 15.5971 52.5971 15.6298 52.4946 15.6833C52.392 15.7369 52.3009 15.8101 52.2267 15.8988C52.1524 15.9876 52.0964 16.0901 52.0618 16.2006C52.0272 16.311 52.0147 16.4272 52.025 16.5425C52.0353 16.6577 52.0683 16.7699 52.122 16.8724C52.1756 16.9749 52.249 17.0658 52.3379 17.14C52.4267 17.2141 52.5293 17.27 52.6398 17.3044C52.7502 17.3388 52.8664 17.3511 52.9816 17.3405L94.2959 13.6361C94.4111 13.6259 94.5231 13.5931 94.6257 13.5396C94.7282 13.486 94.8192 13.4128 94.8934 13.3241C94.9676 13.2353 95.0236 13.1328 95.0582 13.0224C95.0928 12.912 95.1052 12.7959 95.0949 12.6806C95.0846 12.5654 95.0517 12.4533 94.998 12.3508C94.9444 12.2483 94.871 12.1574 94.7822 12.0833C94.6934 12.0091 94.5909 11.9532 94.4805 11.9188C94.3701 11.8844 94.2539 11.872 94.1388 11.8825L52.8245 15.587Z" fill="white"/>
<ellipse cx="40.9501" cy="14.6586" rx="5.33486" ry="5.33732" fill="#16C62E"/>
<path d="M39.9969 17.3275L37.6152 14.9246L38.2883 14.2457L39.9969 15.9687L43.6098 12.3237L44.2838 13.0036L39.9969 17.3275Z" fill="white"/>
</g>
<defs>
<clipPath id="clip0">
<rect width="143" height="100" fill="white"/>
</clipPath>
</defs>
</svg>
