<svg width="305" height="216" viewBox="0 0 305 216" fill="none" xmlns="http://www.w3.org/2000/svg">
<path d="M60.8492 195.003C66.3903 202.396 77.8925 203.174 77.8925 203.174C77.8925 203.174 80.4109 191.966 74.8698 184.574C69.3287 177.181 57.8265 176.403 57.8265 176.403C57.8265 176.403 55.3081 187.611 60.8492 195.003Z" fill="#16C62E"/>
<path d="M89.0768 197.782C85.4204 202.66 77.8304 203.174 77.8304 203.174C77.8304 203.174 76.1686 195.778 79.825 190.9C83.4814 186.022 91.0714 185.508 91.0714 185.508C91.0714 185.508 92.7332 192.904 89.0768 197.782Z" fill="#16C62E"/>
<path d="M304.795 202.818H49.6373V203.675H304.795V202.818Z" fill="#3F3D56"/>
<path d="M293.97 45.4463L296.192 46.5535C296.192 46.5535 308.233 76.6329 304.158 83.8299C300.082 91.0268 287.301 104.498 287.301 104.498L284.893 97.6701L294.741 76.3992L293.97 45.4463Z" fill="#575A89"/>
<path opacity="0.1" d="M293.97 45.4463L296.192 46.5535C296.192 46.5535 308.233 76.6329 304.158 83.8299C300.082 91.0268 287.301 104.498 287.301 104.498L284.893 97.6701L294.741 76.3992L293.97 45.4463Z" fill="black"/>
<path d="M291.562 195.844C291.562 195.844 294.711 203.04 293.043 203.594C291.376 204.148 289.339 204.148 287.301 204.148C285.263 204.148 282.855 203.41 282.485 202.671C282.114 201.933 283.967 197.135 283.967 197.135L291.562 195.844Z" fill="#16C62E"/>
<path d="M249.142 199.534C249.142 199.534 251.18 205.993 250.253 206.362C249.327 206.731 246.363 208.392 244.696 207.839C243.029 207.285 240.436 205.993 239.88 205.44C239.324 204.886 239.88 201.933 239.88 201.933L242.473 198.243L249.142 199.534Z" fill="#16C62E"/>
<path d="M285.634 103.575L288.289 104.498C288.289 104.498 288.968 110.772 288.227 112.987C287.486 115.201 285.819 131.256 286.745 134.578C287.672 137.899 287.116 143.251 287.116 143.251C287.116 143.251 292.673 161.335 291.562 165.211C290.45 169.086 290.635 174.622 291.747 177.39C292.858 180.158 293.784 181.265 293.229 183.48C292.673 185.694 291.562 186.801 292.673 188.647C293.784 190.492 296.007 191.046 294.896 192.706C293.784 194.367 292.673 195.659 293.043 196.766C293.414 197.873 283.226 199.903 282.3 198.243C282.3 198.243 285.263 195.659 282.3 194.183C279.336 192.707 280.262 187.17 280.262 187.17C280.262 187.17 275.075 165.949 275.261 164.288C275.446 162.627 267.11 136.792 267.11 136.792C267.11 136.792 254.884 173.699 254.143 175.36C253.403 177.021 255.07 181.081 254.143 182.188C253.217 183.295 254.514 186.063 253.217 187.17C251.921 188.278 255.44 192.337 253.217 193.814C250.994 195.29 249.883 199.903 250.068 200.826C250.253 201.749 240.806 200.642 240.806 199.35C240.806 198.058 240.992 196.951 240.065 194.736C239.139 192.522 238.583 191.046 239.324 190.308C240.065 189.569 240.621 188.647 239.88 186.063C239.139 183.48 240.992 175.545 240.436 174.068C239.88 172.592 240.065 162.627 240.065 162.627C240.065 162.627 241.918 148.049 241.362 145.65C240.806 143.251 241.362 142.697 241.547 141.774C241.732 140.852 242.844 130.887 243.585 129.411C244.326 127.934 245.252 102.653 249.513 101.361C253.773 100.069 285.634 103.575 285.634 103.575Z" fill="#2F2E41"/>
<path d="M287.116 202.487C287.116 202.487 293.785 201.38 294.155 202.487C294.526 203.594 295.637 212.267 293.044 212.452C290.45 212.636 286.005 213.19 285.264 211.529C284.523 209.868 281.003 208.761 281.003 208.761C281.003 208.761 275.817 207.285 275.817 205.624C275.817 203.963 276.002 201.38 276.928 201.195C277.854 201.011 281.559 198.981 281.559 198.243C281.559 197.504 287.116 202.487 287.116 202.487Z" fill="#2F2E41"/>
<path d="M245.437 205.439C245.437 205.439 250.254 203.963 251.365 204.886C252.476 205.808 253.958 215.958 251.365 215.773C248.772 215.589 241.918 216.696 241.547 215.22C241.177 213.744 236.175 213.375 236.175 213.375C236.175 213.375 230.803 210.791 231.174 208.023C231.544 205.255 232.1 204.332 234.323 204.148C236.546 203.963 238.213 201.38 238.398 201.195C238.583 201.011 240.217 199.662 240.419 201.167C240.621 202.671 243.029 205.993 245.437 205.439Z" fill="#2F2E41"/>
<path d="M260.627 26.6235C266.868 26.6235 271.927 21.5837 271.927 15.3668C271.927 9.14991 266.868 4.11011 260.627 4.11011C254.386 4.11011 249.328 9.14991 249.328 15.3668C249.328 21.5837 254.386 26.6235 260.627 26.6235Z" fill="#A0616A"/>
<path d="M270.444 17.9504C270.444 17.9504 271.185 30.3144 273.964 31.4216C276.743 32.5288 259.886 32.5288 259.886 32.5288C259.886 32.5288 259.701 24.7783 257.293 22.9329C254.884 21.0876 270.444 17.9504 270.444 17.9504Z" fill="#A0616A"/>
<path d="M274.89 28.6535C274.89 28.6535 263.406 24.4092 259.33 31.0525C259.33 31.0525 246.364 37.1422 245.438 40.8329C244.511 44.5237 253.218 72.2041 253.218 72.2041C253.218 72.2041 253.218 95.0867 251.365 97.4856C249.513 99.8846 245.993 102.468 248.401 103.022C250.809 103.575 288.598 107.635 288.413 105.236C288.228 102.837 285.819 100.807 288.413 99.331C291.006 97.8547 288.783 96.1939 290.45 91.3959C292.118 86.598 296.193 46.9227 296.193 46.9227C296.193 46.9227 293.414 41.9402 292.859 41.3866C292.303 40.8329 274.89 28.6535 274.89 28.6535Z" fill="#575A89"/>
<path d="M241.733 109.48C241.733 109.48 234.508 125.72 240.806 127.934C247.104 130.149 246.734 110.772 246.734 110.772L241.733 109.48Z" fill="#A0616A"/>
<path d="M266.047 17.4606C265.392 16.1531 264.412 14.6449 262.947 14.7245C262.207 14.7647 261.568 15.2238 260.908 15.5608C260.248 15.8977 259.402 16.1066 258.799 15.6772C257.916 15.049 258.19 13.5591 257.4 12.818C256.538 12.009 254.804 12.4607 254.248 11.4191C253.951 10.8629 254.191 10.1729 254.062 9.55626C253.16 9.633 252.252 9.5279 251.392 9.24725C250.556 8.90955 249.831 8.12709 249.855 7.22841C249.88 6.92225 249.966 6.62413 250.108 6.35153C250.25 6.07892 250.445 5.83731 250.682 5.64083C251.821 4.60935 253.468 4.41154 254.874 3.78596C255.992 3.28813 256.964 2.51226 258.063 1.97374C259.955 1.04691 262.137 0.867174 264.239 1.02718C267.426 1.2698 270.649 2.32343 272.96 4.52303C275.271 6.72264 276.494 10.1928 275.497 13.2182C274.932 14.9325 273.735 16.3734 273.067 18.0505C272.658 19.1982 272.374 20.3866 272.221 21.595L271.752 24.4612C271.825 24.0151 270.842 22.8963 270.519 22.6301C269.816 22.0494 268.793 22.2464 268.14 21.7085C267.174 20.9129 266.615 18.5948 266.047 17.4606Z" fill="#2F2E41"/>
<path opacity="0.1" d="M249.698 39.5412L246.734 41.3866C246.734 41.3866 241.918 70.3588 242.474 74.4186C243.029 78.4784 240.251 101.361 241.177 103.206C242.103 105.052 242.474 105.421 242.474 106.528C242.474 107.635 239.88 111.695 241.547 112.433C243.214 113.171 249.327 114.463 249.327 112.433C249.327 110.403 248.216 107.635 250.254 106.343C252.291 105.052 253.773 96.7475 253.773 96.7475C253.773 96.7475 254.699 88.2588 255.625 86.598C256.552 84.9372 257.848 78.8474 257.848 76.2639C257.848 73.6804 260.071 63.1619 258.774 57.8103C257.478 52.4587 257.107 38.0649 249.698 39.5412Z" fill="black"/>
<path d="M248.401 38.9877L245.437 40.8331C245.437 40.8331 240.621 69.8053 241.177 73.8651C241.732 77.9249 238.954 100.807 239.88 102.653C240.806 104.498 241.177 104.867 241.177 105.974C241.177 107.082 238.583 111.141 240.25 111.88C241.918 112.618 248.03 113.91 248.03 111.88C248.03 109.85 246.919 107.082 248.957 105.79C250.994 104.498 252.476 96.194 252.476 96.194C252.476 96.194 253.402 87.7053 254.329 86.0445C255.255 84.3837 256.551 78.294 256.551 75.7105C256.551 73.127 258.774 62.6084 257.478 57.2568C256.181 51.9053 255.81 37.5114 248.401 38.9877Z" fill="#575A89"/>
<path d="M218.103 0H0V109.008H218.103V0Z" fill="#E6E6E6"/>
<path d="M208.088 8.86841H10.0151V100.139H208.088V8.86841Z" fill="white"/>
<path d="M200.769 16.8196L201.265 17.3157L176.125 42.4719L168.237 34.5785L154.389 48.4362L137.386 31.4212L108.462 60.3642L95.3153 47.208L66.5673 75.9759L50.4403 59.838L20.8882 89.4098L20.3924 88.9136L50.4403 58.8457L66.5673 74.9837L95.3153 46.2162L108.462 59.372L137.386 30.429L154.389 47.4439L168.237 33.5863L176.125 41.4801L200.769 16.8196Z" fill="#7319D5"/>
<path d="M136.984 35.4098C134.781 35.4098 132.994 33.6263 132.994 31.4262C132.994 29.2262 134.781 27.4426 136.984 27.4426C139.188 27.4426 140.974 29.2262 140.974 31.4262C140.974 33.6263 139.188 35.4098 136.984 35.4098Z" fill="#7319D5"/>
<path d="M108.612 63.7377C106.408 63.7377 104.622 61.9542 104.622 59.7541C104.622 57.554 106.408 55.7705 108.612 55.7705C110.816 55.7705 112.602 57.554 112.602 59.7541C112.602 61.9542 110.816 63.7377 108.612 63.7377Z" fill="#7319D5"/>
<path d="M50.5378 63.7377C48.5792 63.7377 46.9913 62.1524 46.9913 60.1967C46.9913 58.2411 48.5792 56.6558 50.5378 56.6558C52.4965 56.6558 54.0844 58.2411 54.0844 60.1967C54.0844 62.1524 52.4965 63.7377 50.5378 63.7377Z" fill="#7319D5"/>
</svg>
