<svg width="40" height="40" viewBox="0 0 40 40" fill="none" xmlns="http://www.w3.org/2000/svg">
<path d="M9.58375 34.3787L2.5 28.06L4.16375 26.195L11.215 32.4837L20.8275 23.1775C21.2752 22.744 21.8735 22.5007 22.4967 22.4989C23.12 22.497 23.7197 22.7367 24.17 23.1675L28.7 27.4975L35.675 20.0312L37.5 21.7375L30.5238 29.2062C30.2984 29.4475 30.0274 29.6415 29.7266 29.7773C29.4257 29.913 29.1008 29.9877 28.7709 29.997C28.4409 30.0063 28.1124 29.95 27.8043 29.8315C27.4963 29.7129 27.2148 29.5344 26.9762 29.3062L22.505 25.0325L12.9225 34.3075C12.4776 34.7384 11.8861 34.9851 11.2669 34.9981C10.6476 35.0111 10.0464 34.7894 9.58375 34.3775V34.3787Z" fill="#7319D5"/>
<path d="M37.5 13.75H32.5L35 10L37.5 13.75Z" fill="#7319D5"/>
<path d="M27.5 5H22.5V7.5H27.5V10H23.75V12.5H27.5V15H22.5V17.5H27.5C28.1627 17.499 28.798 17.2353 29.2667 16.7667C29.7353 16.298 29.999 15.6627 30 15V7.5C29.9993 6.83716 29.7357 6.20166 29.267 5.73296C28.7983 5.26427 28.1628 5.00066 27.5 5Z" fill="#7319D5"/>
<path d="M20 17.5H12.5V12.5C12.5007 11.8372 12.7643 11.2017 13.233 10.733C13.7017 10.2643 14.3372 10.0007 15 10H17.5V7.5H12.5V5H17.5C18.1628 5.00066 18.7983 5.26427 19.267 5.73296C19.7357 6.20166 19.9993 6.83716 20 7.5V10C19.9993 10.6628 19.7357 11.2983 19.267 11.767C18.7983 12.2357 18.1628 12.4993 17.5 12.5H15V15H20V17.5Z" fill="#7319D5"/>
<path d="M7.5 15V5H5V6.25H2.5V8.75H5V15H2.5V17.5H10V15H7.5Z" fill="#7319D5"/>
</svg>
