<svg width="426" height="96" viewBox="0 0 426 96" fill="none" xmlns="http://www.w3.org/2000/svg">
<path d="M69.2031 73.4687L84.6235 50.9375H164.156" stroke="#999999"/>
<path d="M57.9375 67.0312L92.5501 13.9219H247.039" stroke="#999999"/>
<path d="M76.2271 76.0799C72.5336 82.2339 67.2907 87.3117 61.0216 90.8065C54.7525 94.3012 47.6766 96.0908 40.4998 95.9965C33.3231 95.9022 26.2966 93.9273 20.1215 90.269C13.9464 86.6107 8.83879 81.3969 5.30826 75.1479C1.77774 68.8989 -0.0521759 61.8333 0.00113226 54.6561C0.0544404 47.479 1.98911 40.4413 5.61207 34.2454C9.23502 28.0496 14.4196 22.9122 20.6483 19.346C26.877 15.7799 33.9321 13.9096 41.1094 13.9219L41.0872 26.889C36.1777 26.8805 31.3518 28.1599 27.0911 30.5992C22.8305 33.0386 19.2841 36.5527 16.8059 40.7909C14.3277 45.029 13.0043 49.843 12.9678 54.7524C12.9314 59.6618 14.1831 64.495 16.5981 68.7695C19.0131 73.044 22.5069 76.6104 26.7308 79.1128C30.9547 81.6152 35.7611 82.966 40.6702 83.0305C45.5793 83.095 50.4195 81.8709 54.7078 79.4804C58.996 77.0899 62.5823 73.6165 65.1088 69.4069L70.6679 72.7434L76.2271 76.0799Z" fill="#7319D5"/>
<path d="M62.4279 67.7979C60.1833 71.5378 56.9974 74.6237 53.1879 76.748C49.3784 78.8722 45.0785 79.9605 40.7172 79.9042C36.3558 79.8479 32.0855 78.649 28.3321 76.4272C24.5787 74.2054 21.4734 71.0382 19.3261 67.2417C17.1788 63.4452 16.0645 59.152 16.0943 54.7904C16.1242 50.4288 17.2971 46.1512 19.4961 42.3844C21.6951 38.6176 24.8434 35.4932 28.6268 33.3229C32.4102 31.1526 36.6966 30.0123 41.0583 30.0156L41.0522 37.8976C38.0687 37.8953 35.1367 38.6753 32.5487 40.1598C29.9607 41.6444 27.8072 43.7816 26.303 46.3582C24.7988 48.9348 23.9965 51.8608 23.9761 54.8443C23.9557 57.8277 24.7179 60.7644 26.1867 63.3614C27.6556 65.9583 29.7796 68.1247 32.3471 69.6445C34.9145 71.1643 37.8356 71.9844 40.8189 72.0229C43.8022 72.0614 46.7434 71.317 49.3492 69.864C51.955 68.4109 54.1343 66.3 55.6697 63.7418L62.4279 67.7979Z" fill="#B98CEA"/>
<circle cx="260.719" cy="13.9219" r="6.4375" fill="#B98CEA"/>
<circle cx="178.641" cy="50.9375" r="6.4375" fill="#7319D5"/>
<path d="M197.711 52.75C197.711 52.1823 197.557 51.7474 197.25 51.4453C196.943 51.1432 196.388 50.849 195.586 50.5625C194.784 50.276 194.169 49.9766 193.742 49.6641C193.32 49.3464 193.003 48.987 192.789 48.5859C192.581 48.1797 192.477 47.7161 192.477 47.1953C192.477 46.2943 192.776 45.5521 193.375 44.9688C193.979 44.3854 194.768 44.0938 195.742 44.0938C196.409 44.0938 197.003 44.2448 197.523 44.5469C198.044 44.8438 198.445 45.2578 198.727 45.7891C199.008 46.3203 199.148 46.9036 199.148 47.5391H197.711C197.711 46.8359 197.542 46.2917 197.203 45.9062C196.865 45.5208 196.378 45.3281 195.742 45.3281C195.164 45.3281 194.716 45.4896 194.398 45.8125C194.081 46.1354 193.922 46.5885 193.922 47.1719C193.922 47.651 194.094 48.0521 194.438 48.375C194.781 48.6979 195.312 48.987 196.031 49.2422C197.151 49.612 197.951 50.0677 198.43 50.6094C198.914 51.151 199.156 51.8594 199.156 52.7344C199.156 53.6562 198.857 54.3958 198.258 54.9531C197.659 55.5052 196.844 55.7812 195.812 55.7812C195.151 55.7812 194.539 55.638 193.977 55.3516C193.419 55.0599 192.979 54.6536 192.656 54.1328C192.339 53.6068 192.18 53.0052 192.18 52.3281H193.617C193.617 53.0312 193.812 53.5781 194.203 53.9688C194.599 54.3594 195.135 54.5547 195.812 54.5547C196.443 54.5547 196.917 54.3932 197.234 54.0703C197.552 53.7474 197.711 53.3073 197.711 52.75ZM203.867 55.7812C202.815 55.7812 202.008 55.4688 201.445 54.8438C200.883 54.2135 200.596 53.2917 200.586 52.0781V51.0547C200.586 49.7943 200.859 48.8073 201.406 48.0938C201.958 47.375 202.727 47.0156 203.711 47.0156C204.701 47.0156 205.44 47.3307 205.93 47.9609C206.419 48.5911 206.669 49.5729 206.68 50.9062V51.8125H201.961V52.0078C201.961 52.9141 202.13 53.5729 202.469 53.9844C202.812 54.3958 203.305 54.6016 203.945 54.6016C204.352 54.6016 204.708 54.526 205.016 54.375C205.328 54.2188 205.62 53.974 205.891 53.6406L206.609 54.5156C206.01 55.3594 205.096 55.7812 203.867 55.7812ZM203.711 48.2031C203.138 48.2031 202.714 48.401 202.438 48.7969C202.161 49.1875 202.005 49.7969 201.969 50.625H205.297V50.4375C205.26 49.6354 205.115 49.0625 204.859 48.7188C204.609 48.375 204.227 48.2031 203.711 48.2031ZM211.836 48.4688C211.643 48.4323 211.435 48.4141 211.211 48.4141C210.503 48.4141 210.008 48.8021 209.727 49.5781V55.625H208.344V47.1719H209.688L209.711 48.0312C210.081 47.3542 210.604 47.0156 211.281 47.0156C211.5 47.0156 211.682 47.0521 211.828 47.125L211.836 48.4688ZM215.758 53.5234L217.359 47.1719H218.766L216.258 55.625H215.227L212.688 47.1719H214.094L215.758 53.5234ZM221.695 55.625H220.312V47.1719H221.695V55.625ZM221.805 44.9297C221.805 45.1641 221.74 45.3594 221.609 45.5156C221.479 45.6719 221.281 45.75 221.016 45.75C220.755 45.75 220.56 45.6719 220.43 45.5156C220.299 45.3594 220.234 45.1641 220.234 44.9297C220.234 44.6953 220.299 44.4974 220.43 44.3359C220.56 44.1745 220.755 44.0938 221.016 44.0938C221.276 44.0938 221.471 44.1771 221.602 44.3438C221.737 44.5052 221.805 44.7005 221.805 44.9297ZM226.812 54.6016C227.271 54.6016 227.638 54.4609 227.914 54.1797C228.19 53.8932 228.341 53.487 228.367 52.9609H229.672C229.641 53.7734 229.352 54.4479 228.805 54.9844C228.263 55.5156 227.599 55.7812 226.812 55.7812C225.766 55.7812 224.966 55.4531 224.414 54.7969C223.867 54.1354 223.594 53.1536 223.594 51.8516V50.9219C223.594 49.6458 223.867 48.6771 224.414 48.0156C224.961 47.349 225.758 47.0156 226.805 47.0156C227.669 47.0156 228.354 47.2891 228.859 47.8359C229.37 48.3828 229.641 49.1302 229.672 50.0781H228.367C228.336 49.4531 228.185 48.9844 227.914 48.6719C227.648 48.3594 227.279 48.2031 226.805 48.2031C226.19 48.2031 225.734 48.4062 225.438 48.8125C225.141 49.2135 224.987 49.875 224.977 50.7969V51.875C224.977 52.8698 225.122 53.5729 225.414 53.9844C225.711 54.3958 226.177 54.6016 226.812 54.6016ZM232.758 55.625H231.375V47.1719H232.758V55.625ZM232.867 44.9297C232.867 45.1641 232.802 45.3594 232.672 45.5156C232.542 45.6719 232.344 45.75 232.078 45.75C231.818 45.75 231.622 45.6719 231.492 45.5156C231.362 45.3594 231.297 45.1641 231.297 44.9297C231.297 44.6953 231.362 44.4974 231.492 44.3359C231.622 44.1745 231.818 44.0938 232.078 44.0938C232.339 44.0938 232.534 44.1771 232.664 44.3438C232.799 44.5052 232.867 44.7005 232.867 44.9297ZM234.648 51.0078C234.648 49.7786 234.945 48.8073 235.539 48.0938C236.138 47.375 236.927 47.0156 237.906 47.0156C238.885 47.0156 239.672 47.3646 240.266 48.0625C240.865 48.7604 241.172 49.7109 241.188 50.9141V51.8047C241.188 53.0286 240.891 53.9974 240.297 54.7109C239.703 55.4245 238.911 55.7812 237.922 55.7812C236.943 55.7812 236.156 55.4349 235.562 54.7422C234.974 54.0495 234.669 53.112 234.648 51.9297V51.0078ZM236.031 51.8047C236.031 52.6745 236.201 53.3594 236.539 53.8594C236.883 54.3542 237.344 54.6016 237.922 54.6016C239.141 54.6016 239.768 53.7214 239.805 51.9609V51.0078C239.805 50.1432 239.633 49.4609 239.289 48.9609C238.945 48.4557 238.484 48.2031 237.906 48.2031C237.339 48.2031 236.883 48.4557 236.539 48.9609C236.201 49.4609 236.031 50.1406 236.031 51V51.8047ZM247.078 53.4609C247.078 53.1641 246.966 52.9089 246.742 52.6953C246.518 52.4818 246.086 52.2318 245.445 51.9453C244.701 51.638 244.174 51.375 243.867 51.1562C243.565 50.9375 243.339 50.6901 243.188 50.4141C243.036 50.1328 242.961 49.7995 242.961 49.4141C242.961 48.7266 243.211 48.1562 243.711 47.7031C244.216 47.2448 244.859 47.0156 245.641 47.0156C246.464 47.0156 247.125 47.2552 247.625 47.7344C248.125 48.2135 248.375 48.8281 248.375 49.5781H247C247 49.1979 246.872 48.875 246.617 48.6094C246.362 48.3385 246.036 48.2031 245.641 48.2031C245.234 48.2031 244.914 48.3099 244.68 48.5234C244.451 48.7318 244.336 49.013 244.336 49.3672C244.336 49.6484 244.419 49.875 244.586 50.0469C244.758 50.2188 245.167 50.4453 245.812 50.7266C246.839 51.1276 247.536 51.5208 247.906 51.9062C248.276 52.2865 248.461 52.7708 248.461 53.3594C248.461 54.0938 248.208 54.6823 247.703 55.125C247.198 55.5625 246.521 55.7812 245.672 55.7812C244.792 55.7812 244.078 55.5286 243.531 55.0234C242.984 54.5182 242.711 53.8776 242.711 53.1016H244.102C244.117 53.5703 244.26 53.9375 244.531 54.2031C244.802 54.4688 245.182 54.6016 245.672 54.6016C246.13 54.6016 246.479 54.5 246.719 54.2969C246.958 54.0885 247.078 53.8099 247.078 53.4609Z" fill="#333333"/>
<path d="M283.562 13.3906C283.5 14.6094 283.156 15.5417 282.531 16.1875C281.911 16.8333 281.034 17.1562 279.898 17.1562C278.758 17.1562 277.852 16.724 277.18 15.8594C276.508 14.9896 276.172 13.8125 276.172 12.3281V10.2656C276.172 8.78646 276.516 7.61719 277.203 6.75781C277.896 5.89844 278.839 5.46875 280.031 5.46875C281.13 5.46875 281.979 5.79948 282.578 6.46094C283.182 7.11719 283.51 8.05729 283.562 9.28125H282.117C282.055 8.35417 281.859 7.69271 281.531 7.29688C281.203 6.90104 280.703 6.70312 280.031 6.70312C279.255 6.70312 278.659 7.00781 278.242 7.61719C277.826 8.22135 277.617 9.10938 277.617 10.2812V12.3672C277.617 13.5182 277.81 14.401 278.195 15.0156C278.586 15.6302 279.154 15.9375 279.898 15.9375C280.643 15.9375 281.18 15.7526 281.508 15.3828C281.836 15.013 282.039 14.349 282.117 13.3906H283.562ZM289.664 17C289.581 16.8177 289.521 16.5104 289.484 16.0781C288.995 16.7969 288.37 17.1562 287.609 17.1562C286.844 17.1562 286.245 16.9427 285.812 16.5156C285.385 16.0833 285.172 15.4766 285.172 14.6953C285.172 13.8359 285.464 13.1536 286.047 12.6484C286.63 12.1432 287.43 11.8854 288.445 11.875H289.461V10.9766C289.461 10.4714 289.349 10.112 289.125 9.89844C288.901 9.6849 288.56 9.57812 288.102 9.57812C287.685 9.57812 287.346 9.70312 287.086 9.95312C286.826 10.1979 286.695 10.5104 286.695 10.8906H285.312C285.312 10.4583 285.44 10.0469 285.695 9.65625C285.951 9.26042 286.294 8.95052 286.727 8.72656C287.159 8.5026 287.641 8.39062 288.172 8.39062C289.036 8.39062 289.693 8.60677 290.141 9.03906C290.594 9.46615 290.826 10.0911 290.836 10.9141V15.1797C290.841 15.8307 290.93 16.3958 291.102 16.875V17H289.664ZM287.82 15.8984C288.159 15.8984 288.482 15.8047 288.789 15.6172C289.096 15.4297 289.32 15.1953 289.461 14.9141V12.8984H288.68C288.023 12.9089 287.505 13.0573 287.125 13.3438C286.745 13.625 286.555 14.0208 286.555 14.5312C286.555 15.0104 286.651 15.3594 286.844 15.5781C287.036 15.7917 287.362 15.8984 287.82 15.8984ZM294.797 6.5V8.54688H296.07V9.66406H294.797V14.9062C294.797 15.2396 294.852 15.4922 294.961 15.6641C295.07 15.8359 295.258 15.9219 295.523 15.9219C295.706 15.9219 295.891 15.8906 296.078 15.8281L296.062 17C295.75 17.1042 295.43 17.1562 295.102 17.1562C294.555 17.1562 294.138 16.9609 293.852 16.5703C293.565 16.1797 293.422 15.6276 293.422 14.9141V9.66406H292.133V8.54688H293.422V6.5H294.797ZM300.742 17.1562C299.69 17.1562 298.883 16.8438 298.32 16.2188C297.758 15.5885 297.471 14.6667 297.461 13.4531V12.4297C297.461 11.1693 297.734 10.1823 298.281 9.46875C298.833 8.75 299.602 8.39062 300.586 8.39062C301.576 8.39062 302.315 8.70573 302.805 9.33594C303.294 9.96615 303.544 10.9479 303.555 12.2812V13.1875H298.836V13.3828C298.836 14.2891 299.005 14.9479 299.344 15.3594C299.688 15.7708 300.18 15.9766 300.82 15.9766C301.227 15.9766 301.583 15.901 301.891 15.75C302.203 15.5938 302.495 15.349 302.766 15.0156L303.484 15.8906C302.885 16.7344 301.971 17.1562 300.742 17.1562ZM300.586 9.57812C300.013 9.57812 299.589 9.77604 299.312 10.1719C299.036 10.5625 298.88 11.1719 298.844 12H302.172V11.8125C302.135 11.0104 301.99 10.4375 301.734 10.0938C301.484 9.75 301.102 9.57812 300.586 9.57812ZM304.945 12.3906C304.945 11.0729 305.185 10.0781 305.664 9.40625C306.143 8.72917 306.844 8.39062 307.766 8.39062C308.625 8.39062 309.279 8.75781 309.727 9.49219L309.797 8.54688H311.047V17.0781C311.047 18.125 310.779 18.9271 310.242 19.4844C309.706 20.0469 308.958 20.3281 308 20.3281C307.583 20.3281 307.115 20.224 306.594 20.0156C306.078 19.8125 305.69 19.5599 305.43 19.2578L305.992 18.3047C306.565 18.8672 307.198 19.1484 307.891 19.1484C309.042 19.1484 309.633 18.5208 309.664 17.2656V16.1641C309.216 16.8255 308.581 17.1562 307.758 17.1562C306.883 17.1562 306.201 16.8281 305.711 16.1719C305.221 15.5104 304.966 14.5625 304.945 13.3281V12.3906ZM306.328 13.1797C306.328 14.1276 306.466 14.8255 306.742 15.2734C307.023 15.7161 307.482 15.9375 308.117 15.9375C308.805 15.9375 309.32 15.5859 309.664 14.8828V10.6562C309.305 9.96354 308.794 9.61719 308.133 9.61719C307.497 9.61719 307.039 9.84115 306.758 10.2891C306.477 10.7318 306.333 11.4141 306.328 12.3359V13.1797ZM312.82 12.3828C312.82 11.1536 313.117 10.1823 313.711 9.46875C314.31 8.75 315.099 8.39062 316.078 8.39062C317.057 8.39062 317.844 8.73958 318.438 9.4375C319.036 10.1354 319.344 11.0859 319.359 12.2891V13.1797C319.359 14.4036 319.062 15.3724 318.469 16.0859C317.875 16.7995 317.083 17.1562 316.094 17.1562C315.115 17.1562 314.328 16.8099 313.734 16.1172C313.146 15.4245 312.841 14.487 312.82 13.3047V12.3828ZM314.203 13.1797C314.203 14.0495 314.372 14.7344 314.711 15.2344C315.055 15.7292 315.516 15.9766 316.094 15.9766C317.312 15.9766 317.94 15.0964 317.977 13.3359V12.3828C317.977 11.5182 317.805 10.8359 317.461 10.3359C317.117 9.83073 316.656 9.57812 316.078 9.57812C315.51 9.57812 315.055 9.83073 314.711 10.3359C314.372 10.8359 314.203 11.5156 314.203 12.375V13.1797ZM324.633 9.84375C324.44 9.80729 324.232 9.78906 324.008 9.78906C323.299 9.78906 322.805 10.1771 322.523 10.9531V17H321.141V8.54688H322.484L322.508 9.40625C322.878 8.72917 323.401 8.39062 324.078 8.39062C324.297 8.39062 324.479 8.42708 324.625 8.5L324.633 9.84375ZM327.508 17H326.125V8.54688H327.508V17ZM327.562 5.00781H329.312L327.219 7.30469H326.055L327.562 5.00781ZM334.133 17C334.049 16.8177 333.99 16.5104 333.953 16.0781C333.464 16.7969 332.839 17.1562 332.078 17.1562C331.312 17.1562 330.714 16.9427 330.281 16.5156C329.854 16.0833 329.641 15.4766 329.641 14.6953C329.641 13.8359 329.932 13.1536 330.516 12.6484C331.099 12.1432 331.898 11.8854 332.914 11.875H333.93V10.9766C333.93 10.4714 333.818 10.112 333.594 9.89844C333.37 9.6849 333.029 9.57812 332.57 9.57812C332.154 9.57812 331.815 9.70312 331.555 9.95312C331.294 10.1979 331.164 10.5104 331.164 10.8906H329.781C329.781 10.4583 329.909 10.0469 330.164 9.65625C330.419 9.26042 330.763 8.95052 331.195 8.72656C331.628 8.5026 332.109 8.39062 332.641 8.39062C333.505 8.39062 334.161 8.60677 334.609 9.03906C335.062 9.46615 335.294 10.0911 335.305 10.9141V15.1797C335.31 15.8307 335.398 16.3958 335.57 16.875V17H334.133ZM332.289 15.8984C332.628 15.8984 332.951 15.8047 333.258 15.6172C333.565 15.4297 333.789 15.1953 333.93 14.9141V12.8984H333.148C332.492 12.9089 331.974 13.0573 331.594 13.3438C331.214 13.625 331.023 14.0208 331.023 14.5312C331.023 15.0104 331.12 15.3594 331.312 15.5781C331.505 15.7917 331.831 15.8984 332.289 15.8984ZM341.562 14.8359C341.562 14.5391 341.451 14.2839 341.227 14.0703C341.003 13.8568 340.57 13.6068 339.93 13.3203C339.185 13.013 338.659 12.75 338.352 12.5312C338.049 12.3125 337.823 12.0651 337.672 11.7891C337.521 11.5078 337.445 11.1745 337.445 10.7891C337.445 10.1016 337.695 9.53125 338.195 9.07812C338.701 8.61979 339.344 8.39062 340.125 8.39062C340.948 8.39062 341.609 8.63021 342.109 9.10938C342.609 9.58854 342.859 10.2031 342.859 10.9531H341.484C341.484 10.5729 341.357 10.25 341.102 9.98438C340.846 9.71354 340.521 9.57812 340.125 9.57812C339.719 9.57812 339.398 9.6849 339.164 9.89844C338.935 10.1068 338.82 10.388 338.82 10.7422C338.82 11.0234 338.904 11.25 339.07 11.4219C339.242 11.5938 339.651 11.8203 340.297 12.1016C341.323 12.5026 342.021 12.8958 342.391 13.2812C342.76 13.6615 342.945 14.1458 342.945 14.7344C342.945 15.4688 342.693 16.0573 342.188 16.5C341.682 16.9375 341.005 17.1562 340.156 17.1562C339.276 17.1562 338.562 16.9036 338.016 16.3984C337.469 15.8932 337.195 15.2526 337.195 14.4766H338.586C338.602 14.9453 338.745 15.3125 339.016 15.5781C339.286 15.8438 339.667 15.9766 340.156 15.9766C340.615 15.9766 340.964 15.875 341.203 15.6719C341.443 15.4635 341.562 15.1849 341.562 14.8359ZM348.133 12.3906C348.133 11.0885 348.375 10.0964 348.859 9.41406C349.349 8.73177 350.049 8.39062 350.961 8.39062C351.768 8.39062 352.398 8.71875 352.852 9.375V5H354.234V17H352.969L352.898 16.0938C352.445 16.8021 351.797 17.1562 350.953 17.1562C350.078 17.1562 349.391 16.8177 348.891 16.1406C348.396 15.4583 348.143 14.4974 348.133 13.2578V12.3906ZM349.516 13.1797C349.516 14.1276 349.656 14.8255 349.938 15.2734C350.219 15.7161 350.677 15.9375 351.312 15.9375C352 15.9375 352.513 15.5911 352.852 14.8984V10.6328C352.497 9.95573 351.987 9.61719 351.32 9.61719C350.685 9.61719 350.227 9.84115 349.945 10.2891C349.664 10.7318 349.521 11.4141 349.516 12.3359V13.1797ZM359.383 17.1562C358.331 17.1562 357.523 16.8438 356.961 16.2188C356.398 15.5885 356.112 14.6667 356.102 13.4531V12.4297C356.102 11.1693 356.375 10.1823 356.922 9.46875C357.474 8.75 358.242 8.39062 359.227 8.39062C360.216 8.39062 360.956 8.70573 361.445 9.33594C361.935 9.96615 362.185 10.9479 362.195 12.2812V13.1875H357.477V13.3828C357.477 14.2891 357.646 14.9479 357.984 15.3594C358.328 15.7708 358.82 15.9766 359.461 15.9766C359.867 15.9766 360.224 15.901 360.531 15.75C360.844 15.5938 361.135 15.349 361.406 15.0156L362.125 15.8906C361.526 16.7344 360.612 17.1562 359.383 17.1562ZM359.227 9.57812C358.654 9.57812 358.229 9.77604 357.953 10.1719C357.677 10.5625 357.521 11.1719 357.484 12H360.812V11.8125C360.776 11.0104 360.63 10.4375 360.375 10.0938C360.125 9.75 359.742 9.57812 359.227 9.57812ZM372.695 14.125C372.695 13.5573 372.542 13.1224 372.234 12.8203C371.927 12.5182 371.372 12.224 370.57 11.9375C369.768 11.651 369.154 11.3516 368.727 11.0391C368.305 10.7214 367.987 10.362 367.773 9.96094C367.565 9.55469 367.461 9.09115 367.461 8.57031C367.461 7.66927 367.76 6.92708 368.359 6.34375C368.964 5.76042 369.753 5.46875 370.727 5.46875C371.393 5.46875 371.987 5.61979 372.508 5.92188C373.029 6.21875 373.43 6.63281 373.711 7.16406C373.992 7.69531 374.133 8.27865 374.133 8.91406H372.695C372.695 8.21094 372.526 7.66667 372.188 7.28125C371.849 6.89583 371.362 6.70312 370.727 6.70312C370.148 6.70312 369.701 6.86458 369.383 7.1875C369.065 7.51042 368.906 7.96354 368.906 8.54688C368.906 9.02604 369.078 9.42708 369.422 9.75C369.766 10.0729 370.297 10.362 371.016 10.6172C372.135 10.987 372.935 11.4427 373.414 11.9844C373.898 12.526 374.141 13.2344 374.141 14.1094C374.141 15.0312 373.841 15.7708 373.242 16.3281C372.643 16.8802 371.828 17.1562 370.797 17.1562C370.135 17.1562 369.523 17.013 368.961 16.7266C368.404 16.4349 367.964 16.0286 367.641 15.5078C367.323 14.9818 367.164 14.3802 367.164 13.7031H368.602C368.602 14.4062 368.797 14.9531 369.188 15.3438C369.583 15.7344 370.12 15.9297 370.797 15.9297C371.427 15.9297 371.901 15.7682 372.219 15.4453C372.536 15.1224 372.695 14.6823 372.695 14.125ZM378.852 17.1562C377.799 17.1562 376.992 16.8438 376.43 16.2188C375.867 15.5885 375.581 14.6667 375.57 13.4531V12.4297C375.57 11.1693 375.844 10.1823 376.391 9.46875C376.943 8.75 377.711 8.39062 378.695 8.39062C379.685 8.39062 380.424 8.70573 380.914 9.33594C381.404 9.96615 381.654 10.9479 381.664 12.2812V13.1875H376.945V13.3828C376.945 14.2891 377.115 14.9479 377.453 15.3594C377.797 15.7708 378.289 15.9766 378.93 15.9766C379.336 15.9766 379.693 15.901 380 15.75C380.312 15.5938 380.604 15.349 380.875 15.0156L381.594 15.8906C380.995 16.7344 380.081 17.1562 378.852 17.1562ZM378.695 9.57812C378.122 9.57812 377.698 9.77604 377.422 10.1719C377.146 10.5625 376.99 11.1719 376.953 12H380.281V11.8125C380.245 11.0104 380.099 10.4375 379.844 10.0938C379.594 9.75 379.211 9.57812 378.695 9.57812ZM386.82 9.84375C386.628 9.80729 386.419 9.78906 386.195 9.78906C385.487 9.78906 384.992 10.1771 384.711 10.9531V17H383.328V8.54688H384.672L384.695 9.40625C385.065 8.72917 385.589 8.39062 386.266 8.39062C386.484 8.39062 386.667 8.42708 386.812 8.5L386.82 9.84375ZM390.742 14.8984L392.344 8.54688H393.75L391.242 17H390.211L387.672 8.54688H389.078L390.742 14.8984ZM396.68 17H395.297V8.54688H396.68V17ZM396.789 6.30469C396.789 6.53906 396.724 6.73438 396.594 6.89062C396.464 7.04688 396.266 7.125 396 7.125C395.74 7.125 395.544 7.04688 395.414 6.89062C395.284 6.73438 395.219 6.53906 395.219 6.30469C395.219 6.07031 395.284 5.8724 395.414 5.71094C395.544 5.54948 395.74 5.46875 396 5.46875C396.26 5.46875 396.456 5.55208 396.586 5.71875C396.721 5.88021 396.789 6.07552 396.789 6.30469ZM401.797 15.9766C402.255 15.9766 402.622 15.8359 402.898 15.5547C403.174 15.2682 403.326 14.862 403.352 14.3359H404.656C404.625 15.1484 404.336 15.8229 403.789 16.3594C403.247 16.8906 402.583 17.1562 401.797 17.1562C400.75 17.1562 399.951 16.8281 399.398 16.1719C398.852 15.5104 398.578 14.5286 398.578 13.2266V12.2969C398.578 11.0208 398.852 10.0521 399.398 9.39062C399.945 8.72396 400.742 8.39062 401.789 8.39062C402.654 8.39062 403.339 8.66406 403.844 9.21094C404.354 9.75781 404.625 10.5052 404.656 11.4531H403.352C403.32 10.8281 403.169 10.3594 402.898 10.0469C402.633 9.73438 402.263 9.57812 401.789 9.57812C401.174 9.57812 400.719 9.78125 400.422 10.1875C400.125 10.5885 399.971 11.25 399.961 12.1719V13.25C399.961 14.2448 400.107 14.9479 400.398 15.3594C400.695 15.7708 401.161 15.9766 401.797 15.9766ZM407.742 17H406.359V8.54688H407.742V17ZM407.852 6.30469C407.852 6.53906 407.786 6.73438 407.656 6.89062C407.526 7.04688 407.328 7.125 407.062 7.125C406.802 7.125 406.607 7.04688 406.477 6.89062C406.346 6.73438 406.281 6.53906 406.281 6.30469C406.281 6.07031 406.346 5.8724 406.477 5.71094C406.607 5.54948 406.802 5.46875 407.062 5.46875C407.323 5.46875 407.518 5.55208 407.648 5.71875C407.784 5.88021 407.852 6.07552 407.852 6.30469ZM409.633 12.3828C409.633 11.1536 409.93 10.1823 410.523 9.46875C411.122 8.75 411.911 8.39062 412.891 8.39062C413.87 8.39062 414.656 8.73958 415.25 9.4375C415.849 10.1354 416.156 11.0859 416.172 12.2891V13.1797C416.172 14.4036 415.875 15.3724 415.281 16.0859C414.688 16.7995 413.896 17.1562 412.906 17.1562C411.927 17.1562 411.141 16.8099 410.547 16.1172C409.958 15.4245 409.654 14.487 409.633 13.3047V12.3828ZM411.016 13.1797C411.016 14.0495 411.185 14.7344 411.523 15.2344C411.867 15.7292 412.328 15.9766 412.906 15.9766C414.125 15.9766 414.753 15.0964 414.789 13.3359V12.3828C414.789 11.5182 414.617 10.8359 414.273 10.3359C413.93 9.83073 413.469 9.57812 412.891 9.57812C412.323 9.57812 411.867 9.83073 411.523 10.3359C411.185 10.8359 411.016 11.5156 411.016 12.375V13.1797ZM422.062 14.8359C422.062 14.5391 421.951 14.2839 421.727 14.0703C421.503 13.8568 421.07 13.6068 420.43 13.3203C419.685 13.013 419.159 12.75 418.852 12.5312C418.549 12.3125 418.323 12.0651 418.172 11.7891C418.021 11.5078 417.945 11.1745 417.945 10.7891C417.945 10.1016 418.195 9.53125 418.695 9.07812C419.201 8.61979 419.844 8.39062 420.625 8.39062C421.448 8.39062 422.109 8.63021 422.609 9.10938C423.109 9.58854 423.359 10.2031 423.359 10.9531H421.984C421.984 10.5729 421.857 10.25 421.602 9.98438C421.346 9.71354 421.021 9.57812 420.625 9.57812C420.219 9.57812 419.898 9.6849 419.664 9.89844C419.435 10.1068 419.32 10.388 419.32 10.7422C419.32 11.0234 419.404 11.25 419.57 11.4219C419.742 11.5938 420.151 11.8203 420.797 12.1016C421.823 12.5026 422.521 12.8958 422.891 13.2812C423.26 13.6615 423.445 14.1458 423.445 14.7344C423.445 15.4688 423.193 16.0573 422.688 16.5C422.182 16.9375 421.505 17.1562 420.656 17.1562C419.776 17.1562 419.062 16.9036 418.516 16.3984C417.969 15.8932 417.695 15.2526 417.695 14.4766H419.086C419.102 14.9453 419.245 15.3125 419.516 15.5781C419.786 15.8438 420.167 15.9766 420.656 15.9766C421.115 15.9766 421.464 15.875 421.703 15.6719C421.943 15.4635 422.062 15.1849 422.062 14.8359Z" fill="#333333"/>
</svg>
