<svg width="185" height="111" viewBox="0 0 185 111" fill="none" xmlns="http://www.w3.org/2000/svg">
<path d="M15.3798 84.774L14.4658 81.2109C12.8453 80.532 11.1873 79.944 9.49978 79.4497L9.38438 81.1057L8.91646 79.2813C6.82364 78.6906 5.3999 78.4304 5.3999 78.4304C5.3999 78.4304 7.32305 85.6592 11.3567 91.1858L16.0568 92.0018L12.4054 92.5222C12.913 93.1258 13.4585 93.6973 14.0387 94.2332C19.9066 99.617 26.4422 102.087 28.6366 99.7503C30.8309 97.4136 27.8529 91.1548 21.9851 85.771C20.166 84.102 17.8808 82.7626 15.5934 81.7085L15.3798 84.774Z" fill="#AEEA00"/>
<path d="M24.0741 80.8948L25.1406 77.3687C24.1222 75.956 23.0252 74.6021 21.8549 73.3134L20.9031 74.6755L21.4491 72.8701C19.9863 71.2911 18.9181 70.3385 18.9181 70.3385C18.9181 70.3385 16.8128 77.5276 17.3682 84.3368L20.9169 87.4447L17.5645 86.021C17.6818 86.799 17.8477 87.5689 18.0612 88.326C20.2395 95.9522 24.485 101.42 27.544 100.539C30.6029 99.6571 31.3168 92.7603 29.1386 85.134C28.4633 82.7698 27.2243 80.4497 25.8362 78.3733L24.0741 80.8948Z" fill="#D6F480"/>
<path d="M185 101.182H0V101.647H185V101.182Z" fill="#3F3D56"/>
<path d="M29.2289 53.0369C29.2289 53.0369 27.7882 70.2892 27.4789 73.9861C27.2667 76.3035 26.7467 78.5826 25.9322 80.7636C25.9322 80.7636 25.3136 81.9959 25.3136 83.2282V98.9399C25.3136 98.9399 24.0763 98.9399 24.3856 100.172C24.6949 101.404 25.0042 103.561 25.0042 103.561H29.6441C29.6441 103.561 29.3348 102.637 30.2628 102.329C31.1908 102.021 30.2628 99.556 30.2628 99.556L35.212 81.0717L42.6359 65.6681C42.6359 65.6681 46.9664 79.5314 47.8944 81.0717C47.8944 81.0717 51.297 98.3237 51.9157 99.8641C52.5343 101.404 52.8437 101.404 52.5343 102.021C52.225 102.637 52.225 103.253 52.5343 103.561C52.8437 103.869 58.7209 103.561 58.7209 103.561L57.1742 81.6878L54.3903 55.5017L40.1613 51.1887L29.2289 53.0369Z" fill="#333333"/>
<path d="M28.4068 101.096C28.4068 101.096 26.8602 95.5509 24.3856 99.8639C21.9109 104.177 21.911 105.717 21.911 105.717C21.911 105.717 17.8897 111.571 23.4576 110.955C29.0255 110.338 27.7882 107.566 27.7882 107.566C27.7882 107.566 29.9534 106.333 29.9534 105.409C29.9534 104.485 28.4068 101.096 28.4068 101.096Z" fill="#333333"/>
<path d="M53.4622 100.48C53.4622 100.48 55.0088 94.935 57.4834 99.248C59.958 103.561 59.958 105.101 59.958 105.101C59.958 105.101 63.9793 110.955 58.4114 110.339C52.8435 109.722 54.0808 106.95 54.0808 106.95C54.0808 106.95 51.9155 105.718 51.9155 104.793C51.9155 103.869 53.4622 100.48 53.4622 100.48Z" fill="#333333"/>
<path d="M38.924 11.4474C38.924 11.4474 39.5426 15.4523 37.6867 16.3765C35.8307 17.3008 41.7079 20.6896 43.2546 20.6896C44.8012 20.6896 47.5851 17.6088 47.5851 17.6088C47.5851 17.6088 46.0385 12.9878 46.3478 12.0635L38.924 11.4474Z" fill="#A0616A"/>
<path d="M42.3264 14.5281C45.914 14.5281 48.8223 11.6316 48.8223 8.05862C48.8223 4.48561 45.914 1.58911 42.3264 1.58911C38.7389 1.58911 35.8306 4.48561 35.8306 8.05862C35.8306 11.6316 38.7389 14.5281 42.3264 14.5281Z" fill="#A0616A"/>
<path d="M55.009 21.3056L47.276 16.6395C47.276 16.6395 42.8762 21.6137 38.1161 16.0684L29.9535 18.2249L31.1908 39.1737C31.1908 39.1737 29.3348 47.4917 29.9535 49.0321C30.5721 50.5724 28.4068 51.1886 29.0255 51.4966C29.6441 51.8047 29.0255 53.9612 29.0255 53.9612C29.0255 53.9612 41.0892 60.1226 54.3903 55.5016L53.153 51.4966C53.3214 50.9731 53.353 50.4154 53.2447 49.8764C53.1364 49.3373 52.892 48.8347 52.5343 48.4159C52.5343 48.4159 53.7716 46.5675 52.225 45.0271C52.225 45.0271 52.8437 42.2545 51.297 41.0222L50.9877 36.7092L51.9157 34.5527L55.009 21.3056Z" fill="#CFCCE0"/>
<path d="M39.0021 5.05447C39.0021 5.05447 38.2277 6.72364 41.3254 6.05597C41.3254 6.05597 42.4871 6.72365 42.4871 5.72214C42.4871 5.72214 44.036 7.39132 44.4232 6.38981C44.8104 5.3883 45.5849 6.72364 45.5849 6.72364L46.3593 5.05447L47.1337 6.05597H49.8442C49.8442 6.05597 50.6187 -0.620738 41.3254 0.046934C32.0322 0.714606 36.604 11.2932 36.604 11.2932C36.604 11.2932 36.6788 9.39433 37.4532 10.3958C38.2277 11.3973 39.0021 5.05447 39.0021 5.05447Z" fill="#2F2E41"/>
<path d="M57.7928 33.6285L58.1021 40.0981C58.1021 40.0981 59.3394 52.1129 56.8648 57.3501V60.1227C56.8648 60.1227 56.2462 67.2084 53.1529 66.9003C50.0597 66.5922 54.0809 56.7339 54.0809 56.7339L53.4622 43.1788L52.8436 35.477L57.7928 33.6285Z" fill="#A0616A"/>
<path d="M51.6062 21.6138L54.6919 21.1145C56.9147 23.2415 58.4288 25.9965 59.0301 29.0075C59.958 33.9367 60.2674 34.8609 60.2674 34.8609L52.8435 36.7093L48.8223 29.0075L51.6062 21.6138Z" fill="#CFCCE0"/>
<path d="M87.135 18.0979H38.3203V42.2484H87.135V18.0979Z" fill="white"/>
<path d="M43.6502 19.5501C42.3961 18.799 40.8839 18.8564 40.3091 18.9137C40.528 19.4461 41.1849 20.8038 42.439 21.5553C43.6961 22.3083 45.2063 22.2492 45.7803 22.1922C45.5614 21.6601 44.9045 20.3018 43.6502 19.5501Z" fill="#7319D5"/>
<path d="M49.5437 34.4546H41.7055C41.4737 34.4543 41.2442 34.4996 41.03 34.5877C40.8158 34.6759 40.6211 34.8052 40.4572 34.9684C40.2932 35.1315 40.1631 35.3252 40.0744 35.5384C39.9856 35.7517 39.9399 35.9802 39.9399 36.211C39.9399 36.4419 39.9856 36.6704 40.0744 36.8836C40.1631 37.0969 40.2932 37.2906 40.4572 37.4537C40.6211 37.6168 40.8158 37.7462 41.03 37.8343C41.2442 37.9225 41.4737 37.9677 41.7055 37.9675H49.5437C49.7755 37.9677 50.005 37.9225 50.2192 37.8343C50.4334 37.7462 50.628 37.6168 50.792 37.4537C50.956 37.2906 51.086 37.0969 51.1748 36.8836C51.2635 36.6704 51.3092 36.4419 51.3092 36.211C51.3092 35.9802 51.2635 35.7517 51.1748 35.5384C51.086 35.3252 50.956 35.1315 50.792 34.9684C50.628 34.8052 50.4334 34.6759 50.2192 34.5877C50.005 34.4996 49.7755 34.4543 49.5437 34.4546Z" fill="#7319D5"/>
<path d="M85.0377 15.9143H41.0911C40.5799 15.9143 40.0737 16.0146 39.6014 16.2094C39.1291 16.4043 38.6999 16.6899 38.3384 17.0499C37.9769 17.4099 37.6902 17.8373 37.4946 18.3077C37.2989 18.7781 37.1982 19.2823 37.1982 19.7914V41.1162C37.1982 42.1445 37.6084 43.1306 38.3384 43.8577C39.0685 44.5848 40.0587 44.9933 41.0911 44.9933H85.0377C86.0702 44.9933 87.0603 44.5848 87.7904 43.8577C88.5205 43.1306 88.9306 42.1445 88.9306 41.1162V19.7914C88.9306 19.2823 88.8299 18.7781 88.6343 18.3077C88.4386 17.8373 88.1519 17.4099 87.7904 17.0499C87.4289 16.6899 86.9998 16.4043 86.5275 16.2094C86.0552 16.0146 85.5489 15.9143 85.0377 15.9143ZM40.0038 18.5591C40.0906 18.5435 42.1484 18.1947 43.8524 19.2158C45.5563 20.2368 46.211 22.2111 46.2379 22.2946L46.3068 22.5075L46.0857 22.5465C45.7703 22.5956 45.4513 22.6189 45.1321 22.6163C44.1192 22.6356 43.1197 22.3847 42.237 21.8896C40.5331 20.8688 39.8786 18.8945 39.8516 18.811L39.7827 18.5981L40.0038 18.5591ZM49.5435 38.3578H41.7052C41.1335 38.3578 40.5853 38.1316 40.181 37.729C39.7768 37.3264 39.5497 36.7804 39.5497 36.211C39.5497 35.6417 39.7768 35.0956 40.181 34.6931C40.5853 34.2905 41.1335 34.0643 41.7052 34.0643H49.5435C50.1151 34.0643 50.6634 34.2905 51.0676 34.6931C51.4719 35.0956 51.699 35.6417 51.699 36.211C51.699 36.7804 51.4719 37.3264 51.0676 37.729C50.6634 38.1316 50.1151 38.3578 49.5435 38.3578ZM85.2074 37.9675C85.2056 38.5881 84.9573 39.1827 84.5167 39.6215C84.0761 40.0603 83.4791 40.3076 82.856 40.3094H76.9773C76.3542 40.3076 75.7572 40.0603 75.3166 39.6215C74.876 39.1827 74.6276 38.5881 74.6258 37.9675V34.4546C74.6276 33.834 74.876 33.2394 75.3166 32.8006C75.7572 32.3618 76.3542 32.1145 76.9773 32.1127H82.856C83.4791 32.1145 84.0761 32.3618 84.5167 32.8006C84.9573 33.2394 85.2056 33.834 85.2074 34.4546V37.9675Z" fill="#7319D5"/>
<path d="M78.8392 37.2845H76.2918C76.1099 37.2845 75.9355 37.3565 75.8068 37.4846C75.6782 37.6127 75.606 37.7864 75.606 37.9676C75.606 38.1488 75.6782 38.3225 75.8068 38.4506C75.9355 38.5787 76.1099 38.6507 76.2918 38.6507H78.8392C79.0211 38.6507 79.1956 38.5787 79.3242 38.4506C79.4528 38.3225 79.5251 38.1488 79.5251 37.9676C79.5251 37.7864 79.4528 37.6127 79.3242 37.4846C79.1956 37.3565 79.0211 37.2845 78.8392 37.2845ZM78.8392 38.2604H76.2918C76.2531 38.2605 76.2148 38.253 76.1791 38.2383C76.1433 38.2236 76.1108 38.2021 76.0835 38.1749C76.0561 38.1477 76.0344 38.1154 76.0195 38.0798C76.0047 38.0443 75.9971 38.0061 75.9971 37.9676C75.9971 37.9291 76.0047 37.891 76.0195 37.8554C76.0344 37.8198 76.0561 37.7875 76.0835 37.7603C76.1108 37.7331 76.1433 37.7116 76.1791 37.6969C76.2148 37.6823 76.2531 37.6748 76.2918 37.6749H78.8392C78.917 37.6751 78.9916 37.706 79.0466 37.7609C79.1015 37.8158 79.1324 37.8901 79.1324 37.9676C79.1324 38.0451 79.1015 38.1195 79.0466 38.1743C78.9916 38.2292 78.917 38.2601 78.8392 38.2604Z" fill="#7319D5"/>
<path d="M83.5419 37.2845H80.9944C80.8125 37.2845 80.6381 37.3565 80.5095 37.4846C80.3809 37.6127 80.3086 37.7864 80.3086 37.9676C80.3086 38.1488 80.3809 38.3225 80.5095 38.4506C80.6381 38.5787 80.8125 38.6507 80.9944 38.6507H83.5419C83.7238 38.6507 83.8982 38.5787 84.0268 38.4506C84.1554 38.3225 84.2277 38.1488 84.2277 37.9676C84.2277 37.7864 84.1554 37.6127 84.0268 37.4846C83.8982 37.3565 83.7238 37.2845 83.5419 37.2845ZM83.5419 38.2604H80.9944C80.9558 38.2605 80.9175 38.253 80.8817 38.2383C80.846 38.2236 80.8135 38.2021 80.7861 38.1749C80.7587 38.1477 80.737 38.1154 80.7222 38.0798C80.7073 38.0443 80.6997 38.0061 80.6997 37.9676C80.6997 37.9291 80.7073 37.891 80.7222 37.8554C80.737 37.8198 80.7587 37.7875 80.7861 37.7603C80.8135 37.7331 80.846 37.7116 80.8817 37.6969C80.9175 37.6823 80.9558 37.6748 80.9944 37.6749H83.5419C83.6197 37.6751 83.6943 37.706 83.7492 37.7609C83.8042 37.8158 83.835 37.8901 83.835 37.9676C83.835 38.0451 83.8042 38.1195 83.7492 38.1743C83.6943 38.2292 83.6197 38.2601 83.5419 38.2604Z" fill="#7319D5"/>
<path d="M78.8392 35.5281H76.2918C76.1099 35.5281 75.9355 35.6 75.8068 35.7281C75.6782 35.8562 75.606 36.03 75.606 36.2111C75.606 36.3923 75.6782 36.566 75.8068 36.6941C75.9355 36.8222 76.1099 36.8942 76.2918 36.8942H78.8392C79.0211 36.8942 79.1956 36.8222 79.3242 36.6941C79.4528 36.566 79.5251 36.3923 79.5251 36.2111C79.5251 36.03 79.4528 35.8562 79.3242 35.7281C79.1956 35.6 79.0211 35.5281 78.8392 35.5281ZM78.8392 36.5039H76.2918C76.2532 36.5039 76.215 36.4963 76.1793 36.4816C76.1437 36.4669 76.1113 36.4453 76.084 36.4181C76.0567 36.391 76.035 36.3587 76.0202 36.3232C76.0055 36.2876 75.9979 36.2496 75.9979 36.2111C75.9979 36.1727 76.0055 36.1346 76.0202 36.0991C76.035 36.0636 76.0567 36.0313 76.084 36.0041C76.1113 35.977 76.1437 35.9554 76.1793 35.9407C76.215 35.926 76.2532 35.9184 76.2918 35.9184H78.8392C78.8778 35.9184 78.916 35.926 78.9517 35.9407C78.9874 35.9554 79.0198 35.977 79.0471 36.0041C79.0744 36.0313 79.096 36.0636 79.1108 36.0991C79.1256 36.1346 79.1332 36.1727 79.1332 36.2111C79.1332 36.2496 79.1256 36.2876 79.1108 36.3232C79.096 36.3587 79.0744 36.391 79.0471 36.4181C79.0198 36.4453 78.9874 36.4669 78.9517 36.4816C78.916 36.4963 78.8778 36.5039 78.8392 36.5039Z" fill="#7319D5"/>
<path d="M83.5419 35.5281H80.9944C80.8125 35.5281 80.6381 35.6 80.5095 35.7281C80.3809 35.8562 80.3086 36.03 80.3086 36.2111C80.3086 36.3923 80.3809 36.566 80.5095 36.6941C80.6381 36.8222 80.8125 36.8942 80.9944 36.8942H83.5419C83.7238 36.8942 83.8982 36.8222 84.0268 36.6941C84.1554 36.566 84.2277 36.3923 84.2277 36.2111C84.2277 36.03 84.1554 35.8562 84.0268 35.7281C83.8982 35.6 83.7238 35.5281 83.5419 35.5281ZM83.5419 36.5039H80.9944C80.9558 36.5039 80.9176 36.4963 80.882 36.4816C80.8463 36.4669 80.8139 36.4453 80.7866 36.4181C80.7593 36.391 80.7377 36.3587 80.7229 36.3232C80.7081 36.2876 80.7005 36.2496 80.7005 36.2111C80.7005 36.1727 80.7081 36.1346 80.7229 36.0991C80.7377 36.0636 80.7593 36.0313 80.7866 36.0041C80.8139 35.977 80.8463 35.9554 80.882 35.9407C80.9176 35.926 80.9558 35.9184 80.9944 35.9184H83.5419C83.5805 35.9184 83.6187 35.926 83.6543 35.9407C83.69 35.9554 83.7224 35.977 83.7497 36.0041C83.777 36.0313 83.7986 36.0636 83.8134 36.0991C83.8282 36.1346 83.8358 36.1727 83.8358 36.2111C83.8358 36.2496 83.8282 36.2876 83.8134 36.3232C83.7986 36.3587 83.777 36.391 83.7497 36.4181C83.7224 36.4453 83.69 36.4669 83.6543 36.4816C83.6187 36.4963 83.5805 36.5039 83.5419 36.5039Z" fill="#7319D5"/>
<path d="M78.8392 33.7714H76.2918C76.1099 33.7714 75.9355 33.8433 75.8068 33.9714C75.6782 34.0995 75.606 34.2733 75.606 34.4544C75.606 34.6356 75.6782 34.8093 75.8068 34.9374C75.9355 35.0655 76.1099 35.1375 76.2918 35.1375H78.8392C79.0211 35.1375 79.1956 35.0655 79.3242 34.9374C79.4528 34.8093 79.5251 34.6356 79.5251 34.4544C79.5251 34.2733 79.4528 34.0995 79.3242 33.9714C79.1956 33.8433 79.0211 33.7714 78.8392 33.7714ZM78.8392 34.7472H76.2918C76.2531 34.7473 76.2148 34.7398 76.1791 34.7251C76.1433 34.7104 76.1108 34.6889 76.0835 34.6617C76.0561 34.6345 76.0344 34.6022 76.0195 34.5666C76.0047 34.5311 75.9971 34.4929 75.9971 34.4544C75.9971 34.4159 76.0047 34.3778 76.0195 34.3422C76.0344 34.3066 76.0561 34.2743 76.0835 34.2471C76.1108 34.22 76.1433 34.1984 76.1791 34.1837C76.2148 34.1691 76.2531 34.1616 76.2918 34.1617H78.8392C78.917 34.1619 78.9916 34.1928 79.0466 34.2477C79.1015 34.3026 79.1324 34.3769 79.1324 34.4544C79.1324 34.5319 79.1015 34.6063 79.0466 34.6611C78.9916 34.716 78.917 34.747 78.8392 34.7472Z" fill="#7319D5"/>
<path d="M83.5419 33.7714H80.9944C80.8125 33.7714 80.6381 33.8433 80.5095 33.9714C80.3809 34.0995 80.3086 34.2733 80.3086 34.4544C80.3086 34.6356 80.3809 34.8093 80.5095 34.9374C80.6381 35.0655 80.8125 35.1375 80.9944 35.1375H83.5419C83.7238 35.1375 83.8982 35.0655 84.0268 34.9374C84.1554 34.8093 84.2277 34.6356 84.2277 34.4544C84.2277 34.2733 84.1554 34.0995 84.0268 33.9714C83.8982 33.8433 83.7238 33.7714 83.5419 33.7714ZM83.5419 34.7472H80.9944C80.9558 34.7473 80.9175 34.7398 80.8817 34.7251C80.846 34.7104 80.8135 34.6889 80.7861 34.6617C80.7587 34.6345 80.737 34.6022 80.7222 34.5666C80.7073 34.5311 80.6997 34.4929 80.6997 34.4544C80.6997 34.4159 80.7073 34.3778 80.7222 34.3422C80.737 34.3066 80.7587 34.2743 80.7861 34.2471C80.8135 34.22 80.846 34.1984 80.8817 34.1837C80.9175 34.1691 80.9558 34.1616 80.9944 34.1617H83.5419C83.6197 34.1619 83.6943 34.1928 83.7492 34.2477C83.8042 34.3026 83.835 34.3769 83.835 34.4544C83.835 34.5319 83.8042 34.6063 83.7492 34.6611C83.6943 34.716 83.6197 34.747 83.5419 34.7472Z" fill="#7319D5"/>
<path d="M25.3137 29.9317C25.3137 29.9317 22.5298 41.6384 25.9324 41.6384C29.335 41.6384 37.3775 28.3913 37.3775 28.3913C37.3775 28.3913 45.7293 24.0783 42.3267 22.5379C38.9241 20.9976 34.5935 25.0025 34.5935 25.0025L29.5967 31.9119L29.335 28.3913L25.3137 29.9317Z" fill="#A0616A"/>
<path d="M31.8093 20.073L29.9534 18.2246C29.9534 18.2246 26.2415 20.3811 25.9321 22.5376C25.6228 24.6941 24.0762 31.4717 24.0762 31.4717L29.7987 31.9338L31.6547 29.1612L31.8093 20.073Z" fill="#CFCCE0"/>
<path d="M134.567 22.8237C119.387 22.8237 107.067 35.0938 107.067 50.2122C107.067 65.3306 119.387 77.6006 134.567 77.6006C149.747 77.6006 162.067 65.3306 162.067 50.2122C162.067 35.0938 149.747 22.8237 134.567 22.8237ZM129.067 63.9064L115.317 50.2122L119.194 46.3504L129.067 56.1555L149.939 35.3676L153.817 39.2568L129.067 63.9064Z" fill="#16C62E"/>
</svg>
