<svg width="22" height="22" viewBox="0 0 22 22" fill="none" xmlns="http://www.w3.org/2000/svg">
<path d="M19.25 20V3.5H13.25V20H10.25V9.5H4.25V20H2V0.5H0.5V20C0.5 20.3978 0.658035 20.7794 0.93934 21.0607C1.22064 21.342 1.60218 21.5 2 21.5H21.5V20H19.25ZM8.75 20H5.75V11H8.75V20ZM17.75 20H14.75V5H17.75V20Z" fill="#CCCCCC"/>
</svg>
