<svg width="218" height="229" viewBox="0 0 218 229" fill="none" xmlns="http://www.w3.org/2000/svg">
<g clip-path="url(#clip0)">
<path d="M84.2634 228.147C130.801 228.147 168.527 221.476 168.527 213.247C168.527 205.018 130.801 198.347 84.2634 198.347C37.726 198.347 0 205.018 0 213.247C0 221.476 37.726 228.147 84.2634 228.147Z" fill="#999999"/>
<path d="M135.477 164.856C180.959 164.856 217.829 127.952 217.829 82.428C217.829 36.9043 180.959 0 135.477 0C89.9959 0 53.126 36.9043 53.126 82.428C53.126 127.952 89.9959 164.856 135.477 164.856Z" fill="#999999"/>
<path opacity="0.05" d="M135.477 150.475C173.023 150.475 203.461 120.009 203.461 82.4281C203.461 44.8468 173.023 14.3811 135.477 14.3811C97.9305 14.3811 67.4932 44.8468 67.4932 82.4281C67.4932 120.009 97.9305 150.475 135.477 150.475Z" fill="#333333"/>
<path opacity="0.05" d="M135.477 138.198C166.25 138.198 191.196 113.229 191.196 82.4279C191.196 51.6267 166.25 26.6575 135.477 26.6575C104.705 26.6575 79.7588 51.6267 79.7588 82.4279C79.7588 113.229 104.705 138.198 135.477 138.198Z" fill="#333333"/>
<path opacity="0.05" d="M135.477 122.414C157.54 122.414 175.426 104.512 175.426 82.428C175.426 60.3441 157.54 42.4417 135.477 42.4417C113.413 42.4417 95.5273 60.3441 95.5273 82.428C95.5273 104.512 113.413 122.414 135.477 122.414Z" fill="#333333"/>
<path d="M53.8547 89.8047C53.8547 89.8047 47.3802 108.046 50.2577 114.527C53.1353 121.007 57.6914 127.248 57.6914 127.248C57.6914 127.248 56.0128 91.0048 53.8547 89.8047Z" fill="#D0CDE1"/>
<path opacity="0.1" d="M53.8547 89.8047C53.8547 89.8047 47.3802 108.046 50.2577 114.527C53.1353 121.007 57.6914 127.248 57.6914 127.248C57.6914 127.248 56.0128 91.0048 53.8547 89.8047Z" fill="#333333"/>
<path d="M58.4112 132.048C58.4112 132.048 57.9316 136.608 57.6918 136.848C57.452 137.088 57.9316 137.568 57.6918 138.288C57.452 139.008 57.2122 139.968 57.6918 140.209C58.1714 140.449 55.0541 161.57 55.0541 161.57C55.0541 161.57 47.3806 171.651 50.498 187.492L51.4571 203.573C51.4571 203.573 58.8908 204.053 58.8908 201.413C58.8908 201.413 58.4112 198.293 58.4112 196.853C58.4112 195.413 59.6102 195.413 58.8908 194.693C58.1714 193.973 58.1714 193.493 58.1714 193.493C58.1714 193.493 59.3704 192.532 59.1306 192.292C58.8908 192.052 61.2887 175.011 61.2887 175.011C61.2887 175.011 63.9265 172.371 63.9265 170.931V169.491C63.9265 169.491 65.1255 166.371 65.1255 166.13C65.1255 165.89 71.5999 151.249 71.5999 151.249L74.2377 161.81L77.1152 176.931C77.1152 176.931 78.554 190.612 81.4315 195.893C81.4315 195.893 86.4672 213.174 86.4672 212.694C86.4672 212.214 94.8601 211.014 94.6203 208.854C94.3805 206.694 89.5846 176.451 89.5846 176.451L90.7835 131.568L58.4112 132.048Z" fill="#333333"/>
<path d="M51.9368 202.373C51.9368 202.373 45.4623 215.094 49.7787 215.574C54.095 216.054 55.7735 216.054 57.6919 214.134C58.7407 213.085 60.8645 211.676 62.5744 210.615C63.5876 209.996 64.4061 209.104 64.936 208.041C65.4659 206.978 65.6858 205.788 65.5705 204.605C65.444 203.431 65.0056 202.463 63.9266 202.373C61.049 202.133 57.6919 199.493 57.6919 199.493L51.9368 202.373Z" fill="#333333"/>
<path d="M87.6663 211.734C87.6663 211.734 81.1918 224.455 85.5081 224.935C89.8245 225.415 91.503 225.415 93.4214 223.495C94.4701 222.445 96.594 221.037 98.3039 219.976C99.3171 219.357 100.136 218.465 100.665 217.402C101.195 216.339 101.415 215.148 101.3 213.966C101.173 212.792 100.735 211.824 99.656 211.734C96.7785 211.494 93.4214 208.854 93.4214 208.854L87.6663 211.734Z" fill="#333333"/>
<path d="M80.8232 68.9873C86.3903 68.9873 90.9033 64.4701 90.9033 58.8978C90.9033 53.3256 86.3903 48.8083 80.8232 48.8083C75.2562 48.8083 70.7432 53.3256 70.7432 58.8978C70.7432 64.4701 75.2562 68.9873 80.8232 68.9873Z" fill="#FFB8B8"/>
<path d="M74.3428 62.2129C74.3428 62.2129 67.1427 75.4733 66.5667 75.4733C65.9907 75.4733 79.5268 79.7974 79.5268 79.7974C79.5268 79.7974 83.2709 67.1135 83.8469 65.9604L74.3428 62.2129Z" fill="#FFB8B8"/>
<path d="M85.3878 76.7238C85.3878 76.7238 71.0001 68.8032 69.5613 69.0432C68.1226 69.2832 52.7757 82.7242 53.0155 88.2446C53.2553 93.7651 55.1736 102.886 55.1736 102.886C55.1736 102.886 55.893 128.328 57.3318 128.568C58.7706 128.808 57.092 133.128 57.5716 133.128C58.0512 133.128 91.1429 133.128 91.3827 132.408C91.6225 131.688 85.3878 76.7238 85.3878 76.7238Z" fill="#D0CDE1"/>
<path d="M93.4209 133.728C93.4209 133.728 97.977 147.649 94.1403 147.169C90.3036 146.689 88.625 135.168 88.625 135.168L93.4209 133.728Z" fill="#FFB8B8"/>
<path d="M81.1921 75.8837C81.1921 75.8837 72.3196 77.8038 73.7584 89.8047C75.1972 101.806 77.8349 113.807 77.8349 113.807L86.7073 133.248L87.6665 136.848L94.141 135.168L89.3451 107.326C89.3451 107.326 87.6665 77.5638 85.5084 76.6037C84.1474 76.023 82.6676 75.7761 81.1921 75.8837Z" fill="#D0CDE1"/>
<path opacity="0.1" d="M75.7959 113.447L86.8266 133.128L77.5331 112.389L75.7959 113.447Z" fill="#333333"/>
<path d="M90.859 55.927L90.8923 55.156L92.4247 55.5377C92.4083 55.2902 92.3384 55.0492 92.2198 54.8314C92.1013 54.6135 91.9369 54.424 91.7381 54.276L93.3703 54.1846C92.0006 52.2365 90.2507 50.5865 88.2262 49.3341C86.2017 48.0818 83.9447 47.2532 81.5913 46.8983C78.0607 46.3861 74.1296 47.1273 71.7086 49.7499C70.5343 51.022 69.7964 52.6398 69.2716 54.2901C68.3048 57.3298 68.1079 60.9532 70.1236 63.424C72.1724 65.9352 75.7509 66.4271 78.975 66.7379C80.1094 66.8472 81.2982 66.949 82.3495 66.5084C82.4665 65.3015 82.3121 64.0837 81.8977 62.9442C81.7252 62.5915 81.6427 62.2014 81.6577 61.809C81.801 60.8489 83.0804 60.607 84.0416 60.7368C85.0027 60.8665 86.1583 61.0649 86.7899 60.3282C87.2249 59.8208 87.1992 59.0818 87.2569 58.4156C87.4138 56.602 90.8426 56.3072 90.859 55.927Z" fill="#333333"/>
<path d="M152.684 215.297C159.171 215.297 164.429 210.034 164.429 203.541C164.429 197.048 159.171 191.785 152.684 191.785C146.198 191.785 140.939 197.048 140.939 203.541C140.939 210.034 146.198 215.297 152.684 215.297Z" fill="#CCCCCC"/>
<path d="M14.7499 211.196C21.2364 211.196 26.4948 205.933 26.4948 199.44C26.4948 192.948 21.2364 187.684 14.7499 187.684C8.26329 187.684 3.00488 192.948 3.00488 199.44C3.00488 205.933 8.26329 211.196 14.7499 211.196Z" fill="#CCCCCC"/>
<path d="M14.7495 192.332C19.4259 192.332 23.2168 188.537 23.2168 183.857C23.2168 179.176 19.4259 175.382 14.7495 175.382C10.0732 175.382 6.28223 179.176 6.28223 183.857C6.28223 188.537 10.0732 192.332 14.7495 192.332Z" fill="#CCCCCC"/>
<path d="M14.7493 176.749C18.068 176.749 20.7583 174.056 20.7583 170.734C20.7583 167.412 18.068 164.719 14.7493 164.719C11.4306 164.719 8.74023 167.412 8.74023 170.734C8.74023 174.056 11.4306 176.749 14.7493 176.749Z" fill="#CCCCCC"/>
<path d="M162.382 69.4834H110.115V95.4172H162.382V69.4834Z" fill="white"/>
<path d="M115.822 71.0428C114.48 70.2363 112.861 70.2979 112.245 70.3595C112.48 70.9311 113.183 72.3891 114.526 73.1961C115.872 74.0047 117.489 73.9412 118.103 73.8801C117.869 73.3086 117.165 71.85 115.822 71.0428Z" fill="#7319D5"/>
<path d="M122.132 87.0479H113.74C113.492 87.0476 113.246 87.0962 113.017 87.1908C112.787 87.2855 112.579 87.4244 112.403 87.5996C112.228 87.7747 112.089 87.9828 111.994 88.2117C111.899 88.4407 111.85 88.6861 111.85 88.934C111.85 89.1819 111.899 89.4273 111.994 89.6563C112.089 89.8853 112.228 90.0933 112.403 90.2684C112.579 90.4436 112.787 90.5825 113.017 90.6772C113.246 90.7718 113.492 90.8204 113.74 90.8202H122.132C122.381 90.8204 122.626 90.7718 122.856 90.6772C123.085 90.5825 123.293 90.4436 123.469 90.2684C123.645 90.0933 123.784 89.8853 123.879 89.6563C123.974 89.4273 124.023 89.1819 124.023 88.934C124.023 88.6861 123.974 88.4407 123.879 88.2117C123.784 87.9828 123.645 87.7747 123.469 87.5996C123.293 87.4244 123.085 87.2855 122.856 87.1908C122.626 87.0962 122.381 87.0476 122.132 87.0479Z" fill="#7319D5"/>
<path d="M160.136 67.1384H113.082C112.535 67.1384 111.993 67.2461 111.487 67.4553C110.981 67.6646 110.522 67.9712 110.135 68.3578C109.748 68.7445 109.441 69.2034 109.231 69.7086C109.022 70.2137 108.914 70.7551 108.914 71.3018V94.2013C108.914 95.3055 109.353 96.3645 110.135 97.1453C110.917 97.926 111.977 98.3647 113.082 98.3647H160.136C161.242 98.3647 162.302 97.926 163.084 97.1453C163.866 96.3645 164.305 95.3055 164.305 94.2013V71.3018C164.305 70.7551 164.197 70.2137 163.987 69.7086C163.778 69.2034 163.471 68.7445 163.084 68.3578C162.697 67.9712 162.237 67.6646 161.732 67.4553C161.226 67.2461 160.684 67.1384 160.136 67.1384ZM111.918 69.9785C112.011 69.9617 114.214 69.5872 116.039 70.6838C117.863 71.7801 118.564 73.9002 118.593 73.9898L118.667 74.2184L118.43 74.2604C118.092 74.3131 117.751 74.3381 117.409 74.3353C116.324 74.356 115.254 74.0866 114.309 73.5549C112.485 72.4588 111.784 70.3387 111.755 70.2491L111.681 70.0205L111.918 69.9785ZM122.132 91.2392H113.74C113.128 91.2392 112.541 90.9963 112.108 90.564C111.675 90.1317 111.432 89.5453 111.432 88.9339C111.432 88.3225 111.675 87.7362 112.108 87.3038C112.541 86.8715 113.128 86.6286 113.74 86.6286H122.132C122.744 86.6286 123.331 86.8715 123.764 87.3038C124.197 87.7362 124.44 88.3225 124.44 88.9339C124.44 89.5453 124.197 90.1317 123.764 90.564C123.331 90.9963 122.744 91.2392 122.132 91.2392ZM160.318 90.8201C160.316 91.4865 160.05 92.125 159.579 92.5962C159.107 93.0674 158.468 93.333 157.8 93.3349H151.506C150.839 93.333 150.2 93.0674 149.728 92.5962C149.256 92.125 148.99 91.4865 148.988 90.8201V87.0478C148.99 86.3814 149.256 85.7429 149.728 85.2717C150.2 84.8005 150.839 84.5349 151.506 84.5329H157.8C158.468 84.5349 159.107 84.8005 159.579 85.2717C160.05 85.7429 160.316 86.3814 160.318 87.0478V90.8201Z" fill="#7319D5"/>
<path d="M153.499 90.0867H150.771C150.577 90.0867 150.39 90.164 150.252 90.3015C150.114 90.4391 150.037 90.6256 150.037 90.8202C150.037 91.0147 150.114 91.2013 150.252 91.3388C150.39 91.4764 150.577 91.5537 150.771 91.5537H153.499C153.694 91.5537 153.881 91.4764 154.018 91.3388C154.156 91.2013 154.233 91.0147 154.233 90.8202C154.233 90.6256 154.156 90.4391 154.018 90.3015C153.881 90.164 153.694 90.0867 153.499 90.0867ZM153.499 91.1345H150.771C150.73 91.1346 150.689 91.1266 150.651 91.1108C150.612 91.0951 150.578 91.072 150.548 91.0428C150.519 91.0136 150.496 90.9789 150.48 90.9407C150.464 90.9025 150.456 90.8615 150.456 90.8202C150.456 90.7788 150.464 90.7379 150.48 90.6997C150.496 90.6615 150.519 90.6268 150.548 90.5976C150.578 90.5684 150.612 90.5453 150.651 90.5295C150.689 90.5138 150.73 90.5057 150.771 90.5058H153.499C153.582 90.506 153.662 90.5393 153.721 90.5982C153.78 90.6571 153.813 90.7369 153.813 90.8202C153.813 90.9034 153.78 90.9832 153.721 91.0422C153.662 91.1011 153.582 91.1343 153.499 91.1345Z" fill="#7319D5"/>
<path d="M158.535 90.0867H155.808C155.613 90.0867 155.426 90.164 155.288 90.3015C155.151 90.4391 155.073 90.6256 155.073 90.8202C155.073 91.0147 155.151 91.2013 155.288 91.3388C155.426 91.4764 155.613 91.5537 155.808 91.5537H158.535C158.73 91.5537 158.917 91.4764 159.054 91.3388C159.192 91.2013 159.27 91.0147 159.27 90.8202C159.27 90.6256 159.192 90.4391 159.054 90.3015C158.917 90.164 158.73 90.0867 158.535 90.0867ZM158.535 91.1345H155.808C155.766 91.1346 155.725 91.1266 155.687 91.1108C155.649 91.0951 155.614 91.072 155.585 91.0428C155.555 91.0136 155.532 90.9789 155.516 90.9407C155.5 90.9025 155.492 90.8615 155.492 90.8202C155.492 90.7788 155.5 90.7379 155.516 90.6997C155.532 90.6615 155.555 90.6268 155.585 90.5976C155.614 90.5684 155.649 90.5453 155.687 90.5295C155.725 90.5138 155.766 90.5057 155.808 90.5058H158.535C158.618 90.506 158.698 90.5393 158.757 90.5982C158.816 90.6571 158.849 90.7369 158.849 90.8202C158.849 90.9034 158.816 90.9832 158.757 91.0422C158.698 91.1011 158.618 91.1343 158.535 91.1345Z" fill="#7319D5"/>
<path d="M153.499 88.2004H150.771C150.577 88.2004 150.39 88.2777 150.252 88.4153C150.114 88.5528 150.037 88.7394 150.037 88.9339C150.037 89.1285 150.114 89.315 150.252 89.4526C150.39 89.5902 150.577 89.6674 150.771 89.6674H153.499C153.694 89.6674 153.881 89.5902 154.018 89.4526C154.156 89.315 154.233 89.1285 154.233 88.9339C154.233 88.7394 154.156 88.5528 154.018 88.4153C153.881 88.2777 153.694 88.2004 153.499 88.2004ZM153.499 89.2483H150.771C150.73 89.2483 150.689 89.2402 150.651 89.2244C150.613 89.2086 150.578 89.1854 150.549 89.1562C150.52 89.127 150.497 89.0924 150.481 89.0542C150.465 89.0161 150.457 88.9752 150.457 88.9339C150.457 88.8927 150.465 88.8518 150.481 88.8136C150.497 88.7755 150.52 88.7408 150.549 88.7117C150.578 88.6825 150.613 88.6593 150.651 88.6435C150.689 88.6277 150.73 88.6196 150.771 88.6196H153.499C153.54 88.6196 153.581 88.6277 153.619 88.6435C153.658 88.6593 153.692 88.6825 153.722 88.7117C153.751 88.7408 153.774 88.7755 153.79 88.8136C153.806 88.8518 153.814 88.8927 153.814 88.9339C153.814 88.9752 153.806 89.0161 153.79 89.0542C153.774 89.0924 153.751 89.127 153.722 89.1562C153.692 89.1854 153.658 89.2086 153.619 89.2244C153.581 89.2402 153.54 89.2483 153.499 89.2483Z" fill="#7319D5"/>
<path d="M158.535 88.2004H155.808C155.613 88.2004 155.426 88.2777 155.288 88.4153C155.151 88.5528 155.073 88.7394 155.073 88.9339C155.073 89.1285 155.151 89.315 155.288 89.4526C155.426 89.5902 155.613 89.6674 155.808 89.6674H158.535C158.73 89.6674 158.917 89.5902 159.054 89.4526C159.192 89.315 159.27 89.1285 159.27 88.9339C159.27 88.7394 159.192 88.5528 159.054 88.4153C158.917 88.2777 158.73 88.2004 158.535 88.2004ZM158.535 89.2483H155.808C155.766 89.2483 155.725 89.2402 155.687 89.2244C155.649 89.2086 155.614 89.1854 155.585 89.1562C155.556 89.127 155.533 89.0924 155.517 89.0542C155.501 89.0161 155.493 88.9752 155.493 88.9339C155.493 88.8927 155.501 88.8518 155.517 88.8136C155.533 88.7755 155.556 88.7408 155.585 88.7117C155.614 88.6825 155.649 88.6593 155.687 88.6435C155.725 88.6277 155.766 88.6196 155.808 88.6196H158.535C158.576 88.6196 158.617 88.6277 158.656 88.6435C158.694 88.6593 158.728 88.6825 158.758 88.7117C158.787 88.7408 158.81 88.7755 158.826 88.8136C158.842 88.8518 158.85 88.8927 158.85 88.9339C158.85 88.9752 158.842 89.0161 158.826 89.0542C158.81 89.0924 158.787 89.127 158.758 89.1562C158.728 89.1854 158.694 89.2086 158.656 89.2244C158.617 89.2402 158.576 89.2483 158.535 89.2483Z" fill="#7319D5"/>
<path d="M153.499 86.3145H150.771C150.577 86.3145 150.39 86.3917 150.252 86.5293C150.114 86.6669 150.037 86.8534 150.037 87.048C150.037 87.2425 150.114 87.4291 150.252 87.5666C150.39 87.7042 150.577 87.7815 150.771 87.7815H153.499C153.694 87.7815 153.881 87.7042 154.018 87.5666C154.156 87.4291 154.233 87.2425 154.233 87.048C154.233 86.8534 154.156 86.6669 154.018 86.5293C153.881 86.3917 153.694 86.3145 153.499 86.3145ZM153.499 87.3623H150.771C150.73 87.3624 150.689 87.3544 150.651 87.3386C150.612 87.3229 150.578 87.2997 150.548 87.2705C150.519 87.2413 150.496 87.2067 150.48 87.1685C150.464 87.1303 150.456 87.0893 150.456 87.048C150.456 87.0066 150.464 86.9657 150.48 86.9275C150.496 86.8893 150.519 86.8546 150.548 86.8254C150.578 86.7962 150.612 86.773 150.651 86.7573C150.689 86.7415 150.73 86.7335 150.771 86.7336H153.499C153.582 86.7338 153.662 86.767 153.721 86.826C153.78 86.8849 153.813 86.9647 153.813 87.048C153.813 87.1312 153.78 87.211 153.721 87.27C153.662 87.3289 153.582 87.3621 153.499 87.3623Z" fill="#7319D5"/>
<path d="M158.535 86.3145H155.808C155.613 86.3145 155.426 86.3917 155.288 86.5293C155.151 86.6669 155.073 86.8534 155.073 87.048C155.073 87.2425 155.151 87.4291 155.288 87.5666C155.426 87.7042 155.613 87.7815 155.808 87.7815H158.535C158.73 87.7815 158.917 87.7042 159.054 87.5666C159.192 87.4291 159.27 87.2425 159.27 87.048C159.27 86.8534 159.192 86.6669 159.054 86.5293C158.917 86.3917 158.73 86.3145 158.535 86.3145ZM158.535 87.3623H155.808C155.766 87.3624 155.725 87.3544 155.687 87.3386C155.649 87.3229 155.614 87.2997 155.585 87.2705C155.555 87.2413 155.532 87.2067 155.516 87.1685C155.5 87.1303 155.492 87.0893 155.492 87.048C155.492 87.0066 155.5 86.9657 155.516 86.9275C155.532 86.8893 155.555 86.8546 155.585 86.8254C155.614 86.7962 155.649 86.773 155.687 86.7573C155.725 86.7415 155.766 86.7335 155.808 86.7336H158.535C158.618 86.7338 158.698 86.767 158.757 86.826C158.816 86.8849 158.849 86.9647 158.849 87.048C158.849 87.1312 158.816 87.211 158.757 87.27C158.698 87.3289 158.618 87.3621 158.535 87.3623Z" fill="#7319D5"/>
</g>
<defs>
<clipPath id="clip0">
<rect width="217.828" height="228.146" fill="white"/>
</clipPath>
</defs>
</svg>
