<svg width="268" height="191" viewBox="0 0 268 191" fill="none" xmlns="http://www.w3.org/2000/svg">
<g clip-path="url(#clip0)">
<path d="M257.261 43.8008L149.37 90.1668L164.917 133.034L176.028 163.666L178.821 171.37L203.684 180.805L204.583 181.146L230.554 190.998L243.021 185.667L260.005 178.368L268 174.932L257.261 43.8008Z" fill="#F2F2F2"/>
<path d="M260.09 173.958L260.067 175.069L260.006 178.371L243.022 185.67L231.552 190.598L231.068 188.981L230.554 191.001L204.583 181.149L204.181 171.637V171.634L204.092 169.52L254.97 166.105L255.968 167.634L256.165 167.938L260.09 173.958Z" fill="#2F2E41"/>
<path d="M223.214 72.9031C223.214 72.9031 219.799 85.1935 219.116 85.1935C218.433 85.1935 225.604 94.7528 225.604 94.7528L236.189 100.557L239.945 84.8521C239.945 84.8521 236.53 76.3171 237.213 71.8789L223.214 72.9031Z" fill="#FFB8B8"/>
<path d="M228.677 77.6816C235.655 77.6816 241.311 72.0261 241.311 65.0498C241.311 58.0734 235.655 52.418 228.677 52.418C221.7 52.418 216.043 58.0734 216.043 65.0498C216.043 72.0261 221.7 77.6816 228.677 77.6816Z" fill="#FFB8B8"/>
<path d="M230.384 91.3372L220.29 82.5722L214.336 85.5333L201.36 93.727C201.36 93.727 204.775 167.469 203.068 170.201C203.068 170.201 206.824 178.736 229.018 173.615C251.213 168.494 257.017 167.811 257.017 167.811L252.237 122.746L258.042 94.4098L238.544 80.7773L232.433 91.3372L230.384 91.3372Z" fill="#7319D5"/>
<path d="M192.824 120.016C192.824 120.016 187.702 136.061 191.458 137.768C195.214 139.475 198.288 138.793 198.288 138.793L204.092 124.795L192.824 120.016Z" fill="#FFB8B8"/>
<path d="M263.848 117.285L266.921 131.624V160.643C266.921 160.643 262.482 179.079 259.067 174.299C255.653 169.519 255.723 168.006 255.723 168.006L260.092 161.326L258.043 134.014L252.599 120.985L263.848 117.285Z" fill="#FFB8B8"/>
<path d="M240.628 52.42C240.628 52.42 236.531 43.5437 228.677 45.5921C220.824 47.6405 216.385 50.7131 216.044 53.7857C215.702 56.8582 216.214 61.4672 216.214 61.4672C216.214 61.4672 217.068 55.1513 222.531 56.5169C227.995 57.8825 236.531 56.8583 236.531 56.8583L237.897 69.1487C237.897 69.1487 239.433 66.9296 241.141 68.2952C242.848 69.6608 246.092 55.1512 240.628 52.42Z" fill="#2F2E41"/>
<path d="M252.688 120.103L253.923 126.523L266.024 123.313L263.802 117.387L252.688 120.103Z" fill="#3F3D56"/>
<path d="M192.599 119.904L190.669 126.151L202.859 129.007L203.685 122.732L192.599 119.904Z" fill="#3F3D56"/>
<path d="M250.189 93.7285L258.042 94.4113C258.042 94.4113 266.92 118.651 265.895 119.334C264.871 120.016 252.579 124.113 250.871 123.089C249.164 122.065 250.189 93.7285 250.189 93.7285Z" fill="#7319D5"/>
<path d="M204.093 94.4113L201.361 93.7285C201.361 93.7285 196.239 100.215 194.532 107.726C192.825 115.237 190.434 122.748 191.8 122.748C193.166 122.748 205.458 127.527 205.458 127.527L204.093 94.4113Z" fill="#7319D5"/>
<path d="M231.695 96.1515C233.059 96.1515 234.165 95.0459 234.165 93.6822C234.165 92.3184 233.059 91.2129 231.695 91.2129C230.331 91.2129 229.225 92.3184 229.225 93.6822C229.225 95.0459 230.331 96.1515 231.695 96.1515Z" fill="#3F3D56"/>
<path d="M250.763 137.342L224.383 145.657L213.616 111.509C223.781 110.083 232.574 107.312 239.996 103.193C241.372 114.841 244.887 126.233 250.763 137.342Z" fill="#E6E6E6"/>
<path d="M248.294 141.045L221.913 149.36L211.146 115.212C221.311 113.787 230.105 111.015 237.527 106.896C238.902 118.545 242.417 129.936 248.294 141.045Z" fill="white"/>
<path d="M194.531 127.87C194.531 127.87 190.434 135.38 191.458 137.77C192.483 140.16 201.019 141.526 202.043 141.526C203.068 141.526 215.36 138.794 215.36 138.794C215.36 138.794 234.14 129.918 228.677 125.48C223.214 121.042 212.97 131.625 212.97 131.625H204.775L200.336 128.552L194.531 127.87Z" fill="#FFB8B8"/>
<path d="M44.8575 30.8535H0.229004V50.7998H44.8575V30.8535Z" fill="#F2F2F2"/>
<path d="M162.493 95.6504H154.712V102.515H162.493V95.6504Z" fill="#3F3D56"/>
<path d="M146.931 95.6504H139.149V102.515H146.931V95.6504Z" fill="#3F3D56"/>
<path d="M178.056 80.5469H170.275V88.327H178.056V80.5469Z" fill="#7319D5"/>
<path d="M170.275 88.3281H162.494V95.6506H170.275V88.3281Z" fill="#3F3D56"/>
<path d="M154.712 88.3281H146.931V95.6506H154.712V88.3281Z" fill="#3F3D56"/>
<path d="M62.4801 102.057H54.6987V108.922H62.4801V102.057Z" fill="#7319D5"/>
<path d="M132.512 94.7344H124.731V102.057H132.512V94.7344Z" fill="#3F3D56"/>
<path d="M85.8238 94.7344H78.0425V102.057H85.8238V94.7344Z" fill="#3F3D56"/>
<path d="M78.0426 86.9551H70.2612V94.7352H78.0426V86.9551Z" fill="#3F3D56"/>
<path d="M116.95 94.7344H109.168V102.057H116.95V94.7344Z" fill="#3F3D56"/>
<path d="M109.168 86.9551H101.387V94.7352H109.168V86.9551Z" fill="#3F3D56"/>
<path d="M101.387 94.7344H93.6055V102.057H101.387V94.7344Z" fill="#3F3D56"/>
<path d="M70.2614 94.7344H62.48V102.057H70.2614V94.7344Z" fill="#3F3D56"/>
<path d="M124.731 86.9551H116.95V94.7352H124.731V86.9551Z" fill="#7319D5"/>
<path d="M152.135 74.9399L148.093 70.6064L152.427 66.5645L156.47 70.898L152.135 74.9399ZM148.737 70.6289L152.158 74.2957L155.825 70.8755L152.405 67.2087L148.737 70.6289Z" fill="#3F3D56"/>
<path d="M97.4186 57.1134H91.4917V51.1875H97.4186V57.1134ZM91.9476 56.6576H96.9627V51.6433H91.9476V56.6576Z" fill="#3F3D56"/>
<path d="M207.503 45.672H201.576V39.7461H207.503V45.672ZM202.032 45.2162H207.047V40.2019H202.032V45.2162Z" fill="#3F3D56"/>
<path d="M58.2305 106.193L57.8802 105.851C59.4913 104.024 60.7125 101.888 61.4689 99.5736C62.6598 95.9902 63.2416 90.3308 59.2495 83.72C55.165 76.9561 54.9812 71.4622 55.5461 68.0445C56.161 64.3257 57.7296 62.2412 57.796 62.1543L58.185 62.4515C58.1693 62.4719 56.6144 64.5453 56.0244 68.1532C55.4796 71.4842 55.6697 76.8449 59.6685 83.4669C63.7627 90.2469 63.1562 96.0633 61.9265 99.7488C60.5941 103.742 58.3265 106.095 58.2305 106.193Z" fill="#3F3D56"/>
<path d="M120.024 90.6322L119.674 90.2903C121.285 88.4639 122.506 86.3279 123.262 84.0131C124.453 80.4297 125.035 74.7703 121.043 68.1594C116.958 61.3955 116.775 55.9017 117.34 52.484C117.954 48.7651 119.523 46.6806 119.589 46.5938L119.978 46.8909C119.963 46.9114 118.408 48.9848 117.818 52.5927C117.273 55.9236 117.463 61.2844 121.462 67.9064C125.556 74.6863 124.95 80.5028 123.72 84.1883C122.388 88.1814 120.12 90.534 120.024 90.6322Z" fill="#3F3D56"/>
<path d="M173.807 84.681L173.457 84.3392C175.068 82.5128 176.289 80.3767 177.046 78.0619C178.237 74.4785 178.818 68.8191 174.826 62.2083C170.742 55.4443 170.558 49.9505 171.123 46.5328C171.738 42.814 173.306 40.7294 173.373 40.6426L173.762 40.9398C173.746 40.9602 172.191 43.0336 171.601 46.6415C171.056 49.9725 171.246 55.3332 175.245 61.9552C179.339 68.7351 178.733 74.5516 177.503 78.2371C176.171 82.2303 173.903 84.5828 173.807 84.681Z" fill="#3F3D56"/>
<path d="M33.3126 37.1484H11.7739V37.6379H33.3126V37.1484Z" fill="#3F3D56"/>
<path d="M33.3126 40.5801H11.7739V41.0695H33.3126V40.5801Z" fill="#3F3D56"/>
<path d="M33.3126 44.0137H11.7739V44.5031H33.3126V44.0137Z" fill="#3F3D56"/>
<path d="M153.924 4.42578H132.385V4.91522H153.924V4.42578Z" fill="#3F3D56"/>
<path d="M153.924 7.85938H132.385V8.34881H153.924V7.85938Z" fill="#3F3D56"/>
<path d="M153.924 11.291H132.385V11.7805H153.924V11.291Z" fill="#3F3D56"/>
<path d="M204.503 80.3965H182.964V80.8859H204.503V80.3965Z" fill="#3F3D56"/>
<path d="M204.503 83.8301H182.964V84.3195H204.503V83.8301Z" fill="#3F3D56"/>
<path d="M204.503 87.2617H182.964V87.7512H204.503V87.2617Z" fill="#3F3D56"/>
<path d="M69.2442 114.721H47.7056V115.21H69.2442V114.721Z" fill="#3F3D56"/>
<path d="M69.2442 118.154H47.7056V118.644H69.2442V118.154Z" fill="#3F3D56"/>
<path d="M69.2442 121.586H47.7056V122.075H69.2442V121.586Z" fill="#3F3D56"/>
<path d="M31.5513 25.3142C35.2726 16.9681 40.8813 11.4779 48.2216 8.99617C53.6715 7.15347 59.9741 6.97934 66.9544 8.47844C72.1017 9.5922 77.0411 11.5105 81.5906 14.1627C105.823 28.2242 120.805 28.3492 129.106 25.9779C138.207 23.378 141.538 17.2775 141.571 17.2161L141.975 17.4305C141.942 17.4934 138.535 23.7535 129.249 26.4129C123.896 27.946 117.641 28.0092 110.659 26.601C101.968 24.8483 92.1112 20.7966 81.3608 14.5586C76.8529 11.9306 71.9586 10.0296 66.8585 8.92586C55.4099 6.46718 40.0637 7.34683 31.9691 25.5005L31.5513 25.3142Z" fill="#2F2E41"/>
<path d="M58.5892 62.4697C63.1395 62.4697 66.8283 58.7815 66.8283 54.2319C66.8283 49.6823 63.1395 45.9941 58.5892 45.9941C54.0389 45.9941 50.3501 49.6823 50.3501 54.2319C50.3501 58.7815 54.0389 62.4697 58.5892 62.4697Z" fill="#3F3D56"/>
<path d="M120.84 48.0537C125.391 48.0537 129.079 44.3655 129.079 39.8159C129.079 35.2663 125.391 31.5781 120.84 31.5781C116.29 31.5781 112.601 35.2663 112.601 39.8159C112.601 44.3655 116.29 48.0537 120.84 48.0537Z" fill="#3F3D56"/>
<path d="M174.623 40.7315C179.174 40.7315 182.863 37.0433 182.863 32.4937C182.863 27.944 179.174 24.2559 174.623 24.2559C170.073 24.2559 166.384 27.944 166.384 32.4937C166.384 37.0433 170.073 40.7315 174.623 40.7315Z" fill="#3F3D56"/>
<path d="M51.0367 51.0277H0V24.9414H51.0367V51.0277ZM0.457728 50.5701H50.579V25.3991H0.457728V50.5701Z" fill="#3F3D56"/>
<path d="M109.169 13.6914H64.54V33.6377H109.169V13.6914Z" fill="#F2F2F2"/>
<path d="M97.6236 19.9863H76.085V20.4758H97.6236V19.9863Z" fill="#3F3D56"/>
<path d="M97.6236 23.418H76.085V23.9074H97.6236V23.418Z" fill="#3F3D56"/>
<path d="M96.9371 26.1641H75.3984V26.6535H96.9371V26.1641Z" fill="#3F3D56"/>
<path d="M115.347 33.8657H64.3105V7.7793H115.347V33.8657ZM64.7683 33.408H114.89V8.23695H64.7683V33.408Z" fill="#3F3D56"/>
<path d="M224.287 5.91211H179.659V25.8584H224.287V5.91211Z" fill="#F2F2F2"/>
<path d="M212.742 12.207H191.204V12.6965H212.742V12.207Z" fill="#3F3D56"/>
<path d="M212.742 15.6387H191.204V16.1281H212.742V15.6387Z" fill="#3F3D56"/>
<path d="M212.742 19.0703H191.204V19.5598H212.742V19.0703Z" fill="#3F3D56"/>
<path d="M230.466 26.0864H179.43V0H230.466V26.0864ZM179.887 25.6287H230.009V0.457655H179.887V25.6287Z" fill="#3F3D56"/>
</g>
<defs>
<clipPath id="clip0">
<rect width="268" height="191" fill="white"/>
</clipPath>
</defs>
</svg>
