<svg width="74" height="74" viewBox="0 0 74 74" fill="none" xmlns="http://www.w3.org/2000/svg">
<g clip-path="url(#clip0)">
<path d="M5.65051 15.9706C7.51727 13.9339 9.47365 12.1011 11.6276 10.3996C11.881 10.1995 12.2456 10.439 12.1608 10.7505C10.9535 15.188 8.84407 19.5734 5.59212 22.8334C5.44615 20.5511 5.44398 18.2498 5.65051 15.9706Z" fill="#B585E9"/>
<path d="M5.59267 22.8355C3.71521 20.5698 2.10196 18.2274 0.648121 15.6984C0.481911 15.4092 0.0397904 15.5124 0.0228803 15.8455C-0.239299 21.026 1.74005 27.0874 6.56233 29.5322C6.08176 27.3291 5.73547 25.0873 5.59267 22.8355Z" fill="#B585E9"/>
<path d="M6.56152 29.5295C7.74306 27.0985 9.06567 24.8366 10.6158 22.6441C10.7998 22.3839 11.2121 22.5032 11.2255 22.8214C11.4144 27.2964 10.6465 32.0269 8.50229 35.9551C7.70765 33.8643 7.03703 31.7167 6.56152 29.5295Z" fill="#B585E9"/>
<path d="M8.50376 35.9579C6.06596 34.3912 3.83888 32.6779 1.70271 30.7538C1.45629 30.5318 1.06967 30.7636 1.1532 31.0845C2.44011 36.0326 6.1203 41.1105 11.36 42.0073C10.2708 40.0622 9.29507 38.0435 8.50376 35.9579Z" fill="#B585E9"/>
<path d="M11.3584 42.005C11.7855 39.3527 12.3963 36.8227 13.2465 34.2933C13.3477 33.9924 13.7748 33.9866 13.8808 34.2858C15.3678 38.4841 15.9702 43.2205 15.073 47.5734C13.7093 45.8083 12.4476 43.9533 11.3584 42.005Z" fill="#B585E9"/>
<path d="M15.0744 47.576C12.2954 46.7887 9.67012 45.804 7.06986 44.5972C6.76953 44.4577 6.46847 44.7919 6.64162 45.0743C9.31501 49.4339 14.3201 53.2086 19.5919 52.5581C17.9736 51.0077 16.4443 49.3515 15.0744 47.576Z" fill="#B585E9"/>
<path d="M19.591 52.5564C19.2117 49.8842 19.0507 47.278 19.1251 44.599C19.134 44.2814 19.5414 44.1512 19.7299 44.4069C22.3926 48.0168 24.3788 52.4019 24.8542 56.8477C23.0028 55.5466 21.225 54.1243 19.591 52.5564Z" fill="#B585E9"/>
<path d="M68.3499 15.9706C66.4832 13.9339 64.5268 12.1011 62.3729 10.3996C62.1195 10.1995 61.7548 10.439 61.8397 10.7505C63.0469 15.188 65.1564 19.5734 68.4083 22.8334C68.5543 20.5511 68.5565 18.2498 68.3499 15.9706Z" fill="#B585E9"/>
<path d="M68.4072 22.8355C70.2846 20.5698 71.8979 18.2274 73.3517 15.6984C73.5179 15.4092 73.96 15.5124 73.9769 15.8455C74.2391 21.026 72.2598 27.0874 67.4375 29.5322C67.9181 27.3291 68.2644 25.0873 68.4072 22.8355Z" fill="#B585E9"/>
<path d="M67.4377 29.5295C66.2561 27.0985 64.9335 24.8366 63.3834 22.6441C63.1995 22.3839 62.7871 22.5032 62.7737 22.8214C62.5848 27.2964 63.3527 32.0269 65.4969 35.9551C66.2916 33.8643 66.9622 31.7167 67.4377 29.5295Z" fill="#B585E9"/>
<path d="M65.4968 35.9579C67.9347 34.3912 70.1617 32.6779 72.2979 30.7538C72.5443 30.5318 72.9309 30.7636 72.8474 31.0845C71.5605 36.0326 67.8803 41.1105 62.6406 42.0073C63.7298 40.0622 64.7055 38.0435 65.4968 35.9579Z" fill="#B585E9"/>
<path d="M62.6413 42.005C62.2142 39.3527 61.6034 36.8227 60.7531 34.2933C60.6519 33.9924 60.2249 33.9866 60.1189 34.2858C58.6318 38.4841 58.0294 43.2205 58.9267 47.5734C60.2903 45.8083 61.5521 43.9533 62.6413 42.005Z" fill="#B585E9"/>
<path d="M58.9255 47.576C61.7046 46.7887 64.3298 45.804 66.9301 44.5972C67.2306 44.4577 67.5315 44.7919 67.3585 45.0743C64.6851 49.4339 59.68 53.2086 54.4082 52.5581C56.0264 51.0077 57.5557 49.3515 58.9255 47.576Z" fill="#B585E9"/>
<path d="M54.4097 52.5564C54.789 49.8842 54.95 47.278 54.8755 44.599C54.8667 44.2814 54.4593 44.1512 54.2708 44.4069C51.6081 48.0168 49.6218 52.4019 49.1465 56.8477C50.9979 55.5466 52.7757 54.1243 54.4097 52.5564Z" fill="#B585E9"/>
<path d="M69.4242 16.064C69.4238 16.042 69.4242 16.0202 69.4226 15.998C69.1674 12.6006 68.5411 9.19468 67.5612 5.87524C67.3866 5.28367 66.7651 4.94562 66.174 5.12035C65.5824 5.29495 65.2444 5.916 65.4189 6.50756C66.3448 9.64374 66.9387 12.8596 67.1867 16.0673C67.1873 16.0913 67.1874 16.1153 67.1896 16.1395C67.3778 18.2134 67.3966 20.4607 67.2457 22.8193C67.2455 22.8202 67.2454 22.8212 67.2454 22.8221C67.1156 24.8699 66.7978 27.0628 66.301 29.3397C66.301 29.3398 66.3009 29.3401 66.3009 29.3403C65.8684 31.3295 65.2322 33.4344 64.4104 35.5967C64.4101 35.5975 64.41 35.598 64.4097 35.5988V35.5989C63.6892 37.4978 62.7532 39.4794 61.6279 41.489C60.6357 43.2637 59.4186 45.0879 58.01 46.9112C58.0097 46.9115 58.0096 46.9119 58.0093 46.9122C58.009 46.9125 58.0087 46.9128 58.0086 46.9131C56.7601 48.5311 55.2804 50.1627 53.6103 51.763L53.6102 51.7631C52.122 53.1911 50.398 54.5962 48.4858 55.9399C48.4789 55.9448 48.4728 55.9505 48.466 55.9554C48.4595 55.9601 48.4526 55.9642 48.4462 55.9691C45.2296 58.4406 43.5995 59.057 41.8738 59.7093C40.507 60.2261 39.1117 60.755 37.0004 62.1624C34.8891 60.755 33.4938 60.2261 32.127 59.7093C30.4013 59.0569 28.7712 58.4406 25.5546 55.9691C25.5482 55.9642 25.5413 55.9603 25.5348 55.9555C25.528 55.9505 25.5218 55.9448 25.5148 55.9399C23.6027 54.5963 21.8787 53.1911 20.3905 51.7631L20.3903 51.763C18.7203 50.1629 17.2406 48.5311 15.9921 46.9131C15.9918 46.9128 15.9915 46.9125 15.9914 46.9122C15.9911 46.9119 15.9909 46.9115 15.9907 46.9112C14.5821 45.0879 13.3648 43.2637 12.3728 41.489C11.2473 39.4794 10.3115 37.4978 9.59097 35.5989C9.59097 35.5988 9.59097 35.5988 9.59083 35.5988C9.59054 35.598 9.59039 35.5975 9.5901 35.5967C8.76801 33.4344 8.13193 31.3295 7.69935 29.3403C7.69935 29.34 7.6992 29.3398 7.6992 29.3397C7.20231 27.0628 6.88463 24.8698 6.75484 22.8221C6.75469 22.8211 6.75455 22.8202 6.75455 22.8193C6.60366 20.4609 6.62245 18.2134 6.81063 16.1395C6.8128 16.1153 6.81294 16.0913 6.81352 16.0673C7.06153 12.8596 7.65541 9.64388 8.58128 6.50756C8.75587 5.916 8.41781 5.29495 7.82625 5.12035C7.23526 4.94533 6.61363 5.28367 6.43904 5.87524C5.45912 9.19468 4.83287 12.6006 4.57762 15.998C4.57589 16.0202 4.57632 16.042 4.57603 16.064C4.38814 18.2167 4.37037 20.5362 4.52574 22.962C4.52574 22.9626 4.52574 22.963 4.52574 22.9636C4.66275 25.1219 4.99604 27.4254 5.51606 29.8103C5.51635 29.8119 5.5165 29.8135 5.51679 29.8151C5.97293 31.9121 6.64066 34.1241 7.50178 36.3896C7.50206 36.3902 7.50221 36.3908 7.50235 36.3914C8.26157 38.3918 9.24381 40.4732 10.4222 42.5776C10.4225 42.578 10.4226 42.5784 10.4229 42.5789C11.4687 44.4495 12.7472 46.3666 14.2232 48.2767C14.2233 48.2769 14.2235 48.277 14.2236 48.2772C14.2238 48.2773 14.2238 48.2773 14.2238 48.2775C15.5402 49.9836 17.0952 51.6991 18.8457 53.3764C18.8462 53.3768 18.8467 53.3772 18.8472 53.3777C20.4114 54.8782 22.2165 56.3505 24.2123 57.7542C27.6784 60.4152 29.5384 61.1185 31.3368 61.7985C32.4562 62.2217 33.5458 62.6344 35.0543 63.5622C33.8995 64.4473 32.562 65.5579 30.975 66.9777C30.5154 67.3889 30.4761 68.095 30.8875 68.5546C31.108 68.8011 31.4134 68.9267 31.7201 68.9267C31.9852 68.9267 32.2513 68.8329 32.4643 68.6422C34.3045 66.9955 35.7752 65.7922 37.0001 64.8871C38.2249 65.7922 39.6956 66.9955 41.5359 68.6422C41.749 68.8328 42.0151 68.9267 42.2801 68.9267C42.5868 68.9267 42.8922 68.8011 43.1128 68.5546C43.5241 68.095 43.4849 67.3889 43.0252 66.9777C41.4384 65.5577 40.1007 64.4471 38.9459 63.5622C40.4543 62.6344 41.544 62.2217 42.6634 61.7985C44.462 61.1186 46.3218 60.4152 49.7879 57.7542C51.7838 56.3505 53.5888 54.8782 55.1531 53.3777C55.1535 53.3772 55.1541 53.3768 55.1545 53.3764C56.9051 51.6991 58.4601 49.9836 59.7765 48.2775C59.7765 48.2773 59.7766 48.2773 59.7766 48.2772C59.7767 48.277 59.7769 48.2769 59.777 48.2767C61.253 46.3666 62.5315 44.4495 63.5773 42.5789C63.5776 42.5784 63.5778 42.578 63.5781 42.5776C64.7563 40.4732 65.7387 38.3918 66.4979 36.3914C66.498 36.3908 66.4983 36.3902 66.4984 36.3896C67.3596 34.1241 68.0273 31.9121 68.4834 29.8151C68.4837 29.8135 68.4839 29.8119 68.4842 29.8103C69.0043 27.4254 69.3375 25.1219 69.4745 22.9636C69.4745 22.963 69.4745 22.9626 69.4745 22.962C69.6299 20.5362 69.6122 18.2167 69.4242 16.064Z" fill="#4A148C"/>
<path d="M26.8977 34.1046C25.0101 34.1046 23.4015 33.8043 22.0716 33.2037C20.7632 32.6031 19.7765 31.8524 19.1116 30.9515C18.4681 30.0292 18.1249 29.0854 18.082 28.1202C18.082 27.9272 18.1464 27.777 18.2751 27.6698C18.4252 27.5411 18.5968 27.4767 18.7899 27.4767H21.6855C22.1574 27.4767 22.4684 27.6912 22.6186 28.1202C23.0904 29.6646 24.5275 30.4367 26.9299 30.4367C28.2383 30.4367 29.2678 30.1364 30.0186 29.5359C30.7693 28.9138 31.1446 28.0344 31.1446 26.8976C31.1446 24.7527 29.8041 23.6802 27.1229 23.6802H23.809C23.573 23.6802 23.38 23.6051 23.2299 23.455C23.0797 23.3049 23.0046 23.1225 23.0046 22.908V21.5567C23.0046 21.2135 23.1548 20.8918 23.4551 20.5915L29.2142 14.9611H20.0125C19.798 14.9611 19.6157 14.886 19.4655 14.7359C19.3154 14.5857 19.2403 14.4034 19.2403 14.1889V12.0654C19.2403 11.8295 19.3046 11.6364 19.4333 11.4863C19.5835 11.3362 19.7765 11.2611 20.0125 11.2611H33.8151C34.051 11.2611 34.2441 11.3362 34.3942 11.4863C34.5444 11.6364 34.6194 11.8295 34.6194 12.0654V13.9959C34.6194 14.3176 34.48 14.6179 34.2012 14.8967L28.6351 20.6237L29.0212 20.6559C31.0803 20.8275 32.7104 21.4495 33.9116 22.522C35.1342 23.5944 35.7455 25.128 35.7455 27.1228C35.7455 28.5385 35.3594 29.7718 34.5872 30.8228C33.8365 31.8738 32.7855 32.6889 31.4342 33.268C30.1044 33.8257 28.5922 34.1046 26.8977 34.1046Z" fill="#16C62E"/>
<path d="M39.3774 33.7828C39.1629 33.7828 38.9806 33.7078 38.8304 33.5576C38.6803 33.4075 38.6052 33.2251 38.6052 33.0107V31.3698C38.6052 30.7906 38.8733 30.2866 39.4096 29.8576L44.493 24.8063C46.7023 23.0689 48.2359 21.7176 49.0939 20.7524C49.9733 19.7657 50.413 18.8005 50.413 17.8567C50.413 16.8486 50.1342 16.055 49.5765 15.4759C49.0403 14.8967 48.2252 14.6072 47.1313 14.6072C46.0588 14.6072 45.2116 14.9289 44.5896 15.5724C43.9675 16.1944 43.5814 17.0095 43.4313 18.0176C43.367 18.275 43.249 18.468 43.0774 18.5967C42.9058 18.704 42.7128 18.7576 42.4983 18.7576H39.6348C39.4417 18.7576 39.2809 18.6933 39.1522 18.5646C39.0235 18.4359 38.9591 18.2857 38.9591 18.1141C39.002 16.8486 39.3452 15.6689 39.9887 14.575C40.6322 13.4596 41.5652 12.5695 42.7878 11.9046C44.0104 11.2182 45.4475 10.875 47.0991 10.875C48.8151 10.875 50.2629 11.1753 51.4426 11.7759C52.6438 12.355 53.5446 13.1593 54.1452 14.1889C54.7458 15.2185 55.0461 16.3875 55.0461 17.6959C55.0461 19.133 54.6386 20.4307 53.8235 21.5889C53.0299 22.7472 51.8072 23.9912 50.1557 25.3211L45.587 29.9541H54.7565C54.9925 29.9541 55.1748 30.0292 55.3035 30.1793C55.4536 30.308 55.5287 30.4904 55.5287 30.7263V33.0107C55.5287 33.2251 55.4536 33.4075 55.3035 33.5576C55.1748 33.7078 54.9925 33.7828 54.7565 33.7828H39.3774Z" fill="#16C62E"/>
</g>
<defs>
<clipPath id="clip0">
<rect width="74" height="74" fill="white"/>
</clipPath>
</defs>
</svg>
