<svg width="85" height="160" viewBox="0 0 85 160" fill="none" xmlns="http://www.w3.org/2000/svg">
<g opacity="0.1">
<path d="M11.667 13.334V26.6673C40.9337 30.2673 61.667 56.8673 58.067 86.134C56.5954 97.9272 51.2336 108.893 42.8298 117.297C34.4261 125.701 23.4602 131.062 11.667 132.534V145.867C48.3337 141.867 74.667 108.934 70.667 72.334C67.2003 41.2673 42.7337 16.6673 11.667 13.334ZM-1.66634 13.334C-14.733 14.534 -27.0663 19.6673 -37.1997 28.0007L-27.6663 38.2673C-20.1997 32.2673 -11.1997 28.4007 -1.66634 27.0673V13.734V13.334ZM-46.5997 37.8007C-54.9618 47.9003 -60.095 60.2804 -61.333 73.334H-47.9997C-46.733 63.8673 -42.9997 54.8673 -37.0663 47.334L-46.5997 37.8007ZM-61.2663 86.6673C-59.933 99.734 -54.7997 112.067 -46.533 122.201L-37.0663 112.667C-42.9535 105.131 -46.7066 96.1513 -47.933 86.6673H-61.2663ZM-27.933 122.467L-37.1997 131.601C-27.1011 140.019 -14.7379 145.261 -1.66634 146.667V133.334C-11.1503 132.108 -20.1303 128.354 -27.6663 122.467H-27.933Z" fill="#7319D5"/>
<path d="M6.92 75.6C-2.16 73.24 -5.08 70.8 -5.08 67C-5.08 62.64 -1.04 59.6 5.72 59.6C12.84 59.6 15.48 63 15.72 68H24.56C24.28 61.12 20.08 54.8 11.72 52.76V44H-0.280001V52.64C-8.04 54.32 -14.28 59.36 -14.28 67.08C-14.28 76.32 -6.64 80.92 4.52 83.6C14.52 86 16.52 89.52 16.52 93.24C16.52 96 14.56 100.4 5.72 100.4C-2.52 100.4 -5.76 96.72 -6.2 92H-15C-14.52 100.76 -7.96 105.68 -0.280001 107.32V116H11.72V107.4C19.52 105.92 25.72 101.4 25.72 93.2C25.72 81.84 16 77.96 6.92 75.6Z" fill="#4A148C"/>
</g>
</svg>
