<svg width="40" height="40" viewBox="0 0 40 40" fill="none" xmlns="http://www.w3.org/2000/svg">
<path d="M37.2111 29.2C37.1329 28.9229 36.9502 28.6869 36.7015 28.5418C36.4528 28.3967 36.1574 28.3538 35.8777 28.4222L33.1111 29.1667C34.625 26.935 35.543 24.3532 35.7777 21.6667C36.0047 19.1532 35.6372 16.6216 34.7049 14.2765C33.7726 11.9313 32.3017 9.83832 30.4111 8.16667C30.1925 7.98591 29.9131 7.89557 29.6301 7.91416C29.3471 7.93275 29.0819 8.05887 28.8888 8.26667C28.6946 8.4878 28.5961 8.77696 28.6148 9.07069C28.6336 9.36441 28.7681 9.63869 28.9888 9.83334C30.618 11.2714 31.8854 13.073 32.6885 15.0922C33.4916 17.1114 33.8076 19.2914 33.6111 21.4556C33.4207 23.735 32.6562 25.9292 31.3888 27.8333L31.1111 25.0444C31.132 24.8803 31.116 24.7136 31.0643 24.5564C31.0126 24.3992 30.9264 24.2556 30.8121 24.136C30.6977 24.0164 30.5581 23.9238 30.4035 23.8651C30.2488 23.8063 30.0829 23.7829 29.918 23.7964C29.7531 23.8099 29.5933 23.8601 29.4503 23.9433C29.3073 24.0265 29.1846 24.1406 29.0913 24.2772C28.998 24.4138 28.9364 24.5696 28.911 24.7331C28.8855 24.8966 28.897 25.0637 28.9444 25.2222L29.4999 32.3778L36.4444 30.5333C36.7195 30.4529 36.9528 30.2692 37.0957 30.0208C37.2386 29.7723 37.2799 29.4782 37.2111 29.2Z" fill="#7319D5"/>
<path d="M4.78891 18.9778C4.93659 19.0727 5.10363 19.1335 5.2778 19.1556C5.56778 19.1936 5.86106 19.1158 6.09403 18.939C6.327 18.7622 6.48086 18.5006 6.52225 18.2111C6.98136 14.8213 8.70409 11.73 11.3455 9.55633C13.9868 7.38265 17.3519 6.28704 20.7667 6.48889L18.2778 8.18889C18.1017 8.32156 17.9691 8.50362 17.8967 8.7119C17.8244 8.92018 17.8157 9.14527 17.8717 9.35853C17.9277 9.57178 18.0459 9.76355 18.2112 9.90944C18.3765 10.0553 18.5815 10.1487 18.8 10.1778C19.0503 10.2007 19.301 10.138 19.5111 10L25.4334 5.93333L20.3667 0.844445C20.2765 0.706291 20.1567 0.589948 20.016 0.503861C19.8753 0.417775 19.7171 0.364106 19.5531 0.34675C19.389 0.329394 19.2232 0.348788 19.0676 0.403522C18.9119 0.458257 18.7704 0.54696 18.6534 0.66319C18.5363 0.77942 18.4466 0.920261 18.3907 1.07549C18.3349 1.23071 18.3143 1.39643 18.3304 1.56061C18.3466 1.72478 18.3991 1.8833 18.4842 2.02465C18.5693 2.16599 18.6847 2.28662 18.8222 2.37778L20.7111 4.26667C16.7676 4.07811 12.8967 5.37485 9.86256 7.9009C6.82842 10.4269 4.85156 13.9987 4.32225 17.9111C4.29376 18.1147 4.3223 18.3221 4.40468 18.5105C4.48707 18.6988 4.62008 18.8605 4.78891 18.9778Z" fill="#7319D5"/>
<path d="M24.1445 33.2556C22.4094 33.8098 20.5792 34.0026 18.7667 33.8222C16.5594 33.6059 14.4378 32.8555 12.5852 31.6359C10.7327 30.4164 9.20475 28.7643 8.1334 26.8222L10.9001 27.8556C11.1551 27.8998 11.4176 27.8536 11.6422 27.725C11.8668 27.5963 12.0394 27.3933 12.1303 27.1509C12.2212 26.9086 12.2246 26.6421 12.14 26.3975C12.0553 26.1529 11.888 25.9455 11.6667 25.8111L6.56673 23.9222L4.9334 23.3333L3.70006 30.3889C3.65731 30.6708 3.72459 30.9584 3.88798 31.1921C4.05137 31.4258 4.29836 31.5878 4.57784 31.6444H4.76673C5.02824 31.6492 5.28305 31.5615 5.48629 31.3969C5.68954 31.2323 5.82819 31.0012 5.87784 30.7444L6.34451 28.0778C7.6012 30.2792 9.36637 32.148 11.4926 33.5281C13.6188 34.9082 16.0444 35.7596 18.5667 36.0111C20.6756 36.2201 22.8049 35.9932 24.8223 35.3444C25.0792 35.2381 25.2868 35.0393 25.4043 34.7873C25.5217 34.5353 25.5405 34.2484 25.4567 33.9833C25.373 33.7182 25.1929 33.4941 24.9521 33.3552C24.7112 33.2164 24.427 33.1729 24.1556 33.2333L24.1445 33.2556Z" fill="#7319D5"/>
<path d="M24.4443 14.4444H15.5554C15.2608 14.4444 14.9781 14.5615 14.7698 14.7699C14.5614 14.9783 14.4443 15.2609 14.4443 15.5556V24.4444C14.4443 24.7391 14.5614 25.0217 14.7698 25.2301C14.9781 25.4385 15.2608 25.5556 15.5554 25.5556H24.4443C24.739 25.5556 25.0216 25.4385 25.23 25.2301C25.4384 25.0217 25.5554 24.7391 25.5554 24.4444V15.5556C25.5554 15.2609 25.4384 14.9783 25.23 14.7699C25.0216 14.5615 24.739 14.4444 24.4443 14.4444ZM23.3332 23.3333H16.6666V16.6667H23.3332V23.3333Z" fill="#7319D5"/>
</svg>
