module phx-grpc-gateway

go 1.20

require (
	github.com/grpc-ecosystem/grpc-gateway/v2 v2.6.0
	google.golang.org/grpc v1.57.0
	google.golang.org/protobuf v1.30.0
)

require (
	github.com/golang/protobuf v1.5.3 // indirect
	golang.org/x/net v0.9.0 // indirect
	golang.org/x/sys v0.7.0 // indirect
	golang.org/x/text v0.9.0 // indirect
	google.golang.org/genproto v0.0.0-20230526161137-0005af68ea54 // indirect
	google.golang.org/genproto/googleapis/api v0.0.0-20230525234035-dd9d682886f9 // indirect
	google.golang.org/genproto/googleapis/rpc v0.0.0-20230525234030-28d5490b6b19 // indirect
)
