{
    "publisherSetup": {
        "common": {
            "gameId": "spaceSpeed",
            "gameVersion": "0.1.1",
            "defaultLocale": "autodetect",
            "customData": {},
            "gameCustom": {
                "splashDuration": 0
            }
        },
        "dummy": {
            "publisher": "dummy",
            "gameCustom": {
                "splashDuration": 0
            }
        }
    }
}