{
	"id": "2d7d05a8-4087-825b-c8f2-1fb09cd3b6c4",
	"name": "Keycloak",
	"requests": [
		{
			"id": "9d6f6085-d0e4-918c-8232-5089f78e89ec",
			"headers": "Content-Type: application/x-www-form-urlencoded\n",
			"headerData": [
				{
					"key": "Content-Type",
					"value": "application/x-www-form-urlencoded",
					"description": "",
					"enabled": true
				}
			],
			"url": "https://dev.vosima.scs-luettgen.com:8444/auth/realms/Vosima/protocol/openid-connect/token",
			"queryParams": [],
			"pathVariables": {},
			"pathVariableData": [],
			"preRequestScript": null,
			"method": "POST",
			"collectionId": "2d7d05a8-4087-825b-c8f2-1fb09cd3b6c4",
			"data": [
				{
					"key": "grant_type",
					"value": "password",
					"description": "",
					"type": "text",
					"enabled": true
				},
				{
					"key": "client_id",
					"value": "Vosima-Frontend",
					"description": "",
					"type": "text",
					"enabled": true
				},
				{
					"key": "username",
					"value": "test",
					"description": "",
					"type": "text",
					"enabled": true
				},
				{
					"key": "password",
					"value": "test",
					"description": "",
					"type": "text",
					"enabled": true
				}
			],
			"dataMode": "urlencoded",
			"name": "https://dev.vosima.scs-luettgen.com:8444/auth/realms/Vosima/protocol/openid-connect/token",
			"description": "",
			"descriptionFormat": "html",
			"time": 1594644579971,
			"version": 2,
			"responses": [],
			"tests": null,
			"currentHelper": "normal",
			"helperAttributes": {}
		}
	],
	"order": [
		"9d6f6085-d0e4-918c-8232-5089f78e89ec"
	],
	"timestamp": 1594644579972
}