bug_id,bug_fix_time,long_lived,y_hat
4DIAC-489747,139,Y,N
4DIAC-495630,38,Y,Y
4DIAC-500078,38,Y,Y
4DIAC-511266,0,N,N
4DIAC-518907,200,Y,N
4DIAC-521219,145,Y,Y
ACCELEO-316773,485,Y,Y
ACCELEO-325351,203,Y,Y
ACCELEO-340094,281,Y,N
ACCELEO-341873,0,N,Y
ACCELEO-353559,7,Y,Y
ACCELEO-362686,169,Y,Y
ACCELEO-502865,60,Y,Y
ACCELEO-510922,149,Y,N
ACTF-218022,62,Y,N
ACTF-240727,3,Y,N
ACTF-260379,77,Y,N
AJDT-279974,29,Y,Y
AJDT-288020,4,Y,Y
AJDT-317646,0,N,Y
AJDT-360093,32,Y,Y
AJDT-59869,108,Y,N
AJDT-72338,11,Y,Y
AMP-307310,2,Y,Y
AMP-340768,37,Y,Y
ASPECTJ-100195,112,Y,Y
ASPECTJ-108370,1,N,N
ASPECTJ-108892,59,Y,Y
ASPECTJ-121575,57,Y,N
ASPECTJ-132087,28,Y,Y
ASPECTJ-152257,3,Y,Y
ASPECTJ-164633,6,Y,N
ASPECTJ-166347,630,Y,Y
ASPECTJ-238542,4,Y,Y
ASPECTJ-258629,50,Y,N
ASPECTJ-325731,799,Y,N
ASPECTJ-333123,44,Y,Y
ASPECTJ-339300,13,Y,Y
ASPECTJ-71159,397,Y,N
ASPECTJ-83807,110,Y,N
ASPECTJ-90827,61,Y,Y
ATF-143302,1,N,N
ATF-151461,14,Y,Y
ATF-288661,5,Y,N
ATF-298833,0,N,Y
BABEL-220504,0,N,Y
BABEL-221503,1,N,Y
BABEL-226394,94,Y,N
BABEL-232682,4,Y,Y
BABEL-235607,2918,Y,Y
BABEL-242075,3,Y,Y
BABEL-245500,63,Y,Y
BIRT-101450,178,Y,Y
BIRT-101970,1,N,Y
BIRT-103438,4,Y,Y
BIRT-105120,20,Y,Y
BIRT-105311,15,Y,Y
BIRT-108231,0,N,Y
BIRT-109327,7,Y,Y
BIRT-109701,0,N,N
BIRT-113939,5,Y,Y
BIRT-115280,2,Y,Y
BIRT-115424,1,N,Y
BIRT-116768,2,Y,N
BIRT-117431,1,N,Y
BIRT-117437,0,N,Y
BIRT-117650,0,N,N
BIRT-118391,7,Y,Y
BIRT-118743,2,Y,Y
BIRT-121109,8,Y,Y
BIRT-122086,1,N,Y
BIRT-123386,0,N,N
BIRT-127972,47,Y,Y
BIRT-128338,4,Y,Y
BIRT-129744,0,N,N
BIRT-130273,0,N,N
BIRT-131308,38,Y,N
BIRT-131339,404,Y,Y
BIRT-133975,1,N,N
BIRT-134219,6,Y,Y
BIRT-134944,1,N,Y
BIRT-134949,2,Y,Y
BIRT-135189,6,Y,Y
BIRT-135467,0,N,Y
BIRT-135786,18,Y,Y
BIRT-136279,1,N,Y
BIRT-136595,14,Y,Y
BIRT-136966,4,Y,Y
BIRT-137912,8,Y,N
BIRT-139347,0,N,N
BIRT-140969,14,Y,Y
BIRT-144184,8,Y,Y
BIRT-145011,1,N,Y
BIRT-145508,6,Y,Y
BIRT-146371,1,N,N
BIRT-147894,7,Y,N
BIRT-150857,38,Y,Y
BIRT-151385,5,Y,N
BIRT-153231,9,Y,Y
BIRT-153412,3,Y,Y
BIRT-153723,4,Y,N
BIRT-155186,54,Y,Y
BIRT-155348,0,N,Y
BIRT-155928,0,N,N
BIRT-160806,0,N,N
BIRT-162719,3,Y,N
BIRT-163921,13,Y,Y
BIRT-164273,10,Y,Y
BIRT-165275,7,Y,Y
BIRT-165607,0,N,Y
BIRT-166631,2,Y,N
BIRT-168383,1,N,Y
BIRT-168637,22,Y,Y
BIRT-169420,4,Y,Y
BIRT-169646,1361,Y,Y
BIRT-173241,20,Y,Y
BIRT-175347,32,Y,Y
BIRT-176436,67,Y,Y
BIRT-177722,0,N,Y
BIRT-178519,30,Y,N
BIRT-179250,2,Y,Y
BIRT-180025,137,Y,Y
BIRT-180893,34,Y,Y
BIRT-181749,15,Y,Y
BIRT-182279,31,Y,Y
BIRT-182668,0,N,N
BIRT-183268,6,Y,Y
BIRT-184401,1,N,Y
BIRT-185903,1,N,Y
BIRT-187501,5,Y,Y
BIRT-189860,1,N,Y
BIRT-192062,7,Y,Y
BIRT-192501,352,Y,Y
BIRT-193258,0,N,Y
BIRT-195485,1,N,Y
BIRT-195929,1,N,N
BIRT-196098,8,Y,Y
BIRT-197548,0,N,Y
BIRT-198173,124,Y,Y
BIRT-199010,8,Y,Y
BIRT-199978,1,N,Y
BIRT-200788,5,Y,N
BIRT-201852,3,Y,Y
BIRT-202896,2,Y,N
BIRT-203196,1,N,Y
BIRT-209124,6,Y,Y
BIRT-209127,24,Y,Y
BIRT-209769,0,N,Y
BIRT-212499,1,N,Y
BIRT-213897,1,N,Y
BIRT-214043,3,Y,Y
BIRT-215928,33,Y,Y
BIRT-216089,28,Y,Y
BIRT-216381,27,Y,Y
BIRT-219131,12,Y,Y
BIRT-220800,18,Y,Y
BIRT-220895,3,Y,N
BIRT-223160,2,Y,N
BIRT-223598,1,N,Y
BIRT-223782,3,Y,Y
BIRT-226647,10,Y,Y
BIRT-227292,6,Y,Y
BIRT-229747,35,Y,N
BIRT-230102,3,Y,Y
BIRT-232640,16,Y,Y
BIRT-232966,206,Y,Y
BIRT-235539,7,Y,Y
BIRT-235991,0,N,Y
BIRT-239597,18,Y,Y
BIRT-244114,8,Y,N
BIRT-254815,198,Y,Y
BIRT-258787,2,Y,Y
BIRT-258898,15,Y,Y
BIRT-260808,6,Y,Y
BIRT-261440,0,N,N
BIRT-267320,13,Y,Y
BIRT-270189,404,Y,Y
BIRT-271591,5,Y,Y
BIRT-271725,0,N,N
BIRT-275793,7,Y,Y
BIRT-276408,0,N,N
BIRT-277271,0,N,Y
BIRT-281045,2,Y,Y
BIRT-287534,6,Y,Y
BIRT-291210,44,Y,Y
BIRT-293532,0,N,Y
BIRT-293754,14,Y,Y
BIRT-294225,6,Y,Y
BIRT-298628,146,Y,Y
BIRT-299515,104,Y,Y
BIRT-303035,77,Y,Y
BIRT-304328,56,Y,Y
BIRT-307483,7,Y,Y
BIRT-341425,1,N,Y
BIRT-344308,11,Y,Y
BIRT-385316,97,Y,Y
BIRT-489572,31,Y,N
BIRT-83104,7,Y,Y
BPEL-324162,0,N,Y
BPEL-325808,112,Y,Y
BPEL-376349,0,N,Y
BPMN2MODELER-355664,190,Y,Y
BPMN2MODELER-374808,0,N,Y
BPMN2MODELER-375884,11,Y,Y
BPMN2MODELER-376723,3,Y,Y
BPMN2MODELER-397474,0,N,N
BPMN2MODELER-461855,0,N,Y
BUILDSHIP-473389,0,N,N
BUILDSHIP-475576,5,Y,N
BUILDSHIP-490192,0,N,Y
CBI-296785,583,Y,N
CBI-300784,116,Y,Y
CBI-395832,33,Y,N
CBI-487877,35,Y,Y
CBI-506726,20,Y,Y
CDT-102429,4,Y,Y
CDT-10283,91,Y,N
CDT-103579,681,Y,Y
CDT-103844,642,Y,N
CDT-107150,15,Y,Y
CDT-107787,0,N,Y
CDT-117029,735,Y,Y
CDT-133981,30,Y,Y
CDT-144140,82,Y,Y
CDT-151840,132,Y,Y
CDT-152041,264,Y,Y
CDT-165638,71,Y,Y
CDT-169777,157,Y,Y
CDT-175759,76,Y,Y
CDT-179169,3,Y,N
CDT-182946,527,Y,Y
CDT-185710,1,N,Y
CDT-187526,0,N,Y
CDT-215081,118,Y,Y
CDT-216760,2,Y,Y
CDT-217680,1,N,Y
CDT-218847,433,Y,N
CDT-220989,5,Y,N
CDT-221635,0,N,Y
CDT-221853,4,Y,Y
CDT-222026,0,N,Y
CDT-225272,2,Y,N
CDT-228703,680,Y,Y
CDT-238225,269,Y,Y
CDT-245297,1,N,Y
CDT-247416,115,Y,Y
CDT-251972,475,Y,Y
CDT-255192,34,Y,N
CDT-256311,533,Y,N
CDT-256798,106,Y,N
CDT-258768,1,N,N
CDT-266632,2,Y,N
CDT-268254,1,N,N
CDT-268359,1,N,N
CDT-270916,231,Y,Y
CDT-274184,20,Y,N
CDT-275188,0,N,Y
CDT-275773,18,Y,Y
CDT-277001,0,N,N
CDT-279740,363,Y,Y
CDT-280770,7,Y,Y
CDT-281783,4,Y,Y
CDT-289742,5,Y,Y
CDT-292468,85,Y,N
CDT-295168,4,Y,Y
CDT-298314,175,Y,Y
CDT-303095,2,Y,Y
CDT-312133,0,N,Y
CDT-322051,1,N,N
CDT-322309,1,N,N
CDT-323276,0,N,Y
CDT-325669,1,N,Y
CDT-327710,4,Y,Y
CDT-329196,2,Y,Y
CDT-332114,2223,Y,Y
CDT-337893,48,Y,Y
CDT-339305,14,Y,Y
CDT-339463,12,Y,N
CDT-342141,7,Y,Y
CDT-342683,2,Y,Y
CDT-346559,38,Y,Y
CDT-353735,27,Y,Y
CDT-36695,2,Y,Y
CDT-36699,6,Y,N
CDT-368597,111,Y,Y
CDT-375760,0,N,Y
CDT-378578,5,Y,Y
CDT-378981,2,Y,Y
CDT-39552,19,Y,Y
CDT-397828,26,Y,Y
CDT-40108,210,Y,Y
CDT-405643,35,Y,Y
CDT-409697,1,N,N
CDT-416658,265,Y,Y
CDT-43063,417,Y,Y
CDT-434150,0,N,Y
CDT-434558,209,Y,Y
CDT-436909,2,Y,N
CDT-44307,2,Y,Y
CDT-44335,181,Y,Y
CDT-44892,5,Y,Y
CDT-455797,731,Y,Y
CDT-457503,2,Y,Y
CDT-459197,825,Y,Y
CDT-485075,153,Y,Y
CDT-488506,0,N,Y
CDT-506529,0,N,Y
CDT-509320,19,Y,N
CDT-511274,7,Y,Y
CDT-516338,42,Y,Y
CDT-64181,336,Y,Y
CDT-65564,0,N,Y
CDT-67009,142,Y,N
CDT-67680,1,N,Y
CDT-69756,43,Y,Y
CDT-70137,363,Y,Y
CDT-70450,27,Y,N
CDT-72787,21,Y,N
CDT-72804,87,Y,Y
CDT-72818,12,Y,N
CDT-73191,5,Y,Y
CDT-73250,0,N,Y
CDT-73583,266,Y,Y
CDT-75532,11,Y,Y
CDT-77276,21,Y,Y
CDT-77379,4,Y,Y
CDT-78889,1290,Y,Y
CDT-84625,80,Y,N
CDT-87546,0,N,N
CDT-87629,21,Y,Y
CDT-92453,3,Y,Y
CDT-92735,57,Y,Y
CDT-95461,0,N,N
CDT-95641,2,Y,Y
CDT-99233,12,Y,Y
CFT-485697,0,N,N
COMMUNITY-126140,241,Y,Y
COMMUNITY-138600,446,Y,Y
COMMUNITY-147754,76,Y,Y
COMMUNITY-148793,9,Y,Y
COMMUNITY-151750,2,Y,Y
COMMUNITY-165799,0,N,N
COMMUNITY-170013,1,N,N
COMMUNITY-180787,0,N,Y
COMMUNITY-187082,3,Y,Y
COMMUNITY-192782,8,Y,Y
COMMUNITY-196849,308,Y,N
COMMUNITY-197979,11,Y,Y
COMMUNITY-221664,609,Y,Y
COMMUNITY-226480,48,Y,Y
COMMUNITY-228753,1,N,N
COMMUNITY-229985,15,Y,Y
COMMUNITY-256648,42,Y,N
COMMUNITY-256861,0,N,N
COMMUNITY-259610,97,Y,Y
COMMUNITY-261365,937,Y,N
COMMUNITY-262127,46,Y,Y
COMMUNITY-262780,0,N,N
COMMUNITY-266322,5,Y,Y
COMMUNITY-270659,24,Y,Y
COMMUNITY-270854,1990,Y,Y
COMMUNITY-271164,158,Y,Y
COMMUNITY-272840,1,N,Y
COMMUNITY-273110,20,Y,N
COMMUNITY-289597,0,N,N
COMMUNITY-294083,0,N,N
COMMUNITY-296365,0,N,N
COMMUNITY-296860,92,Y,Y
COMMUNITY-298419,0,N,Y
COMMUNITY-302076,2,Y,Y
COMMUNITY-308026,2,Y,N
COMMUNITY-309906,44,Y,Y
COMMUNITY-315561,4,Y,N
COMMUNITY-317630,0,N,Y
COMMUNITY-326508,0,N,Y
COMMUNITY-328049,0,N,N
COMMUNITY-335870,9,Y,Y
COMMUNITY-341355,0,N,N
COMMUNITY-345799,90,Y,Y
COMMUNITY-346515,0,N,N
COMMUNITY-346797,33,Y,Y
COMMUNITY-348097,7,Y,Y
COMMUNITY-351049,1,N,Y
COMMUNITY-364179,13,Y,N
COMMUNITY-366505,0,N,N
COMMUNITY-367561,8,Y,N
COMMUNITY-372704,2,Y,N
COMMUNITY-376631,140,Y,Y
COMMUNITY-384845,99,Y,N
COMMUNITY-389707,583,Y,Y
COMMUNITY-393943,1,N,N
COMMUNITY-395046,0,N,N
COMMUNITY-400584,8,Y,Y
COMMUNITY-401977,0,N,Y
COMMUNITY-403702,1,N,N
COMMUNITY-404898,147,Y,Y
COMMUNITY-409964,1,N,Y
COMMUNITY-413409,1,N,N
COMMUNITY-416407,0,N,Y
COMMUNITY-422498,2,Y,N
COMMUNITY-423788,532,Y,N
COMMUNITY-429528,0,N,N
COMMUNITY-431165,0,N,N
COMMUNITY-432332,22,Y,Y
COMMUNITY-433975,24,Y,N
COMMUNITY-435437,13,Y,Y
COMMUNITY-435787,16,Y,Y
COMMUNITY-436870,0,N,N
COMMUNITY-438016,0,N,N
COMMUNITY-440313,139,Y,Y
COMMUNITY-441724,1,N,N
COMMUNITY-442857,938,Y,N
COMMUNITY-445050,180,Y,Y
COMMUNITY-447685,4,Y,N
COMMUNITY-460463,1277,Y,Y
COMMUNITY-466736,0,N,N
COMMUNITY-468044,19,Y,Y
COMMUNITY-473129,0,N,Y
COMMUNITY-475201,80,Y,N
COMMUNITY-476257,16,Y,Y
COMMUNITY-479373,1,N,N
COMMUNITY-483974,1,N,N
COMMUNITY-486391,104,Y,N
COMMUNITY-486916,1,N,Y
COMMUNITY-487992,0,N,N
COMMUNITY-488656,724,Y,N
COMMUNITY-490541,225,Y,N
COMMUNITY-494458,8,Y,Y
COMMUNITY-494463,8,Y,Y
COMMUNITY-497515,5,Y,Y
COMMUNITY-497915,22,Y,N
COMMUNITY-499926,5,Y,Y
COMMUNITY-502591,96,Y,Y
COMMUNITY-507135,0,N,Y
COMMUNITY-507160,7,Y,Y
COMMUNITY-507985,84,Y,Y
COMMUNITY-510201,48,Y,Y
COMMUNITY-510517,16,Y,Y
COMMUNITY-510571,15,Y,Y
COMMUNITY-510674,0,N,N
COMMUNITY-513552,525,Y,N
COMMUNITY-515916,0,N,Y
COMMUNITY-517097,16,Y,Y
COMMUNITY-517965,190,Y,Y
COMMUNITY-518284,20,Y,Y
COMMUNITY-518466,0,N,Y
COMMUNITY-519972,1,N,Y
COMMUNITY-521846,1,N,N
COMMUNITY-521967,1,N,N
COMMUNITY-526125,0,N,N
COMMUNITY-527074,25,Y,N
COMMUNITY-527798,0,N,Y
COMMUNITY-528802,0,N,N
COMMUNITY-529093,152,Y,Y
COMMUNITY-529550,9,Y,N
COMMUNITY-529724,7,Y,N
COMMUNITY-529732,6,Y,Y
COMMUNITY-78617,51,Y,N
DALI_JPA_TOOLS-149101,280,Y,N
DALI_JPA_TOOLS-185224,9,Y,N
DALI_JPA_TOOLS-225332,153,Y,Y
DALI_JPA_TOOLS-240945,7,Y,Y
DALI_JPA_TOOLS-245244,7,Y,Y
DALI_JPA_TOOLS-261664,287,Y,Y
DALI_JPA_TOOLS-266300,53,Y,N
DALI_JPA_TOOLS-273481,7,Y,Y
DALI_JPA_TOOLS-317230,320,Y,Y
DALI_JPA_TOOLS-322372,1,N,Y
DALI_JPA_TOOLS-334134,20,Y,Y
DALI_JPA_TOOLS-374370,6,Y,N
DALI_JPA_TOOLS-387484,14,Y,Y
DATA_TOOLS-127558,0,N,Y
DATA_TOOLS-130357,7,Y,N
DATA_TOOLS-131117,4,Y,Y
DATA_TOOLS-131912,26,Y,Y
DATA_TOOLS-139625,3,Y,Y
DATA_TOOLS-141436,11,Y,Y
DATA_TOOLS-157925,44,Y,N
DATA_TOOLS-159961,536,Y,N
DATA_TOOLS-162280,14,Y,N
DATA_TOOLS-163007,20,Y,N
DATA_TOOLS-164546,8,Y,N
DATA_TOOLS-168974,439,Y,Y
DATA_TOOLS-191643,7,Y,Y
DATA_TOOLS-198769,0,N,N
DATA_TOOLS-200648,1,N,N
DATA_TOOLS-208284,0,N,Y
DATA_TOOLS-210036,78,Y,N
DATA_TOOLS-211428,139,Y,Y
DATA_TOOLS-217690,301,Y,N
DATA_TOOLS-220673,1,N,Y
DATA_TOOLS-233085,14,Y,N
DATA_TOOLS-239570,75,Y,Y
DATA_TOOLS-240547,3,Y,Y
DATA_TOOLS-241389,32,Y,Y
DATA_TOOLS-253158,39,Y,Y
DATA_TOOLS-255471,114,Y,Y
DATA_TOOLS-255741,0,N,N
DATA_TOOLS-263704,1,N,Y
DATA_TOOLS-286676,0,N,N
DATA_TOOLS-417766,1,N,Y
DIRIGIBLE-472271,0,N,N
DIRIGIBLE-486730,6,Y,Y
DIRIGIBLE-495669,16,Y,N
DIRIGIBLE-498961,0,N,Y
DIRIGIBLE-509725,0,N,Y
DLTK-221174,431,Y,Y
DLTK-288273,0,N,Y
DLTK-343062,0,N,N
DLTK-352856,0,N,Y
DLTK-371222,1585,Y,Y
DLTK-489080,32,Y,Y
E4-264284,0,N,Y
E4-265171,489,Y,Y
E4-271147,0,N,N
E4-273163,0,N,Y
E4-280358,0,N,N
E4-283631,2,Y,N
E4-294743,0,N,Y
E4-295007,203,Y,Y
E4-298623,16,Y,N
E4-299083,6,Y,Y
E4-301193,4,Y,Y
E4-304937,941,Y,Y
E4-305852,0,N,N
E4-316600,0,N,Y
E4-316783,7,Y,N
E4-316792,7,Y,N
E4-316797,0,N,Y
E4-317702,0,N,N
E4-318143,0,N,N
E4-318236,0,N,Y
E4-330116,2893,Y,Y
E4-352787,33,Y,N
E4-394247,5,Y,Y
E4-395750,128,Y,Y
E4-396130,3,Y,Y
E4-433662,46,Y,N
E4-438591,38,Y,Y
E4-457323,69,Y,Y
E4-461865,6,Y,Y
E4-519197,162,Y,N
EASE-462963,1,N,N
EASE-477027,0,N,Y
EASE-526888,0,N,N
ECF-194237,0,N,N
ECF-232047,1,N,N
ECF-321662,0,N,Y
ECF-341719,0,N,Y
ECLIPSELINK-217168,77,Y,Y
ECLIPSELINK-217834,34,Y,Y
ECLIPSELINK-218671,7,Y,Y
ECLIPSELINK-222699,6,Y,Y
ECLIPSELINK-248142,46,Y,Y
ECLIPSELINK-249948,401,Y,N
ECLIPSELINK-260554,7,Y,Y
ECLIPSELINK-260905,1483,Y,Y
ECLIPSELINK-261674,477,Y,Y
ECLIPSELINK-265755,74,Y,Y
ECLIPSELINK-267256,22,Y,Y
ECLIPSELINK-278775,0,N,N
ECLIPSELINK-279113,54,Y,Y
ECLIPSELINK-286971,2,Y,Y
ECLIPSELINK-295875,197,Y,Y
ECLIPSELINK-296289,7,Y,Y
ECLIPSELINK-297080,164,Y,N
ECLIPSELINK-298083,54,Y,N
ECLIPSELINK-299081,13,Y,Y
ECLIPSELINK-301266,187,Y,Y
ECLIPSELINK-303692,6,Y,Y
ECLIPSELINK-306081,9,Y,N
ECLIPSELINK-312952,3,Y,Y
ECLIPSELINK-313566,0,N,Y
ECLIPSELINK-320413,62,Y,N
ECLIPSELINK-326973,14,Y,N
ECLIPSELINK-332250,5,Y,Y
ECLIPSELINK-335464,1,N,Y
ECLIPSELINK-336192,6,Y,Y
ECLIPSELINK-337894,1,N,N
ECLIPSELINK-338837,5,Y,Y
ECLIPSELINK-338854,1,N,Y
ECLIPSELINK-340084,17,Y,N
ECLIPSELINK-355959,0,N,N
ECLIPSELINK-372179,107,Y,N
ECLIPSELINK-374302,21,Y,Y
ECLIPSELINK-380240,6,Y,N
ECLIPSELINK-389407,12,Y,Y
ECLIPSELINK-389818,0,N,N
ECLIPSELINK-398342,9,Y,Y
ECLIPSELINK-402385,7,Y,N
ECLIPSELINK-409993,0,N,Y
ECLIPSELINK-412407,6,Y,N
ECLIPSELINK-417431,0,N,Y
ECLIPSELINK-417723,0,N,Y
ECLIPSELINK-419072,0,N,Y
ECLIPSELINK-443762,57,Y,N
ECLIPSELINK-445913,0,N,N
ECLIPSELINK-458204,10,Y,N
ECLIPSELINK-464641,1,N,N
ECLIPSELINK-500145,2,Y,Y
ECLIPSELINK-501272,1,N,N
ECORETOOLS-212768,22,Y,Y
ECORETOOLS-350498,1080,Y,Y
ECORETOOLS-462144,9,Y,N
ECORETOOLS-479393,0,N,N
ECP-365288,54,Y,N
ECP-386273,101,Y,Y
ECP-422330,0,N,N
ECP-424534,46,Y,Y
ECP-435505,1,N,N
ECP-436544,1,N,N
ECP-468936,0,N,Y
ECP-518576,1,N,N
ECP-528480,248,Y,Y
EEF-302200,2278,Y,N
EEF-316721,1,N,Y
EEF-344478,11,Y,Y
EEF-371803,21,Y,Y
EEF-444113,739,Y,Y
EFXCLIPSE-411980,0,N,Y
EFXCLIPSE-426578,0,N,N
EFXCLIPSE-470353,0,N,N
EFXCLIPSE-491911,0,N,Y
EFXCLIPSE-498867,46,Y,Y
EGERRIT-489556,43,Y,Y
EGERRIT-490211,272,Y,Y
EGERRIT-493413,7,Y,Y
EGIT-291524,55,Y,N
EGIT-306787,534,Y,Y
EGIT-321292,0,N,N
EGIT-336921,959,Y,Y
EGIT-339838,249,Y,N
EGIT-347073,40,Y,Y
EGIT-357781,43,Y,N
EGIT-367937,305,Y,N
EGIT-381338,8,Y,N
EGIT-420535,13,Y,N
EGIT-422716,2,Y,Y
EGIT-432751,4,Y,N
EGIT-463676,44,Y,Y
EGIT-473647,62,Y,Y
EGIT-495777,89,Y,N
EGIT-499913,21,Y,Y
EGIT-512508,12,Y,N
EMF_SERVICES-231703,0,N,Y
EMF-242479,14,Y,N
EMF-243860,0,N,N
EMF-244604,7,Y,N
EMF-247382,3,Y,Y
EMF-253434,142,Y,Y
EMF-266297,21,Y,Y
EMF-289632,6,Y,N
EMF-318844,0,N,Y
EMF-324743,0,N,Y
EMF-358581,1,N,Y
EMF-363703,0,N,N
EMF-364904,0,N,N
EMF-389874,0,N,Y
EMF-417011,0,N,Y
EMF-427244,2,Y,Y
EMF-463627,13,Y,N
EMF.EGF-364341,0,N,Y
EMF.EGF-441715,201,Y,Y
EMF.PARSLEY-493143,1,N,N
EMFCOMPARE-195496,0,N,Y
EMFCOMPARE-246713,6,Y,Y
EMFCOMPARE-270439,0,N,Y
EMFCOMPARE-283582,51,Y,Y
EMFCOMPARE-324548,0,N,Y
EMFCOMPARE-391264,12,Y,Y
EMFCOMPARE-400424,200,Y,Y
EMFCOMPARE-410738,1,N,N
EMFCOMPARE-432014,5,Y,Y
EMFCOMPARE-439530,78,Y,N
EMFCOMPARE-443337,41,Y,Y
EMFCOMPARE-482404,0,N,Y
EMFCOMPARE-488941,117,Y,Y
EMFCOMPARE-516500,12,Y,Y
EMFSTORE-379662,27,Y,Y
EMFSTORE-412016,0,N,Y
EMFSTORE-428513,22,Y,Y
EMFSTORE-439111,24,Y,Y
EMFSTORE-501736,8,Y,Y
EMFSTORE-507854,9,Y,Y
EMFT-267487,9,Y,Y
EMFT.FACET-341192,0,N,N
EMFT.FACET-369509,9,Y,N
EMFT.FACET-379535,1,N,Y
EMFT.FACET-380160,0,N,Y
EMFT.FACET-419671,658,Y,N
EPF-134912,6,Y,Y
EPF-137632,120,Y,Y
EPF-140846,0,N,Y
EPF-140865,28,Y,Y
EPF-143187,79,Y,Y
EPF-143529,2,Y,N
EPF-143867,97,Y,Y
EPF-146731,3,Y,Y
EPF-146929,23,Y,Y
EPF-147552,32,Y,Y
EPF-150461,1,N,Y
EPF-151028,1,N,Y
EPF-151299,1,N,Y
EPF-156769,0,N,Y
EPF-158223,0,N,Y
EPF-160238,0,N,Y
EPF-162628,119,Y,N
EPF-166048,7,Y,Y
EPF-167924,50,Y,Y
EPF-173817,1,N,Y
EPF-175360,0,N,Y
EPF-176655,5,Y,Y
EPF-179905,99,Y,Y
EPF-185506,19,Y,Y
EPF-192448,8,Y,Y
EPF-230475,1,N,N
EPF-245084,17,Y,Y
EPF-266363,644,Y,Y
EPF-374011,52,Y,Y
EPF-461158,142,Y,Y
EPP-311610,37,Y,N
EPP-338762,461,Y,Y
EPP-463376,39,Y,N
EPP-468598,4,Y,Y
EPP-501262,17,Y,Y
EPSILON-319970,0,N,N
EPSILON-371197,0,N,N
EPSILON-371724,0,N,Y
EPSILON-493445,0,N,N
EQUINOX-121737,355,Y,Y
EQUINOX-123570,0,N,Y
EQUINOX-128531,741,Y,N
EQUINOX-132198,4,Y,Y
EQUINOX-146633,269,Y,Y
EQUINOX-159506,429,Y,N
EQUINOX-168425,1,N,Y
EQUINOX-169469,0,N,Y
EQUINOX-173436,33,Y,Y
EQUINOX-173745,5,Y,Y
EQUINOX-177357,0,N,N
EQUINOX-179907,166,Y,Y
EQUINOX-183032,1,N,Y
EQUINOX-185978,159,Y,Y
EQUINOX-188075,1,N,Y
EQUINOX-200429,25,Y,Y
EQUINOX-203009,140,Y,Y
EQUINOX-205270,0,N,Y
EQUINOX-207171,321,Y,Y
EQUINOX-212295,34,Y,Y
EQUINOX-216281,1,N,N
EQUINOX-216433,1,N,Y
EQUINOX-220426,8,Y,Y
EQUINOX-220656,0,N,N
EQUINOX-222129,38,Y,Y
EQUINOX-225201,2,Y,Y
EQUINOX-225843,0,N,Y
EQUINOX-227189,0,N,N
EQUINOX-227833,0,N,Y
EQUINOX-227856,2,Y,Y
EQUINOX-236740,251,Y,Y
EQUINOX-241282,603,Y,Y
EQUINOX-243242,373,Y,N
EQUINOX-257072,0,N,N
EQUINOX-259283,34,Y,Y
EQUINOX-263272,21,Y,Y
EQUINOX-264570,2,Y,Y
EQUINOX-272482,0,N,N
EQUINOX-272561,1,N,N
EQUINOX-273626,5,Y,Y
EQUINOX-274168,0,N,Y
EQUINOX-274445,0,N,N
EQUINOX-279325,195,Y,Y
EQUINOX-282303,285,Y,Y
EQUINOX-293862,31,Y,N
EQUINOX-299574,0,N,Y
EQUINOX-300513,0,N,N
EQUINOX-302114,0,N,N
EQUINOX-302762,0,N,N
EQUINOX-303143,0,N,Y
EQUINOX-308660,0,N,Y
EQUINOX-320029,0,N,Y
EQUINOX-323488,0,N,N
EQUINOX-332095,13,Y,Y
EQUINOX-340345,175,Y,N
EQUINOX-341051,77,Y,Y
EQUINOX-343551,19,Y,Y
EQUINOX-351083,7,Y,Y
EQUINOX-373282,71,Y,N
EQUINOX-375815,0,N,Y
EQUINOX-378165,0,N,Y
EQUINOX-395615,479,Y,N
EQUINOX-404835,0,N,Y
EQUINOX-41327,0,N,N
EQUINOX-414065,0,N,Y
EQUINOX-415622,0,N,N
EQUINOX-424151,45,Y,Y
EQUINOX-428221,3,Y,N
EQUINOX-428988,0,N,Y
EQUINOX-429670,1,N,Y
EQUINOX-431052,1,N,N
EQUINOX-448101,0,N,Y
EQUINOX-449465,3,Y,Y
EQUINOX-461862,0,N,N
EQUINOX-49929,0,N,N
EQUINOX-50577,12,Y,Y
EQUINOX-506939,0,N,N
EQUINOX-51410,92,Y,N
EQUINOX-529639,2,Y,Y
EQUINOX-530069,2,Y,N
ERCP-142130,0,N,N
ERCP-174269,19,Y,N
ERCP-213282,217,Y,Y
ERCP-254554,66,Y,Y
ERCP-296222,0,N,Y
ERCP-298305,8,Y,Y
ERCP-85057,24,Y,Y
GEF-109245,48,Y,Y
GEF-112589,0,N,N
GEF-22956,0,N,Y
GEF-254257,132,Y,Y
GEF-263290,32,Y,Y
GEF-303659,299,Y,Y
GEF-461421,5,Y,N
GEF-467528,49,Y,N
GEF-472886,1,N,Y
GEF-478901,238,Y,N
GEF-488358,23,Y,N
GEF-492935,1,N,Y
GEF-521158,0,N,Y
GEF-525304,0,N,Y
GEF-75096,199,Y,Y
GEF-79270,191,Y,Y
GEF-83350,0,N,N
GEMINI.MANAGEMENT-462159,9,Y,Y
GEMINI.WEB-319573,59,Y,Y
GEMINI.WEB-319955,6,Y,Y
GMF-RUNTIME-107880,68,Y,Y
GMF-RUNTIME-115826,40,Y,N
GMF-RUNTIME-115895,11,Y,Y
GMF-RUNTIME-116247,7,Y,Y
GMF-RUNTIME-124343,2,Y,N
GMF-RUNTIME-129178,14,Y,Y
GMF-RUNTIME-139602,0,N,Y
GMF-RUNTIME-140212,0,N,Y
GMF-RUNTIME-147312,33,Y,Y
GMF-RUNTIME-149315,13,Y,Y
GMF-RUNTIME-154982,20,Y,N
GMF-RUNTIME-198401,0,N,N
GMF-RUNTIME-206047,0,N,Y
GMF-RUNTIME-239648,3,Y,Y
GMF-RUNTIME-246924,0,N,Y
GMF-RUNTIME-302475,0,N,Y
GMF-RUNTIME-324694,2,Y,Y
GMF-RUNTIME-432387,6,Y,Y
GMF-TOOLING-118447,0,N,Y
GMF-TOOLING-122534,0,N,N
GMF-TOOLING-154683,2,Y,Y
GMF-TOOLING-171161,0,N,Y
GMF-TOOLING-174003,588,Y,Y
GMF-TOOLING-188383,20,Y,N
GMF-TOOLING-200527,53,Y,Y
GMF-TOOLING-232783,1,N,N
GMF-TOOLING-236415,24,Y,N
GMF-TOOLING-245525,1,N,Y
GMF-TOOLING-329465,277,Y,Y
GMF-TOOLING-380192,9,Y,N
GMF-TOOLING-403574,0,N,Y
GMP-155430,14,Y,Y
GMP-239665,3,Y,Y
GMP-286834,29,Y,Y
GMP-330997,213,Y,Y
GRAPHITI-323718,1,N,Y
GRAPHITI-440796,23,Y,Y
HANDLY-442065,1,N,Y
HUDSON-360449,0,N,Y
ICE-471749,21,Y,N
ICE-483617,8,Y,Y
JAVA_SERVER_FACES-159078,162,Y,Y
JAVA_SERVER_FACES-168468,1,N,N
JAVA_SERVER_FACES-182226,5,Y,N
JAVA_SERVER_FACES-189520,4,Y,Y
JAVA_SERVER_FACES-206709,0,N,N
JAVA_SERVER_FACES-222693,733,Y,Y
JAVA_SERVER_FACES-234388,9,Y,Y
JAVA_SERVER_FACES-238430,217,Y,Y
JAVA_SERVER_FACES-290739,23,Y,N
JAVA_SERVER_FACES-295409,70,Y,N
JAVA_SERVER_FACES-304872,51,Y,Y
JAVA_SERVER_FACES-328513,3,Y,Y
JDT-102899,86,Y,Y
JDT-106914,69,Y,Y
JDT-10865,0,N,N
JDT-11143,1,N,N
JDT-11626,30,Y,Y
JDT-12200,0,N,N
JDT-12614,7,Y,Y
JDT-126184,0,N,Y
JDT-13217,13,Y,Y
JDT-142323,0,N,Y
JDT-148635,8,Y,N
JDT-14919,19,Y,N
JDT-15364,1,N,Y
JDT-159100,7,Y,N
JDT-16019,1,N,Y
JDT-161444,2,Y,N
JDT-166186,0,N,Y
JDT-17170,16,Y,N
JDT-181157,0,N,N
JDT-182341,3,Y,Y
JDT-18719,302,Y,Y
JDT-188185,2,Y,N
JDT-20170,5,Y,Y
JDT-216116,1,N,Y
JDT-219335,79,Y,Y
JDT-22219,49,Y,Y
JDT-223686,8,Y,Y
JDT-225247,1,N,Y
JDT-227876,5,Y,Y
JDT-23934,19,Y,Y
JDT-25124,1,N,Y
JDT-26599,0,N,Y
JDT-27484,9,Y,N
JDT-28625,1,N,Y
JDT-29258,183,Y,N
JDT-29375,0,N,Y
JDT-296781,53,Y,Y
JDT-31086,4,Y,Y
JDT-3185,61,Y,N
JDT-3199,63,Y,N
JDT-32084,1,N,Y
JDT-330640,0,N,N
JDT-330754,4,Y,Y
JDT-34070,16,Y,Y
JDT-34169,6,Y,Y
JDT-34195,6,Y,N
JDT-34315,49,Y,Y
JDT-350290,98,Y,N
JDT-36217,734,Y,N
JDT-38496,11,Y,Y
JDT-38566,1,N,Y
JDT-385959,250,Y,N
JDT-389351,2,Y,N
JDT-3914,2,Y,Y
JDT-40009,72,Y,Y
JDT-405066,11,Y,Y
JDT-420284,0,N,Y
JDT-42261,3,Y,Y
JDT-424080,0,N,Y
JDT-424920,0,N,N
JDT-434159,157,Y,N
JDT-4365,1,N,N
JDT-44123,0,N,N
JDT-45193,24,Y,Y
JDT-457926,98,Y,Y
JDT-48393,28,Y,N
JDT-495863,164,Y,Y
JDT-497168,95,Y,Y
JDT-5078,92,Y,Y
JDT-512804,22,Y,Y
JDT-519560,20,Y,Y
JDT-521497,2,Y,N
JDT-5240,7,Y,Y
JDT-52589,0,N,Y
JDT-530297,32,Y,N
JDT-54797,0,N,Y
JDT-55867,0,N,N
JDT-56016,5,Y,N
JDT-58707,8,Y,Y
JDT-62827,378,Y,Y
JDT-6791,91,Y,Y
JDT-69598,33,Y,N
JDT-7132,0,N,N
JDT-71784,9,Y,N
JDT-7802,656,Y,Y
JDT-79988,0,N,Y
JDT-79993,7,Y,Y
JDT-81090,1,N,Y
JDT-81109,49,Y,Y
JDT-81146,21,Y,Y
JDT-8201,2,Y,N
JDT-8205,15,Y,N
JDT-84556,0,N,Y
JDT-87922,2,Y,Y
JDT-89554,29,Y,Y
JDT-9196,54,Y,Y
JDT-9268,53,Y,N
JETTY-277406,0,N,Y
JETTY-284510,0,N,Y
JETTY-291589,0,N,Y
JETTY-297552,109,Y,N
JETTY-309466,0,N,Y
JETTY-316334,0,N,N
JETTY-341206,0,N,N
JETTY-342161,159,Y,N
JETTY-342597,28,Y,Y
JETTY-349870,0,N,N
JETTY-350283,81,Y,N
JETTY-355844,8,Y,Y
JETTY-356190,5,Y,Y
JETTY-360061,0,N,Y
JETTY-400144,29,Y,N
JETTY-406962,1,N,N
JETTY-412608,2,Y,Y
JETTY-412637,0,N,Y
JETTY-416453,16,Y,Y
JETTY-420142,1,N,Y
JETTY-436862,49,Y,N
JETTY-444547,49,Y,Y
JETTY-444676,4,Y,N
JETTY-445303,16,Y,N
JETTY-452201,43,Y,Y
JETTY-453645,135,Y,Y
JETTY-461934,33,Y,N
JETTY-461941,0,N,Y
JETTY-470664,10,Y,N
JETTY-474617,0,N,N
JETTY-485031,9,Y,Y
JETTY-485663,0,N,N
JGIT-353310,117,Y,Y
JGIT-407253,1,N,N
JSDT-186177,124,Y,Y
JSDT-212668,429,Y,N
JSDT-241769,265,Y,Y
JSDT-279674,0,N,N
JSDT-319884,79,Y,Y
JSDT-325875,7,Y,Y
JSDT-404832,203,Y,Y
JSDT-480706,23,Y,N
JSDT-495433,3,Y,Y
JSDT-507518,36,Y,N
JTS-528602,14,Y,Y
JUBULA-340680,171,Y,Y
JUBULA-343849,22,Y,N
JUBULA-345106,18,Y,Y
JUBULA-354796,2,Y,N
JUBULA-418883,31,Y,Y
JUBULA-453157,0,N,N
JUBULA-464045,661,Y,Y
JUBULA-470386,2,Y,Y
JWT-201398,30,Y,Y
JWT-206061,1,N,Y
JWT-257736,3,Y,Y
JWT-258622,363,Y,Y
JWT-258816,366,Y,N
LDT-370717,1,N,Y
LDT-386846,786,Y,Y
LDT-516328,25,Y,N
LINUX_TOOLS-206965,76,Y,N
LINUX_TOOLS-273053,70,Y,Y
LINUX_TOOLS-285210,5,Y,N
LINUX_TOOLS-287719,0,N,N
LINUX_TOOLS-287753,1,N,N
LINUX_TOOLS-288996,1,N,Y
LINUX_TOOLS-293979,1,N,N
LINUX_TOOLS-294249,119,Y,N
LINUX_TOOLS-314372,1459,Y,N
LINUX_TOOLS-315301,3,Y,Y
LINUX_TOOLS-323819,209,Y,N
LINUX_TOOLS-347703,93,Y,Y
LINUX_TOOLS-366463,219,Y,Y
LINUX_TOOLS-371825,25,Y,Y
LINUX_TOOLS-383097,14,Y,N
LINUX_TOOLS-388022,0,N,Y
LINUX_TOOLS-392790,9,Y,N
LINUX_TOOLS-420132,0,N,Y
LINUX_TOOLS-420220,7,Y,Y
LINUX_TOOLS-423368,6,Y,Y
LINUX_TOOLS-429193,91,Y,Y
LINUX_TOOLS-469709,664,Y,Y
LINUX_TOOLS-480887,23,Y,Y
LINUX_TOOLS-488976,18,Y,N
LINUX_TOOLS-510465,10,Y,Y
LSP4E-515864,7,Y,N
LYO-363075,1,N,Y
LYO-386697,21,Y,Y
LYO-389410,1,N,Y
LYO-391931,1,N,N
LYO-488091,25,Y,N
LYO-489703,5,Y,Y
M2E-335750,228,Y,Y
M2E-342912,14,Y,Y
M2E-352604,0,N,N
M2E-WTP-393895,41,Y,N
M2E-WTP-412819,160,Y,Y
M2E-WTP-521181,1,N,Y
M2T-253463,121,Y,Y
M2T-253828,100,Y,Y
M2T-254084,217,Y,Y
M2T-283578,0,N,Y
M2T-288930,5,Y,Y
M2T-411937,33,Y,N
MAT-317446,5,Y,Y
MAT-324977,213,Y,Y
MAT-355348,23,Y,Y
MAT-378336,56,Y,Y
MDMBL-525848,16,Y,Y
MDT.MODISCO-299277,3,Y,N
MDT.MODISCO-302874,2,Y,Y
MDT.MODISCO-313325,132,Y,Y
MDT.MODISCO-317209,4,Y,Y
MDT.MODISCO-336071,6,Y,Y
MDT.MODISCO-337402,6,Y,Y
MDT.MODISCO-339695,25,Y,Y
MDT.RMF-382593,0,N,N
MDT.UML2-320318,31,Y,Y
MIHINI-403302,21,Y,N
MMT.ATL-218800,352,Y,Y
MMT.ATL-239787,310,Y,Y
MMT.ATL-307172,0,N,N
MMT.ATL-505821,1,N,Y
MMT.ATL-514603,64,Y,N
MODELING-283025,0,N,N
MPC-311621,22,Y,Y
MPC-340190,0,N,N
MPC-351051,793,Y,Y
MPC-445301,1,N,N
MPC-461603,264,Y,Y
MPC-481071,202,Y,Y
MTJ-158438,249,Y,Y
MTJ-245056,12,Y,Y
MTJ-248939,0,N,Y
MTJ-273604,20,Y,N
MTJ-276095,106,Y,Y
MYLYN_COMMONS-414963,10,Y,N
MYLYN_COMMONS-481261,0,N,N
MYLYN_CONTEXT_MFT-413129,115,Y,Y
MYLYN_DOCS_INTENT-397427,32,Y,Y
MYLYN_DOCS_VEX-397450,7,Y,Y
MYLYN_DOCS-276395,0,N,Y
MYLYN_DOCS-337405,14,Y,Y
MYLYN_DOCS-367633,90,Y,Y
MYLYN_DOCS-479785,34,Y,N
MYLYN_DOCS-505984,23,Y,N
MYLYN_DOCS-515709,130,Y,Y
MYLYN_INCUBATOR-525482,9,Y,N
MYLYN_REVIEWS_R4E-358575,22,Y,Y
MYLYN_REVIEWS_R4E-365440,91,Y,N
MYLYN_REVIEWS_R4E-371640,14,Y,Y
MYLYN_REVIEWS_R4E-371941,7,Y,Y
MYLYN_REVIEWS-352647,47,Y,N
MYLYN_REVIEWS-359624,4,Y,N
MYLYN_REVIEWS-410486,0,N,N
MYLYN_REVIEWS-434112,60,Y,Y
MYLYN_REVIEWS-467049,0,N,N
MYLYN_TASKS-328992,11,Y,Y
MYLYN_TASKS-348049,134,Y,Y
MYLYN_TASKS-349621,62,Y,N
MYLYN_TASKS-356986,248,Y,Y
MYLYN_TASKS-402465,157,Y,N
MYLYN_TASKS-403094,57,Y,N
MYLYN_TASKS-404857,2,Y,Y
MYLYN_TASKS-505602,3,Y,Y
MYLYN-107384,29,Y,Y
MYLYN-108398,37,Y,N
MYLYN-125173,43,Y,Y
MYLYN-153147,1,N,Y
MYLYN-153665,3,Y,Y
MYLYN-162357,28,Y,Y
MYLYN-165031,0,N,N
MYLYN-166540,5,Y,Y
MYLYN-169583,17,Y,N
MYLYN-169758,39,Y,Y
MYLYN-173710,0,N,Y
MYLYN-176915,2,Y,N
MYLYN-185414,1,N,Y
MYLYN-193847,1,N,Y
MYLYN-210624,20,Y,Y
MYLYN-212483,180,Y,N
MYLYN-214112,2,Y,N
MYLYN-219474,46,Y,N
MYLYN-226056,17,Y,N
MYLYN-237542,0,N,Y
MYLYN-240249,166,Y,N
MYLYN-276234,25,Y,N
MYLYN-277040,0,N,N
MYLYN-286435,0,N,Y
MYLYN-314778,5,Y,Y
MYLYN-520652,3,Y,Y
NATTABLE-397438,10,Y,N
NATTABLE-455364,0,N,Y
NATTABLE-460794,1,N,Y
NATTABLE-507451,113,Y,Y
NATTABLE-511410,2,Y,N
NEBULA-210743,52,Y,Y
NEBULA-242552,2121,Y,Y
NEBULA-264349,65,Y,N
NEBULA-264780,0,N,N
NEBULA-266589,2,Y,Y
NEBULA-279937,1,N,Y
NEBULA-306144,424,Y,Y
NEBULA-414432,196,Y,N
NEBULA-420422,1585,Y,Y
NEBULA-485173,813,Y,Y
NEBULA-517017,11,Y,Y
OBJECTTEAMS-406603,0,N,N
OBJECTTEAMS-411625,0,N,Y
OBJECTTEAMS-443306,0,N,N
OCL-144209,1,N,Y
OCL-261008,748,Y,N
OCL-288526,1,N,N
OCL-290315,496,Y,N
OCL-294698,0,N,N
OCL-297665,4,Y,N
OCL-320703,1032,Y,Y
OCL-329006,524,Y,Y
OCL-346787,730,Y,Y
OCL-399535,30,Y,Y
OCL-404493,0,N,Y
OCL-412685,5,Y,N
OCL-516963,4,Y,N
OCL-522256,1,N,Y
OOMPH-469834,0,N,N
OOMPH-473335,0,N,N
OOMPH-474791,0,N,N
OOMPH-475681,13,Y,Y
OOMPH-483868,2,Y,N
OOMPH-484996,0,N,N
OOMPH-493759,3,Y,Y
ORBIT-190032,0,N,Y
ORBIT-202218,14,Y,Y
ORBIT-266232,735,Y,Y
ORBIT-317625,164,Y,N
ORBIT-347704,45,Y,Y
ORBIT-367537,0,N,Y
ORION-334213,78,Y,Y
ORION-336272,1558,Y,Y
ORION-336277,358,Y,Y
ORION-337160,228,Y,Y
ORION-337741,102,Y,Y
ORION-338202,91,Y,Y
ORION-340033,86,Y,Y
ORION-340822,75,Y,Y
ORION-348622,0,N,Y
ORION-350173,26,Y,Y
ORION-358769,54,Y,Y
ORION-359235,0,N,Y
ORION-360986,112,Y,N
ORION-365466,4,Y,N
ORION-370292,1,N,Y
ORION-370878,0,N,Y
ORION-370965,551,Y,Y
ORION-385991,138,Y,Y
ORION-394342,77,Y,N
ORION-399671,1,N,Y
ORION-399747,0,N,Y
ORION-401557,5,Y,Y
ORION-405651,76,Y,Y
ORION-409443,16,Y,Y
ORION-411056,1,N,Y
ORION-411316,1,N,N
ORION-415195,0,N,Y
ORION-418027,0,N,N
ORION-419714,147,Y,N
ORION-422788,4,Y,Y
ORION-423815,22,Y,Y
ORION-423929,12,Y,Y
ORION-425137,0,N,Y
ORION-427189,2,Y,Y
ORION-428206,0,N,Y
ORION-430222,0,N,Y
ORION-431141,198,Y,Y
ORION-431399,12,Y,N
ORION-437835,0,N,N
ORION-439741,0,N,Y
ORION-441285,27,Y,Y
ORION-442805,6,Y,N
ORION-443636,23,Y,Y
ORION-444525,39,Y,Y
ORION-455275,1,N,N
ORION-456816,0,N,Y
ORION-457160,4,Y,Y
ORION-457944,1,N,Y
ORION-458559,0,N,Y
ORION-463104,0,N,Y
ORION-464827,0,N,N
ORION-465858,0,N,N
ORION-465977,0,N,N
ORION-468401,1,N,Y
ORION-472638,77,Y,Y
ORION-472659,231,Y,Y
ORION-476315,1,N,Y
ORION-478730,10,Y,N
ORION-481271,163,Y,Y
ORION-481471,36,Y,Y
ORION-483170,13,Y,N
ORION-483623,61,Y,Y
ORION-487167,0,N,N
ORION-490827,4,Y,Y
ORION-492382,65,Y,Y
ORION-493829,29,Y,Y
ORION-497712,3,Y,N
ORION-509303,20,Y,Y
ORION-512011,4,Y,Y
ORION-512148,45,Y,Y
ORION-512544,106,Y,Y
ORION-522766,10,Y,Y
OSEE-280645,1,N,N
OSEE-291544,539,Y,N
OSEE-334939,29,Y,Y
PAPYRUS-271294,253,Y,N
PAPYRUS-279036,1454,Y,N
PAPYRUS-300048,66,Y,N
PAPYRUS-317156,1051,Y,Y
PAPYRUS-317415,1005,Y,Y
PAPYRUS-317924,6,Y,N
PAPYRUS-319079,0,N,Y
PAPYRUS-319579,7,Y,N
PAPYRUS-320104,3,Y,Y
PAPYRUS-320995,29,Y,Y
PAPYRUS-330477,476,Y,Y
PAPYRUS-332749,158,Y,Y
PAPYRUS-335586,890,Y,Y
PAPYRUS-341927,2,Y,Y
PAPYRUS-345879,687,Y,Y
PAPYRUS-348530,55,Y,N
PAPYRUS-350884,25,Y,N
PAPYRUS-351022,624,Y,Y
PAPYRUS-351917,575,Y,N
PAPYRUS-352343,0,N,N
PAPYRUS-352872,1880,Y,Y
PAPYRUS-353709,16,Y,N
PAPYRUS-363701,311,Y,N
PAPYRUS-372353,379,Y,Y
PAPYRUS-388180,0,N,N
PAPYRUS-388734,0,N,Y
PAPYRUS-389029,301,Y,Y
PAPYRUS-392302,117,Y,Y
PAPYRUS-393222,104,Y,Y
PAPYRUS-394663,133,Y,Y
PAPYRUS-394881,1446,Y,N
PAPYRUS-400942,18,Y,N
PAPYRUS-403755,722,Y,Y
PAPYRUS-407878,2,Y,N
PAPYRUS-419682,105,Y,Y
PAPYRUS-428535,5,Y,Y
PAPYRUS-436922,253,Y,N
PAPYRUS-444798,182,Y,Y
PAPYRUS-445109,1,N,Y
PAPYRUS-452217,19,Y,Y
PAPYRUS-458736,1,N,Y
PAPYRUS-462381,139,Y,N
PAPYRUS-468646,0,N,N
PAPYRUS-473148,25,Y,Y
PAPYRUS-473279,44,Y,Y
PAPYRUS-477084,133,Y,Y
PAPYRUS-480231,38,Y,N
PAPYRUS-481366,107,Y,Y
PAPYRUS-484419,512,Y,N
PAPYRUS-487449,366,Y,Y
PAPYRUS-487480,497,Y,N
PAPYRUS-487880,0,N,N
PAPYRUS-488311,6,Y,Y
PAPYRUS-500656,0,N,N
PAPYRUS-500920,163,Y,Y
PAPYRUS-516428,14,Y,N
PAPYRUS-520115,1,N,N
PAPYRUS-525753,0,N,N
PAPYRUS-527286,226,Y,Y
PAPYRUS-529681,5,Y,Y
PAPYRUS-RT-468072,90,Y,N
PAPYRUS-RT-469389,435,Y,N
PAPYRUS-RT-469986,69,Y,Y
PAPYRUS-RT-470502,74,Y,Y
PAPYRUS-RT-489055,321,Y,N
PAPYRUS-RT-495356,47,Y,N
PAPYRUS-RT-505904,0,N,Y
PAPYRUS-RT-517832,9,Y,Y
PDE-100350,13,Y,Y
PDE-107357,4,Y,N
PDE-112294,0,N,Y
PDE-112309,196,Y,Y
PDE-114951,12,Y,Y
PDE-128931,1,N,Y
PDE-130407,4,Y,N
PDE-133072,420,Y,Y
PDE-142738,0,N,Y
PDE-146841,14,Y,N
PDE-149506,31,Y,Y
PDE-155796,0,N,N
PDE-161725,14,Y,Y
PDE-162020,101,Y,Y
PDE-162812,10,Y,Y
PDE-163496,188,Y,Y
PDE-171836,0,N,Y
PDE-172675,3,Y,Y
PDE-17270,3,Y,Y
PDE-173190,120,Y,Y
PDE-179656,2,Y,Y
PDE-183618,0,N,N
PDE-184041,17,Y,Y
PDE-185976,1,N,Y
PDE-196379,0,N,Y
PDE-199428,6,Y,Y
PDE-199570,0,N,N
PDE-20418,4,Y,Y
PDE-205298,440,Y,N
PDE-216022,11,Y,N
PDE-230107,8,Y,Y
PDE-230990,15,Y,Y
PDE-256379,9,Y,Y
PDE-259278,0,N,Y
PDE-262464,100,Y,Y
PDE-264346,0,N,Y
PDE-266823,3,Y,Y
PDE-267530,2,Y,Y
PDE-267540,1,N,Y
PDE-269381,0,N,Y
PDE-272350,0,N,N
PDE-273627,0,N,Y
PDE-274724,2,Y,N
PDE-28758,1068,Y,Y
PDE-29294,31,Y,N
PDE-304028,0,N,Y
PDE-305232,1,N,N
PDE-307157,20,Y,Y
PDE-324344,193,Y,Y
PDE-338133,0,N,Y
PDE-344996,0,N,N
PDE-366384,0,N,N
PDE-412241,0,N,Y
PDE-46350,0,N,Y
PDE-477662,288,Y,N
PDE-51237,25,Y,Y
PDE-56706,34,Y,Y
PDE-57074,1,N,Y
PDE-70635,379,Y,Y
PDE-81024,133,Y,Y
PDE-8117,23,Y,Y
PDE-85178,1,N,Y
PDE-87340,73,Y,Y
PDE-9369,295,Y,N
PDE-95284,3,Y,N
PDE-95848,342,Y,N
PDE-97382,122,Y,Y
PDE-97677,691,Y,Y
PDE-98358,4,Y,Y
PDT-139015,139,Y,Y
PDT-145229,1,N,Y
PDT-154547,56,Y,Y
PDT-155334,2,Y,N
PDT-157759,133,Y,Y
PDT-169046,8,Y,Y
PDT-169752,21,Y,Y
PDT-172176,0,N,Y
PDT-174827,0,N,Y
PDT-197786,7,Y,Y
PDT-205946,7,Y,Y
PDT-219754,201,Y,N
PDT-237237,112,Y,Y
PDT-240578,133,Y,Y
PDT-241356,45,Y,Y
PDT-258274,10,Y,N
PDT-262394,111,Y,Y
PDT-271271,52,Y,Y
PDT-277354,364,Y,Y
PDT-278213,1,N,Y
PDT-281081,8,Y,Y
PDT-310759,20,Y,Y
PDT-317202,0,N,Y
PDT-322105,1,N,N
PDT-336690,7,Y,Y
PDT-338424,0,N,N
PDT-360320,466,Y,Y
PDT-369430,1,N,Y
PDT-391432,0,N,Y
PDT-393629,0,N,Y
PDT-429478,6,Y,Y
PDT-432592,6,Y,Y
PDT-445937,5,Y,N
PDT-457159,3,Y,N
PDT-481235,1,N,Y
PDT-484189,0,N,Y
PDT-497821,8,Y,N
PDT-515676,0,N,Y
PLATFORM-100622,705,Y,N
PLATFORM-100624,0,N,Y
PLATFORM-10114,157,Y,N
PLATFORM-10813,0,N,N
PLATFORM-10937,32,Y,Y
PLATFORM-11169,52,Y,Y
PLATFORM-114413,92,Y,Y
PLATFORM-115600,4,Y,N
PLATFORM-11575,60,Y,Y
PLATFORM-116197,101,Y,Y
PLATFORM-118548,183,Y,N
PLATFORM-119364,20,Y,N
PLATFORM-121582,0,N,Y
PLATFORM-12347,47,Y,Y
PLATFORM-125250,127,Y,Y
PLATFORM-126017,510,Y,N
PLATFORM-127370,0,N,Y
PLATFORM-129419,6,Y,Y
PLATFORM-130653,492,Y,Y
PLATFORM-131206,48,Y,N
PLATFORM-132376,3,Y,N
PLATFORM-132853,22,Y,Y
PLATFORM-135144,12,Y,Y
PLATFORM-135308,0,N,Y
PLATFORM-135632,3,Y,Y
PLATFORM-137477,0,N,N
PLATFORM-138049,6,Y,Y
PLATFORM-139563,2,Y,N
PLATFORM-14145,295,Y,Y
PLATFORM-14693,17,Y,Y
PLATFORM-14813,0,N,Y
PLATFORM-150099,9,Y,N
PLATFORM-15049,104,Y,Y
PLATFORM-15687,4,Y,Y
PLATFORM-157096,108,Y,Y
PLATFORM-158175,76,Y,N
PLATFORM-160734,1182,Y,N
PLATFORM-16180,25,Y,N
PLATFORM-162524,0,N,Y
PLATFORM-16297,4,Y,N
PLATFORM-16369,0,N,Y
PLATFORM-165786,89,Y,Y
PLATFORM-17110,7,Y,N
PLATFORM-17384,11,Y,Y
PLATFORM-17410,81,Y,N
PLATFORM-175172,1735,Y,N
PLATFORM-175199,1,N,N
PLATFORM-17522,14,Y,Y
PLATFORM-178224,28,Y,Y
PLATFORM-178323,0,N,Y
PLATFORM-178884,20,Y,Y
PLATFORM-18191,2,Y,N
PLATFORM-185247,4223,Y,Y
PLATFORM-18824,4,Y,Y
PLATFORM-19532,228,Y,N
PLATFORM-2025,335,Y,Y
PLATFORM-204317,3234,Y,Y
PLATFORM-20747,151,Y,Y
PLATFORM-208357,348,Y,Y
PLATFORM-21062,11,Y,Y
PLATFORM-211601,20,Y,N
PLATFORM-215879,87,Y,Y
PLATFORM-21829,21,Y,Y
PLATFORM-219,286,Y,Y
PLATFORM-219382,29,Y,Y
PLATFORM-21969,0,N,Y
PLATFORM-219846,1,N,N
PLATFORM-221311,17,Y,N
PLATFORM-222279,1,N,Y
PLATFORM-222936,31,Y,Y
PLATFORM-223556,123,Y,Y
PLATFORM-223823,65,Y,Y
PLATFORM-2249,110,Y,Y
PLATFORM-224940,2,Y,N
PLATFORM-22576,10,Y,Y
PLATFORM-22681,12,Y,Y
PLATFORM-22874,1,N,Y
PLATFORM-229162,2,Y,N
PLATFORM-229181,25,Y,Y
PLATFORM-232684,23,Y,N
PLATFORM-234481,0,N,Y
PLATFORM-236119,19,Y,Y
PLATFORM-23793,2,Y,Y
PLATFORM-23841,167,Y,Y
PLATFORM-241144,7,Y,Y
PLATFORM-24139,1,N,Y
PLATFORM-246999,40,Y,Y
PLATFORM-251482,2,Y,Y
PLATFORM-252231,0,N,Y
PLATFORM-254312,1,N,Y
PLATFORM-25435,234,Y,Y
PLATFORM-255234,1,N,N
PLATFORM-255947,0,N,Y
PLATFORM-256998,102,Y,Y
PLATFORM-258134,9,Y,Y
PLATFORM-260426,29,Y,Y
PLATFORM-262221,0,N,N
PLATFORM-262745,2813,Y,Y
PLATFORM-263709,2,Y,Y
PLATFORM-264094,3,Y,Y
PLATFORM-266062,0,N,Y
PLATFORM-266754,0,N,N
PLATFORM-266960,0,N,Y
PLATFORM-267006,26,Y,N
PLATFORM-270168,1,N,Y
PLATFORM-27063,72,Y,Y
PLATFORM-27132,0,N,N
PLATFORM-272850,65,Y,Y
PLATFORM-2743,121,Y,Y
PLATFORM-274830,521,Y,Y
PLATFORM-274925,16,Y,Y
PLATFORM-275631,2,Y,Y
PLATFORM-275686,150,Y,N
PLATFORM-276166,1,N,N
PLATFORM-276532,354,Y,Y
PLATFORM-278786,0,N,Y
PLATFORM-27981,30,Y,Y
PLATFORM-280976,2,Y,N
PLATFORM-28529,149,Y,Y
PLATFORM-28551,2,Y,Y
PLATFORM-290635,31,Y,Y
PLATFORM-29137,42,Y,Y
PLATFORM-29232,12,Y,Y
PLATFORM-29293,5,Y,Y
PLATFORM-293386,0,N,Y
PLATFORM-29734,0,N,Y
PLATFORM-299619,4,Y,Y
PLATFORM-301127,1,N,Y
PLATFORM-30296,31,Y,Y
PLATFORM-30377,22,Y,Y
PLATFORM-31046,0,N,Y
PLATFORM-310575,8,Y,N
PLATFORM-311936,20,Y,Y
PLATFORM-31300,24,Y,Y
PLATFORM-314603,7,Y,N
PLATFORM-31578,30,Y,Y
PLATFORM-321124,1,N,Y
PLATFORM-323875,11,Y,Y
PLATFORM-324236,50,Y,Y
PLATFORM-324413,4,Y,Y
PLATFORM-33166,85,Y,N
PLATFORM-332146,30,Y,N
PLATFORM-33367,601,Y,N
PLATFORM-333759,950,Y,N
PLATFORM-334916,14,Y,Y
PLATFORM-335499,15,Y,Y
PLATFORM-33997,28,Y,N
PLATFORM-340729,246,Y,Y
PLATFORM-343331,188,Y,Y
PLATFORM-343454,19,Y,Y
PLATFORM-343662,2366,Y,Y
PLATFORM-34418,4,Y,Y
PLATFORM-34752,584,Y,Y
PLATFORM-35679,1,N,N
PLATFORM-35890,3097,Y,Y
PLATFORM-360704,0,N,Y
PLATFORM-363158,1,N,N
PLATFORM-36664,1393,Y,N
PLATFORM-37299,2,Y,Y
PLATFORM-37591,2,Y,Y
PLATFORM-377672,3,Y,Y
PLATFORM-380969,2409,Y,N
PLATFORM-381418,663,Y,Y
PLATFORM-38211,1,N,N
PLATFORM-383189,71,Y,Y
PLATFORM-383270,0,N,N
PLATFORM-385369,391,Y,Y
PLATFORM-38585,138,Y,Y
PLATFORM-38626,12,Y,Y
PLATFORM-388872,0,N,Y
PLATFORM-39147,19,Y,N
PLATFORM-391838,3,Y,N
PLATFORM-393380,0,N,N
PLATFORM-397113,17,Y,Y
PLATFORM-407201,379,Y,Y
PLATFORM-40859,12,Y,Y
PLATFORM-41227,495,Y,N
PLATFORM-42859,167,Y,Y
PLATFORM-43321,1,N,N
PLATFORM-434568,1497,Y,Y
PLATFORM-436904,2,Y,Y
PLATFORM-44031,14,Y,N
PLATFORM-441115,1,N,Y
PLATFORM-44459,44,Y,N
PLATFORM-4553,594,Y,Y
PLATFORM-45617,0,N,N
PLATFORM-457396,1,N,N
PLATFORM-462269,0,N,Y
PLATFORM-462772,0,N,Y
PLATFORM-4637,334,Y,Y
PLATFORM-465145,105,Y,Y
PLATFORM-465504,4,Y,N
PLATFORM-465705,0,N,Y
PLATFORM-46723,0,N,N
PLATFORM-470720,73,Y,N
PLATFORM-472761,16,Y,N
PLATFORM-473063,4,Y,N
PLATFORM-47512,56,Y,Y
PLATFORM-47763,1381,Y,N
PLATFORM-479082,1,N,N
PLATFORM-48304,3,Y,Y
PLATFORM-4834,187,Y,Y
PLATFORM-48443,484,Y,N
PLATFORM-485635,0,N,Y
PLATFORM-485637,0,N,N
PLATFORM-486064,84,Y,N
PLATFORM-4902,161,Y,Y
PLATFORM-490566,21,Y,Y
PLATFORM-49154,18,Y,Y
PLATFORM-49274,0,N,N
PLATFORM-493361,1,N,Y
PLATFORM-499018,134,Y,Y
PLATFORM-500122,31,Y,Y
PLATFORM-50022,40,Y,N
PLATFORM-50033,7,Y,N
PLATFORM-50131,3,Y,Y
PLATFORM-501811,118,Y,Y
PLATFORM-502554,4,Y,Y
PLATFORM-506166,511,Y,N
PLATFORM-507062,172,Y,N
PLATFORM-508427,48,Y,Y
PLATFORM-509260,20,Y,Y
PLATFORM-510404,0,N,N
PLATFORM-51644,2,Y,Y
PLATFORM-5178,1,N,Y
PLATFORM-518611,89,Y,N
PLATFORM-519749,37,Y,Y
PLATFORM-52760,127,Y,Y
PLATFORM-527904,47,Y,N
PLATFORM-529870,14,Y,Y
PLATFORM-5325,74,Y,Y
PLATFORM-53975,1,N,Y
PLATFORM-53988,3763,Y,Y
PLATFORM-54167,86,Y,Y
PLATFORM-54342,41,Y,Y
PLATFORM-56287,1,N,N
PLATFORM-56637,24,Y,N
PLATFORM-56961,6,Y,Y
PLATFORM-57384,9,Y,N
PLATFORM-5763,13,Y,Y
PLATFORM-58020,14,Y,Y
PLATFORM-58156,0,N,Y
PLATFORM-60076,21,Y,Y
PLATFORM-60505,1,N,Y
PLATFORM-61401,0,N,N
PLATFORM-62962,9,Y,Y
PLATFORM-65545,176,Y,Y
PLATFORM-65894,1,N,Y
PLATFORM-66717,6,Y,Y
PLATFORM-67301,2,Y,Y
PLATFORM-67418,357,Y,Y
PLATFORM-68258,127,Y,Y
PLATFORM-69158,34,Y,Y
PLATFORM-69857,42,Y,Y
PLATFORM-7011,149,Y,Y
PLATFORM-70325,305,Y,N
PLATFORM-70989,197,Y,Y
PLATFORM-7182,5,Y,Y
PLATFORM-7230,200,Y,Y
PLATFORM-7415,1,N,Y
PLATFORM-74257,10,Y,Y
PLATFORM-7453,71,Y,N
PLATFORM-75404,0,N,N
PLATFORM-76748,5,Y,Y
PLATFORM-77153,70,Y,Y
PLATFORM-7768,12,Y,N
PLATFORM-78444,1,N,Y
PLATFORM-81242,121,Y,N
PLATFORM-82841,20,Y,N
PLATFORM-84206,95,Y,N
PLATFORM-85139,0,N,N
PLATFORM-85275,29,Y,Y
PLATFORM-8528,21,Y,Y
PLATFORM-86700,2,Y,N
PLATFORM-86933,98,Y,Y
PLATFORM-87363,0,N,Y
PLATFORM-8740,8,Y,N
PLATFORM-88098,356,Y,N
PLATFORM-88171,2,Y,Y
PLATFORM-88463,55,Y,Y
PLATFORM-89803,427,Y,N
PLATFORM-90086,48,Y,Y
PLATFORM-92283,4,Y,N
PLATFORM-93206,1089,Y,Y
PLATFORM-93265,3,Y,Y
PLATFORM-9494,52,Y,Y
PLATFORM-96844,4,Y,Y
PTP-229949,0,N,N
PTP-229952,3,Y,N
PTP-267218,0,N,Y
PTP-278395,26,Y,Y
PTP-295489,6,Y,N
PTP-302019,68,Y,Y
PTP-344261,18,Y,Y
PTP-344701,12,Y,N
PTP-354375,0,N,N
PTP-354704,44,Y,N
PTP-359968,8,Y,N
PTP-367864,6,Y,Y
PTP-369016,288,Y,Y
PTP-373597,7,Y,N
PTP-374003,122,Y,Y
PTP-382504,8,Y,Y
PTP-401555,4,Y,N
PTP-410089,358,Y,Y
PTP-414581,1,N,Y
PTP-416078,286,Y,N
PTP-417974,13,Y,N
PTP-417979,0,N,Y
PTP-463976,78,Y,Y
QVTD-460538,242,Y,N
QVTO-210916,0,N,Y
QVTO-252269,25,Y,Y
QVTO-274505,1558,Y,Y
QVTO-296633,3,Y,Y
QVTO-309762,1021,Y,Y
QVTO-463416,2,Y,Y
RAP-175651,28,Y,Y
RAP-191040,968,Y,N
RAP-203729,1,N,Y
RAP-220963,2,Y,N
RAP-247826,0,N,N
RAP-260356,11,Y,Y
RAP-261346,150,Y,N
RAP-261453,466,Y,Y
RAP-276363,14,Y,N
RAP-278239,18,Y,Y
RAP-281898,64,Y,Y
RAP-282615,1,N,Y
RAP-287838,1,N,Y
RAP-288697,2,Y,Y
RAP-293578,1,N,N
RAP-294587,9,Y,Y
RAP-295430,20,Y,Y
RAP-295463,64,Y,Y
RAP-299620,13,Y,Y
RAP-325756,581,Y,Y
RAP-330823,92,Y,Y
RAP-331048,2,Y,Y
RAP-333861,1,N,N
RAP-340482,11,Y,Y
RAP-347957,405,Y,N
RAP-355500,1,N,Y
RAP-367923,20,Y,Y
RAP-380652,101,Y,N
RAP-403617,49,Y,Y
RAP-422768,8,Y,Y
RAP-436024,208,Y,N
RAP-511690,262,Y,Y
RCPTT-443056,0,N,N
RCPTT-449046,28,Y,N
RCPTT-459094,43,Y,Y
RECOMMENDERS-467951,5,Y,N
REMUS-324626,828,Y,N
RIENA-239572,0,N,N
RIENA-298877,0,N,Y
RIENA-301198,1,N,Y
RIENA-318300,90,Y,N
RTP-340013,0,N,Y
RTSC-291688,0,N,Y
RTSC-311403,53,Y,Y
RTSC-314886,21,Y,Y
RTSC-316841,2,Y,Y
RTSC-320152,11,Y,Y
RTSC-324003,435,Y,Y
RTSC-333928,3,Y,N
RTSC-454930,2,Y,N
SAPPHIRE-337344,0,N,Y
SAPPHIRE-372925,3,Y,N
SAPPHIRE-381409,0,N,N
SAPPHIRE-390035,57,Y,Y
SAPPHIRE-395338,0,N,N
SAPPHIRE-397045,13,Y,Y
SAPPHIRE-404501,47,Y,Y
SAPPHIRE-418363,1,N,Y
SAPPHIRE-419511,51,Y,Y
SCOUT-344626,0,N,Y
SCOUT-364556,0,N,Y
SCOUT-373922,0,N,Y
SCOUT-375522,0,N,N
SCOUT-377147,0,N,Y
SCOUT-383897,13,Y,Y
SCOUT-384483,0,N,Y
SCOUT-393060,1,N,N
SCOUT-394217,0,N,N
SCOUT-395185,0,N,N
SCOUT-405860,0,N,N
SCOUT-419446,7,Y,Y
SCOUT-439225,16,Y,Y
SCOUT-448096,6,Y,Y
SCOUT-479329,1012,Y,N
SIRIUS-431132,32,Y,Y
SIRIUS-435774,0,N,N
SIRIUS-441059,0,N,Y
SIRIUS-453281,62,Y,N
SIRIUS-456351,142,Y,Y
SIRIUS-456771,135,Y,Y
SIRIUS-463299,5,Y,N
SIRIUS-509838,65,Y,Y
SIRIUS-510850,9,Y,Y
SIRIUS-525799,1,N,Y
SISU-426197,490,Y,N
SISU-429366,38,Y,Y
SISU-441912,164,Y,Y
SKALLI-345132,23,Y,N
SKALLI-347536,501,Y,Y
SKALLI-350539,17,Y,Y
SKALLI-364617,1,N,Y
SKALLI-383209,14,Y,N
SPHINX-358131,0,N,N
SPHINX-466873,5,Y,N
STEM-205746,0,N,Y
STEM-206405,3,Y,Y
STEM-245990,8,Y,Y
STEM-250814,405,Y,Y
STEM-283640,0,N,Y
STEM-317108,23,Y,Y
SUBVERSIVE-211276,8,Y,N
SUBVERSIVE-239422,85,Y,N
SUBVERSIVE-245870,63,Y,Y
SUBVERSIVE-254093,161,Y,Y
SUBVERSIVE-259287,911,Y,Y
SUBVERSIVE-295954,1,N,N
SUBVERSIVE-314639,0,N,Y
SUBVERSIVE-338876,5,Y,N
SUBVERSIVE-392049,17,Y,Y
SWTBOT-259661,0,N,Y
SWTBOT-275127,21,Y,Y
SWTBOT-294422,0,N,Y
SWTBOT-309012,1,N,Y
SWTBOT-333611,23,Y,Y
SWTBOT-416888,0,N,N
SWTBOT-451547,11,Y,Y
SWTBOT-519306,6,Y,Y
TARGET_MANAGEMENT-140412,172,Y,Y
TARGET_MANAGEMENT-142178,6,Y,Y
TARGET_MANAGEMENT-153240,125,Y,N
TARGET_MANAGEMENT-153635,1670,Y,Y
TARGET_MANAGEMENT-160559,1,N,Y
TARGET_MANAGEMENT-167998,187,Y,Y
TARGET_MANAGEMENT-168186,509,Y,Y
TARGET_MANAGEMENT-169370,0,N,Y
TARGET_MANAGEMENT-178548,0,N,N
TARGET_MANAGEMENT-182350,153,Y,N
TARGET_MANAGEMENT-183631,36,Y,Y
TARGET_MANAGEMENT-194481,195,Y,Y
TARGET_MANAGEMENT-198638,0,N,Y
TARGET_MANAGEMENT-204794,0,N,N
TARGET_MANAGEMENT-224799,8,Y,Y
TARGET_MANAGEMENT-231964,1,N,Y
TARGET_MANAGEMENT-244950,2,Y,N
TARGET_MANAGEMENT-279307,3,Y,N
TARGET_MANAGEMENT-323166,0,N,N
TARGET_MANAGEMENT-342585,0,N,N
TARGET_MANAGEMENT-367420,0,N,N
TARGET_MANAGEMENT-385793,2,Y,Y
TARGET_MANAGEMENT-411343,88,Y,Y
TARGET_MANAGEMENT-437259,1,N,N
TARGET_MANAGEMENT-485658,0,N,N
TCF-340319,7,Y,N
TCF-361322,7,Y,Y
TCF-367845,7,Y,Y
TCF-368243,0,N,Y
TCF-378217,0,N,Y
TCF-416849,2,Y,N
TCF-469594,0,N,N
THYM-516809,9,Y,N
TIGERSTRIPE-250812,7,Y,N
TIGERSTRIPE-251109,5,Y,Y
TIGERSTRIPE-260837,114,Y,N
TIGERSTRIPE-263219,0,N,Y
TIGERSTRIPE-308160,99,Y,Y
TIGERSTRIPE-319500,22,Y,Y
TIGERSTRIPE-320050,40,Y,Y
TIGERSTRIPE-320571,34,Y,Y
TITAN-499733,71,Y,Y
TITAN-525458,3,Y,Y
TMF-253565,7,Y,Y
TMF-253591,7,Y,Y
TMF-256402,33,Y,Y
TMF-260849,50,Y,N
TMF-265099,22,Y,Y
TMF-284576,306,Y,Y
TMF-289553,117,Y,N
TMF-294309,1,N,N
TMF-306329,22,Y,Y
TMF-309949,0,N,Y
TMF-312501,4,Y,N
TMF-314978,2,Y,N
TMF-326812,3,Y,N
TMF-345837,15,Y,Y
TMF-351460,102,Y,N
TMF-354402,471,Y,Y
TMF-363894,140,Y,Y
TMF-364522,555,Y,Y
TMF-365427,0,N,N
TMF-372017,52,Y,Y
TMF-379125,14,Y,N
TMF-380804,326,Y,Y
TMF-390752,1391,Y,Y
TMF-397424,254,Y,Y
TMF-414869,0,N,N
TMF-420435,1010,Y,Y
TMF-427432,0,N,N
TMF-465751,23,Y,N
TMF-473781,2,Y,N
TMF-476754,603,Y,N
TMF-479743,15,Y,Y
TMF-483793,9,Y,Y
TMF-485129,0,N,Y
TMF-496683,16,Y,Y
TRACECOMPASS-491933,3,Y,Y
TRACECOMPASS-525334,224,Y,Y
TYCHO-368083,24,Y,N
TYCHO-368538,647,Y,Y
TYCHO-388629,0,N,Y
TYCHO-420397,131,Y,N
TYCHO-430950,46,Y,N
TYCHO-525336,78,Y,N
VERTX-424934,4,Y,Y
VERTX-472948,46,Y,Y
VERTX-485181,1,N,Y
VIATRA-270826,1616,Y,Y
VIATRA-412700,328,Y,N
VIATRA-412835,0,N,N
VIATRA-419475,142,Y,N
VIATRA-460624,1,N,N
VIATRA-462706,0,N,Y
VIATRA-473187,100,Y,Y
VIATRA-498780,76,Y,Y
VIATRA-506354,41,Y,N
VIATRA-506499,8,Y,Y
VIATRA-507665,0,N,N
VIATRA-527342,1,N,N
VIRGO-314829,123,Y,Y
VIRGO-323347,31,Y,Y
VIRGO-326324,1,N,Y
VIRGO-337233,83,Y,Y
VIRGO-367742,3,Y,Y
VIRGO-385574,25,Y,Y
VIRGO-387998,29,Y,Y
VIRGO-390555,0,N,Y
VIRGO-393753,15,Y,N
WEB_TOOLS-106655,119,Y,Y
WEB_TOOLS-117908,5,Y,Y
WEB_TOOLS-220602,71,Y,Y
WEB_TOOLS-245598,0,N,N
WEB_TOOLS-249166,8,Y,Y
WINDOWBUILDER-352358,1868,Y,Y
WINDOWBUILDER-406621,18,Y,Y
WINDOWBUILDER-493568,20,Y,Y
WORKING_GROUPS-369702,482,Y,Y
WTP_COMMON_TOOLS-100170,1,N,Y
WTP_COMMON_TOOLS-112486,20,Y,N
WTP_COMMON_TOOLS-114138,3,Y,Y
WTP_COMMON_TOOLS-118749,6,Y,Y
WTP_COMMON_TOOLS-127878,10,Y,N
WTP_COMMON_TOOLS-146146,6,Y,Y
WTP_COMMON_TOOLS-147738,680,Y,Y
WTP_COMMON_TOOLS-158073,759,Y,N
WTP_COMMON_TOOLS-191476,0,N,Y
WTP_COMMON_TOOLS-231685,2,Y,Y
WTP_COMMON_TOOLS-243450,14,Y,Y
WTP_COMMON_TOOLS-285071,12,Y,Y
WTP_COMMON_TOOLS-290055,128,Y,Y
WTP_COMMON_TOOLS-313209,4,Y,Y
WTP_COMMON_TOOLS-436249,236,Y,Y
WTP_COMMON_TOOLS-91913,36,Y,Y
WTP_EJB_TOOLS-154642,0,N,Y
WTP_INCUBATOR-294853,1,N,Y
WTP_JAVA_EE_TOOLS-101880,1,N,Y
WTP_JAVA_EE_TOOLS-102171,1,N,Y
WTP_JAVA_EE_TOOLS-102767,37,Y,N
WTP_JAVA_EE_TOOLS-102897,1,N,N
WTP_JAVA_EE_TOOLS-110690,107,Y,Y
WTP_JAVA_EE_TOOLS-116294,1,N,Y
WTP_JAVA_EE_TOOLS-117792,7,Y,Y
WTP_JAVA_EE_TOOLS-135072,1,N,Y
WTP_JAVA_EE_TOOLS-151448,4,Y,Y
WTP_JAVA_EE_TOOLS-156254,3,Y,Y
WTP_JAVA_EE_TOOLS-156716,5,Y,Y
WTP_JAVA_EE_TOOLS-169851,30,Y,N
WTP_JAVA_EE_TOOLS-177088,639,Y,Y
WTP_JAVA_EE_TOOLS-177804,21,Y,Y
WTP_JAVA_EE_TOOLS-185279,11,Y,Y
WTP_JAVA_EE_TOOLS-197549,1,N,N
WTP_JAVA_EE_TOOLS-222630,6,Y,Y
WTP_JAVA_EE_TOOLS-227442,0,N,N
WTP_JAVA_EE_TOOLS-238264,8,Y,Y
WTP_JAVA_EE_TOOLS-246852,49,Y,Y
WTP_JAVA_EE_TOOLS-249128,37,Y,Y
WTP_JAVA_EE_TOOLS-262362,368,Y,N
WTP_JAVA_EE_TOOLS-278840,9,Y,Y
WTP_JAVA_EE_TOOLS-294783,30,Y,Y
WTP_JAVA_EE_TOOLS-295353,1,N,Y
WTP_JAVA_EE_TOOLS-299057,1,N,Y
WTP_JAVA_EE_TOOLS-299837,0,N,Y
WTP_JAVA_EE_TOOLS-301059,0,N,Y
WTP_JAVA_EE_TOOLS-301477,3,Y,Y
WTP_JAVA_EE_TOOLS-307185,7,Y,Y
WTP_JAVA_EE_TOOLS-352234,3,Y,Y
WTP_JAVA_EE_TOOLS-360698,0,N,Y
WTP_JAVA_EE_TOOLS-365971,6,Y,Y
WTP_JAVA_EE_TOOLS-410117,349,Y,Y
WTP_JAVA_EE_TOOLS-86499,57,Y,Y
WTP_RELENG-111849,12,Y,N
WTP_RELENG-122187,184,Y,Y
WTP_RELENG-127089,118,Y,Y
WTP_RELENG-127409,90,Y,Y
WTP_RELENG-164519,436,Y,Y
WTP_RELENG-170969,61,Y,N
WTP_RELENG-246255,0,N,Y
WTP_RELENG-336780,0,N,N
WTP_RELENG-416528,2,Y,N
WTP_RELENG-418701,0,N,N
WTP_RELENG-443019,2,Y,N
WTP_RELENG-87512,5,Y,Y
WTP_RELENG-91453,0,N,Y
WTP_RELENG-91686,0,N,N
WTP_SERVERTOOLS-107697,78,Y,Y
WTP_SERVERTOOLS-116778,6,Y,Y
WTP_SERVERTOOLS-117902,225,Y,Y
WTP_SERVERTOOLS-118338,1,N,Y
WTP_SERVERTOOLS-181278,8,Y,N
WTP_SERVERTOOLS-203533,22,Y,Y
WTP_SERVERTOOLS-218633,3929,Y,Y
WTP_SERVERTOOLS-229503,0,N,Y
WTP_SERVERTOOLS-93775,7,Y,Y
WTP_SOURCE_EDITING-106052,63,Y,Y
WTP_SOURCE_EDITING-116529,0,N,Y
WTP_SOURCE_EDITING-118330,2509,Y,Y
WTP_SOURCE_EDITING-140946,84,Y,N
WTP_SOURCE_EDITING-141156,15,Y,Y
WTP_SOURCE_EDITING-145697,5,Y,Y
WTP_SOURCE_EDITING-153659,31,Y,Y
WTP_SOURCE_EDITING-164113,1263,Y,Y
WTP_SOURCE_EDITING-203252,1139,Y,Y
WTP_SOURCE_EDITING-209909,33,Y,Y
WTP_SOURCE_EDITING-218091,0,N,Y
WTP_SOURCE_EDITING-243913,20,Y,Y
WTP_SOURCE_EDITING-271494,22,Y,Y
WTP_SOURCE_EDITING-296635,0,N,Y
WTP_SOURCE_EDITING-296643,0,N,Y
WTP_SOURCE_EDITING-301136,209,Y,Y
WTP_SOURCE_EDITING-305009,0,N,N
WTP_SOURCE_EDITING-327176,0,N,Y
WTP_SOURCE_EDITING-340934,26,Y,N
WTP_SOURCE_EDITING-343189,1,N,Y
WTP_SOURCE_EDITING-380091,345,Y,Y
WTP_SOURCE_EDITING-86019,0,N,Y
WTP_SOURCE_EDITING-87333,0,N,N
WTP_SOURCE_EDITING-88001,21,Y,Y
WTP_SOURCE_EDITING-88968,0,N,Y
WTP_SOURCE_EDITING-89202,2,Y,Y
WTP_SOURCE_EDITING-92993,58,Y,N
WTP_SOURCE_EDITING-93366,50,Y,Y
WTP_SOURCE_EDITING-95169,0,N,Y
WTP_WEBSERVICES-108172,0,N,Y
WTP_WEBSERVICES-141398,4,Y,Y
WTP_WEBSERVICES-141404,0,N,Y
WTP_WEBSERVICES-142767,4,Y,Y
WTP_WEBSERVICES-143518,6,Y,Y
WTP_WEBSERVICES-144811,560,Y,Y
WTP_WEBSERVICES-153636,0,N,N
WTP_WEBSERVICES-209267,1,N,N
WTP_WEBSERVICES-218996,18,Y,Y
WTP_WEBSERVICES-241170,7,Y,Y
WTP_WEBSERVICES-242721,7,Y,Y
WTP_WEBSERVICES-279145,20,Y,Y
WTP_WEBSERVICES-293103,5,Y,N
WTP_WEBSERVICES-344733,12,Y,Y
WTP_WEBSERVICES-451036,15,Y,Y
WTP_WEBSERVICES-78830,195,Y,N
WTP_WEBSERVICES-90061,1,N,Y
WTP_WEBSERVICES-91642,0,N,N
WTP_WEBSERVICES-95355,171,Y,Y
WTP_WEBSITE-197534,14,Y,N
XTEND-371585,365,Y,Y
XTEND-378817,260,Y,N
XTEND-383210,1883,Y,Y
XTEND-383529,233,Y,Y
XTEND-383778,231,Y,Y
XTEND-386230,205,Y,Y
XTEND-411973,24,Y,Y
XTEND-416877,0,N,N
XTEND-440625,6,Y,N
XWT-309378,1015,Y,N
XWT-326167,853,Y,Y
Z_ARCHIVED-100279,22,Y,N
Z_ARCHIVED-101184,1,N,Y
Z_ARCHIVED-101708,622,Y,N
Z_ARCHIVED-102106,2,Y,Y
Z_ARCHIVED-102415,1,N,Y
Z_ARCHIVED-104236,4,Y,Y
Z_ARCHIVED-104942,87,Y,Y
Z_ARCHIVED-105969,9,Y,Y
Z_ARCHIVED-106308,25,Y,Y
Z_ARCHIVED-107797,6,Y,Y
Z_ARCHIVED-108379,147,Y,N
Z_ARCHIVED-111510,93,Y,Y
Z_ARCHIVED-113199,7,Y,Y
Z_ARCHIVED-113914,84,Y,N
Z_ARCHIVED-114378,0,N,Y
Z_ARCHIVED-115810,5,Y,Y
Z_ARCHIVED-115842,0,N,N
Z_ARCHIVED-116519,0,N,Y
Z_ARCHIVED-116651,0,N,Y
Z_ARCHIVED-119661,1,N,Y
Z_ARCHIVED-122794,0,N,Y
Z_ARCHIVED-123326,16,Y,Y
Z_ARCHIVED-125242,2,Y,N
Z_ARCHIVED-126715,12,Y,N
Z_ARCHIVED-128915,2,Y,Y
Z_ARCHIVED-129009,0,N,Y
Z_ARCHIVED-131548,0,N,Y
Z_ARCHIVED-131972,0,N,N
Z_ARCHIVED-132297,19,Y,Y
Z_ARCHIVED-136166,1,N,Y
Z_ARCHIVED-137077,7,Y,Y
Z_ARCHIVED-139589,682,Y,Y
Z_ARCHIVED-140242,127,Y,Y
Z_ARCHIVED-140638,2,Y,N
Z_ARCHIVED-141058,0,N,N
Z_ARCHIVED-141394,34,Y,N
Z_ARCHIVED-143341,48,Y,Y
Z_ARCHIVED-143862,6,Y,Y
Z_ARCHIVED-145983,4,Y,N
Z_ARCHIVED-146126,1040,Y,Y
Z_ARCHIVED-148467,70,Y,Y
Z_ARCHIVED-150277,1,N,Y
Z_ARCHIVED-150843,53,Y,Y
Z_ARCHIVED-152187,13,Y,Y
Z_ARCHIVED-152886,32,Y,Y
Z_ARCHIVED-156870,21,Y,N
Z_ARCHIVED-157373,4,Y,Y
Z_ARCHIVED-158495,57,Y,Y
Z_ARCHIVED-160845,119,Y,N
Z_ARCHIVED-161220,113,Y,Y
Z_ARCHIVED-162562,101,Y,Y
Z_ARCHIVED-164005,4,Y,Y
Z_ARCHIVED-164017,25,Y,N
Z_ARCHIVED-164638,0,N,N
Z_ARCHIVED-164787,88,Y,N
Z_ARCHIVED-165928,3,Y,Y
Z_ARCHIVED-168055,3430,Y,Y
Z_ARCHIVED-170245,28,Y,Y
Z_ARCHIVED-170411,2,Y,Y
Z_ARCHIVED-173331,35,Y,N
Z_ARCHIVED-174098,6,Y,N
Z_ARCHIVED-175212,109,Y,Y
Z_ARCHIVED-177965,1,N,N
Z_ARCHIVED-179329,65,Y,Y
Z_ARCHIVED-182342,3,Y,Y
Z_ARCHIVED-183625,0,N,N
Z_ARCHIVED-184040,2,Y,Y
Z_ARCHIVED-184047,113,Y,Y
Z_ARCHIVED-185110,71,Y,Y
Z_ARCHIVED-185496,0,N,Y
Z_ARCHIVED-186159,142,Y,N
Z_ARCHIVED-186644,26,Y,N
Z_ARCHIVED-186960,1,N,Y
Z_ARCHIVED-187054,135,Y,N
Z_ARCHIVED-187087,429,Y,Y
Z_ARCHIVED-188975,5,Y,Y
Z_ARCHIVED-193237,3,Y,Y
Z_ARCHIVED-194542,1,N,N
Z_ARCHIVED-194687,1,N,Y
Z_ARCHIVED-194889,0,N,Y
Z_ARCHIVED-196203,27,Y,Y
Z_ARCHIVED-196660,29,Y,N
Z_ARCHIVED-198094,27,Y,Y
Z_ARCHIVED-198753,106,Y,Y
Z_ARCHIVED-201755,6,Y,Y
Z_ARCHIVED-202117,135,Y,Y
Z_ARCHIVED-204499,1,N,Y
Z_ARCHIVED-204894,0,N,Y
Z_ARCHIVED-205715,58,Y,Y
Z_ARCHIVED-206598,0,N,Y
Z_ARCHIVED-206886,0,N,Y
Z_ARCHIVED-207302,27,Y,Y
Z_ARCHIVED-207447,740,Y,Y
Z_ARCHIVED-208556,4,Y,N
Z_ARCHIVED-211635,63,Y,N
Z_ARCHIVED-212753,86,Y,N
Z_ARCHIVED-213257,2,Y,Y
Z_ARCHIVED-213626,14,Y,N
Z_ARCHIVED-213935,21,Y,Y
Z_ARCHIVED-219989,32,Y,N
Z_ARCHIVED-219994,73,Y,N
Z_ARCHIVED-221487,168,Y,Y
Z_ARCHIVED-222068,45,Y,Y
Z_ARCHIVED-224569,77,Y,Y
Z_ARCHIVED-226058,1,N,N
Z_ARCHIVED-226295,0,N,Y
Z_ARCHIVED-227275,89,Y,Y
Z_ARCHIVED-228252,0,N,Y
Z_ARCHIVED-228395,0,N,Y
Z_ARCHIVED-228747,15,Y,Y
Z_ARCHIVED-230534,2,Y,Y
Z_ARCHIVED-230782,185,Y,Y
Z_ARCHIVED-234771,1,N,Y
Z_ARCHIVED-235144,1,N,Y
Z_ARCHIVED-235712,1,N,Y
Z_ARCHIVED-237054,3,Y,Y
Z_ARCHIVED-237947,0,N,Y
Z_ARCHIVED-238236,15,Y,Y
Z_ARCHIVED-243338,50,Y,Y
Z_ARCHIVED-243760,220,Y,Y
Z_ARCHIVED-244307,3,Y,N
Z_ARCHIVED-245674,0,N,Y
Z_ARCHIVED-246111,209,Y,N
Z_ARCHIVED-248229,25,Y,Y
Z_ARCHIVED-249803,0,N,N
Z_ARCHIVED-250635,7,Y,Y
Z_ARCHIVED-254223,104,Y,Y
Z_ARCHIVED-254306,34,Y,Y
Z_ARCHIVED-255436,1,N,N
Z_ARCHIVED-257299,190,Y,Y
Z_ARCHIVED-258485,31,Y,Y
Z_ARCHIVED-258893,20,Y,Y
Z_ARCHIVED-259105,266,Y,Y
Z_ARCHIVED-260654,0,N,Y
Z_ARCHIVED-263624,6,Y,Y
Z_ARCHIVED-268049,9,Y,Y
Z_ARCHIVED-268526,1,N,N
Z_ARCHIVED-272048,2,Y,Y
Z_ARCHIVED-273452,51,Y,Y
Z_ARCHIVED-274496,102,Y,Y
Z_ARCHIVED-280340,1,N,Y
Z_ARCHIVED-281074,2509,Y,N
Z_ARCHIVED-282719,0,N,N
Z_ARCHIVED-291922,4,Y,Y
Z_ARCHIVED-292511,5,Y,Y
Z_ARCHIVED-293155,10,Y,N
Z_ARCHIVED-294032,1,N,Y
Z_ARCHIVED-295052,62,Y,Y
Z_ARCHIVED-300514,7,Y,Y
Z_ARCHIVED-303616,1,N,N
Z_ARCHIVED-307260,4,Y,Y
Z_ARCHIVED-308511,1,N,Y
Z_ARCHIVED-312442,604,Y,Y
Z_ARCHIVED-315078,28,Y,Y
Z_ARCHIVED-335811,469,Y,Y
Z_ARCHIVED-356433,2002,Y,Y
Z_ARCHIVED-357578,2,Y,Y
Z_ARCHIVED-357815,10,Y,Y
Z_ARCHIVED-359218,47,Y,N
Z_ARCHIVED-359337,33,Y,Y
Z_ARCHIVED-359707,0,N,Y
Z_ARCHIVED-359743,1,N,Y
Z_ARCHIVED-360619,0,N,Y
Z_ARCHIVED-361433,26,Y,N
Z_ARCHIVED-362140,1,N,Y
Z_ARCHIVED-362830,1,N,Y
Z_ARCHIVED-363348,56,Y,Y
Z_ARCHIVED-364084,4,Y,Y
Z_ARCHIVED-378449,39,Y,Y
Z_ARCHIVED-384695,1689,Y,Y
Z_ARCHIVED-391181,29,Y,N
Z_ARCHIVED-399450,9,Y,N
Z_ARCHIVED-400397,0,N,N
Z_ARCHIVED-401471,8,Y,Y
Z_ARCHIVED-403658,0,N,Y
Z_ARCHIVED-408558,0,N,Y
Z_ARCHIVED-417313,2164,Y,N
Z_ARCHIVED-422849,2063,Y,Y
Z_ARCHIVED-427535,4,Y,N
Z_ARCHIVED-429971,966,Y,Y
Z_ARCHIVED-434005,98,Y,Y
Z_ARCHIVED-438935,300,Y,N
Z_ARCHIVED-439099,63,Y,N
Z_ARCHIVED-439852,110,Y,N
Z_ARCHIVED-444718,1,N,Y
Z_ARCHIVED-445298,0,N,N
Z_ARCHIVED-445841,4,Y,N
Z_ARCHIVED-45954,0,N,N
Z_ARCHIVED-46490,287,Y,N
Z_ARCHIVED-464934,2,Y,N
Z_ARCHIVED-465285,392,Y,Y
Z_ARCHIVED-466853,0,N,Y
Z_ARCHIVED-472777,77,Y,N
Z_ARCHIVED-474860,1,N,Y
Z_ARCHIVED-476895,0,N,N
Z_ARCHIVED-48391,0,N,Y
Z_ARCHIVED-487268,4,Y,N
Z_ARCHIVED-497021,1,N,Y
Z_ARCHIVED-53084,0,N,Y
Z_ARCHIVED-53811,0,N,N
Z_ARCHIVED-55418,7,Y,N
Z_ARCHIVED-57103,0,N,Y
Z_ARCHIVED-57270,0,N,Y
Z_ARCHIVED-57347,3,Y,Y
Z_ARCHIVED-58227,2,Y,Y
Z_ARCHIVED-58274,57,Y,Y
Z_ARCHIVED-58853,6,Y,Y
Z_ARCHIVED-59201,6,Y,Y
Z_ARCHIVED-59673,0,N,Y
Z_ARCHIVED-60032,0,N,Y
Z_ARCHIVED-60483,4,Y,N
Z_ARCHIVED-60743,0,N,Y
Z_ARCHIVED-61151,1,N,Y
Z_ARCHIVED-61256,217,Y,Y
Z_ARCHIVED-62033,70,Y,N
Z_ARCHIVED-62139,20,Y,Y
Z_ARCHIVED-62317,13,Y,N
Z_ARCHIVED-62476,4,Y,Y
Z_ARCHIVED-63508,5,Y,Y
Z_ARCHIVED-64843,36,Y,Y
Z_ARCHIVED-67549,12,Y,N
Z_ARCHIVED-69137,145,Y,Y
Z_ARCHIVED-70758,3,Y,Y
Z_ARCHIVED-71394,21,Y,Y
Z_ARCHIVED-71981,4,Y,Y
Z_ARCHIVED-72306,0,N,Y
Z_ARCHIVED-72999,331,Y,N
Z_ARCHIVED-73122,329,Y,N
Z_ARCHIVED-73181,146,Y,Y
Z_ARCHIVED-77559,210,Y,Y
Z_ARCHIVED-78224,3,Y,Y
Z_ARCHIVED-79096,6,Y,Y
Z_ARCHIVED-80413,6,Y,Y
Z_ARCHIVED-81478,6,Y,Y
Z_ARCHIVED-82291,26,Y,N
Z_ARCHIVED-82637,23,Y,Y
Z_ARCHIVED-85493,239,Y,Y
Z_ARCHIVED-87068,17,Y,N
Z_ARCHIVED-87139,13,Y,Y
Z_ARCHIVED-90309,3,Y,Y
Z_ARCHIVED-91612,5,Y,Y
Z_ARCHIVED-93306,0,N,Y
Z_ARCHIVED-95080,13,Y,Y
Z_ARCHIVED-95821,0,N,Y
Z_ARCHIVED-95941,0,N,Y
Z_ARCHIVED-97061,5,Y,N
