\BOOKMARK [2][]{Outline0.1}{Primeira Onda}{}% 1
\BOOKMARK [2][]{Outline0.2}{Segunda Onda}{}% 2
\BOOKMARK [2][]{Outline0.3}{Terceira Onda}{}% 3
\BOOKMARK [2][]{Outline0.4}{Produto Exemplo}{}% 4
\BOOKMARK [2][]{Outline0.5}{Bibliografia}{}% 5
