time,open,high,low,close,Volume,Volume MA
762526800,1393,1542,1249,1515,NaN,NaN
765205200,1512,1733,1278,1708,NaN,NaN
767883600,1708,2520,1323,2467,NaN,NaN
770475600,2467,3888,2436,3623,NaN,NaN
773067600,3623,4274,3483,4201,NaN,NaN
775746000,4201,5450,4091,5329,NaN,NaN
778424400,5329,5640,4792,5484,NaN,NaN
781189200,5484,5531,4283,4797,NaN,NaN
783691200,4757,5086,4217,4656,NaN,NaN
786283200,4656,5024,3984,4353,NaN,NaN
789048000,4353,4399,3102,3885,NaN,NaN
791640000,3886,4068,2758,3270,NaN,NaN
794062800,3267,3494,2110,2978,NaN,NaN
796914000,2978,3929,2867,3813,NaN,NaN
799333200,3813,4185,3684,3720,NaN,NaN
802011600,3720,4071,3515,3603,NaN,NaN
804776400,3603,4082,3574,3877,NaN,NaN
807282000,3877,4554,3817,4310,NaN,NaN
809960400,4312,4888,4312,4670,NaN,NaN
812638800,4670,4688,3922,4128,NaN,NaN
815227200,4128,4390,3713,4378,NaN,NaN
817819200,4378,4397,3957,4299,NaN,NaN
820497600,4299,5171,4298,5151,NaN,NaN
823176000,5151,5410,4939,4957,NaN,NaN
825685200,4960,5224,4595,4954,NaN,NaN
828363600,4954,5175,4831,5164,NaN,NaN
830955600,5164,5764,5097,5727,NaN,NaN
833806800,5725,6303,5397,6043,NaN,NaN
836226000,6043,6713,5879,6123,NaN,NaN
838904400,6158,6400,6015,6259,NaN,NaN
841669200,6259,6631,6132,6446,NaN,NaN
844174800,6446,6851,6316,6533,NaN,NaN
846849600,6533,6757,6478,6666,NaN,NaN
849528000,6666,7052,6445,7039,NaN,NaN
852120000,7039,7991,6952,7964,NaN,NaN
854971200,7964,9181,7963,8785,NaN,NaN
857394000,8828,9565,8707,9044,NaN,NaN
859899600,9044,10000,8982,9982,NaN,NaN
862491600,9982,11457,9982,11344,NaN,NaN
865256400,11344,13222,10987,12567,NaN,NaN
867762000,12567,14005,10764,12872,NaN,NaN
870440400,12845,12845,10518,10609,NaN,NaN
873118800,10609,12019,9920,11797,NaN,NaN
875710800,11799,13037,8456,8986,NaN,NaN
878558400,8986,10333,7521,9394,NaN,NaN
880977600,9395,10212,8852,10196,NaN,NaN
883656000,10196,10654,8469,9720,NaN,NaN
886420800,9716,10627,9716,10570,NaN,NaN
888843600,10571,12111,10571,11946,NaN,NaN
891435600,11946,12339,11051,11745,NaN,NaN
894027600,11554,11624,8970,9846,NaN,NaN
896706000,9846,10563,9061,9678,NaN,NaN
899298000,9678,11156,9678,10707,NaN,NaN
902149200,10705,10705,6454,6472,NaN,NaN
904654800,6472,7452,4575,6593,NaN,NaN
907246800,6593,7629,5878,7047,NaN,NaN
910008000,7047,9128,7047,8631,NaN,NaN
912513600,8631,8737,6377,6784,NaN,NaN
915192000,6786,8540,4797,8171,NaN,NaN
917870400,8187,9267,8160,8910,NaN,NaN
920293200,8912,11100,8912,10696,NaN,NaN
922971600,10696,11826,10676,11350,NaN,NaN
925736400,11350,12589,10564,11089,NaN,NaN
928242000,11089,12117,10665,11626,NaN,NaN
930834000,11633,11996,10345,10441,NaN,NaN
933598800,10441,10725,9579,10564,NaN,NaN
936190800,10583,11735,10583,11106,NaN,NaN
938782800,11104,11826,10796,11700,NaN,NaN
941457600,11701,14053,11684,13778,NaN,NaN
944049600,13783,17104,13555,17091,NaN,NaN
946900800,17098,18099,15349,16380,NaN,NaN
949406400,16389,18885,16389,17660,NaN,NaN
951915600,17668,19046,16922,17820,NaN,NaN
954766800,17825,17825,14029,15537,NaN,NaN
957186000,15596,15944,13555,14956,NaN,NaN
959864400,14967,17396,14967,16727,NaN,NaN
962629200,16746,17794,16389,16454,NaN,NaN
965134800,16474,17925,16072,17346,NaN,NaN
967813200,17359,17715,15656,15928,NaN,NaN
970491600,15949,16403,13570,14867,NaN,NaN
973080000,14857,15191,13287,13287,NaN,NaN
975672000,13303,15415,13241,15259,NaN,NaN
978350400,15242,18023,15173,17672,NaN,NaN
981028800,17670,17673,15558,16069,NaN,NaN
983451600,15891,16813,13761,14330,NaN,NaN
986216400,14439,15267,13325,14918,NaN,NaN
988722000,14886,15304,14056,14650,NaN,NaN
991400400,14657,15644,14164,14560,NaN,NaN
994078800,14579,14771,13361,13754,NaN,NaN
996670800,13755,14143,12681,12841,NaN,NaN
999522000,12847,12947,9533,10636,NaN,NaN
1001941200,10633,11924,9985,11365,NaN,NaN
1004616000,11362,13791,11177,12932,NaN,NaN
1007380800,12924,13969,12809,13578,NaN,NaN
1009886400,14123,14413,12301,12721,NaN,NaN
1012564800,12723,14251,12415,14033,NaN,NaN
1014987600,14050,14495,13183,13255,NaN,NaN
1017666000,13265,13872,13032,13085,NaN,NaN
1020258000,13088,13090,11943,12861,NaN,NaN
1023109200,12860,12919,10247,11139,NaN,NaN
1025528400,11138,11173,9155,9763,NaN,NaN
1028206800,9782,10763,9017,10382,NaN,NaN
1030971600,10396,10477,8352,8623,NaN,NaN
1033477200,9014,10598,8225,10168,NaN,NaN
1036155600,10168,10519,9569,10509,NaN,NaN
1038830400,10519,11648,10307,11268,NaN,NaN
1041422400,11293,12350,10457,10751,NaN,NaN
1044273600,10967,11067,9968,10281,NaN,NaN
1046696400,10256,11421,10104,11274,NaN,NaN
1049202000,11283,12854,11283,12557,NaN,NaN
1051794000,12565,13565,12542,13422,NaN,NaN
1054558800,13437,14072,12894,12972,NaN,NaN
1057064400,12971,13946,12893,13571,NaN,NaN
1059742800,13578,15252,12756,15174,NaN,NaN
1062421200,15172,17104,15074,16010,NaN,NaN
1065013200,16026,18659,16026,17982,NaN,NaN
1067860800,18005,20188,18005,20184,NaN,NaN
1070280000,20194,22310,20194,22236,NaN,NaN
1072958400,22233,24518,21649,21851,NaN,NaN
1075723200,21842,23374,20092,21755,NaN,NaN
1078146000,21761,23372,20756,22142,NaN,NaN
1080824400,22142,23260,19508,19607,NaN,NaN
1083589200,19622,20342,17601,19545,NaN,NaN
1086094800,19545,21183,19177,21149,NaN,NaN
1088686800,21152,22676,20821,22337,NaN,NaN
1091451600,22342,23381,21178,22803,NaN,NaN
1094043600,22803,23484.801,21739,23245.24,NaN,NaN
1096635600,23245.881,24362.039,22389.5,23052.1,NaN,NaN
1099314000,23049.699,25160.199,22940.6,25128.301,NaN,NaN
1101902400,25129,26269.619,24451.5,26196.25,NaN,NaN
1104753600,26193.48,26492.24,23533.84,24355.029,NaN,NaN
1107259200,24355.961,28777.721,24073.23,28066.961,NaN,NaN
1109682000,28135.07,29584.199,25760.869,26659.73,NaN,NaN
1112360400,26612.16,27178.18,24154.131,24858.26,NaN,NaN
1115038800,24847.23,25808.211,23679.65,25207.07,NaN,NaN
1117630800,25209.311,26755.09,24224.34,25051.211,NaN,NaN
1120222800,25051.211,26305.77,24192.359,26042.359,NaN,NaN
1122901200,26042.359,28071.811,25733.641,28044.83,NaN,NaN
1125579600,28043.51,31583.789,27798.631,31583.789,NaN,NaN
1128344400,31581.5,32051.51,28161.24,30144.65,NaN,NaN
1130846400,30193.51,32350.471,29948.18,31916.76,NaN,NaN
1133438400,31920.609,33837.27,31920.609,33455.941,NaN,NaN
1136203200,33461.539,38803.988,32860.172,38372.82,NaN,NaN
1138795200,38382.328,38978.051,35891.238,38546.781,NaN,NaN
1141218000,38610.391,39394.91,36084.648,37885.84,NaN,NaN
1144069200,37951.969,40424.949,37816.41,40363.422,NaN,NaN
1146574800,40364.789,42061.59,34911.34,36530.039,NaN,NaN
1149166800,36531.41,38437.121,32057.32,36630.66,NaN,NaN
1151931600,36628.578,37600.629,34590.828,37077.121,NaN,NaN
1154437200,37077.121,38172.371,35122.961,36232.219,NaN,NaN
1157115600,36232.219,37739.461,34127.48,36449.809,NaN,NaN
1159794000,36450.328,39843.16,36437.551,39262.789,NaN,NaN
1162386000,39278.988,42308.391,39278.988,41931.84,NaN,NaN
1164974400,41929.93,44674.75,41192.16,44473.711,NaN,NaN
1167739200,44476.48,45387.98,41266.211,44642.91,NaN,NaN
1170331200,44642.328,46752.129,42570.93,43848.871,NaN,NaN
1172754000,43886.078,45949.59,41117.02,45804.66,NaN,NaN
1175518800,45804.66,49856.488,45225.23,48956.391,NaN,NaN
1178110800,48954.512,52877.488,48952.66,52268.461,NaN,NaN
1180702800,52270.961,55003.281,50905.391,54392.059,NaN,NaN
1183381200,54396.23,58292.879,52627.441,54191.262,NaN,NaN
1185973200,54170.449,55615.84,44937.648,54637.238,NaN,NaN
1188824400,54641.109,61054.34,52320.988,60465.059,NaN,NaN
1191243600,60465.059,65948.891,59472.98,65319.039,NaN,NaN
1193918400,65316.789,65316.859,58095.922,63006.16,NaN,NaN
1196683200,63018.43,66528.641,59414.238,63644.871,NaN,NaN
1199275200,63884.68,63906.07,53010.961,59490.398,NaN,NaN
1201867200,59490.898,66005.102,58029.699,63585.602,NaN,NaN
1204549200,63496.398,65044.699,57824.102,60968,NaN,NaN
1207054800,60965,68037.797,60965,67868.398,NaN,NaN
1209733200,67868.797,73920.297,67865,72592.5,NaN,NaN
1212411600,72592.5,72592.5,63695.02,65017.578,NaN,NaN
1214917200,65017.578,65017.578,56417.98,59505.172,NaN,NaN
1217595600,59505.172,59505.172,52344.559,55680.41,NaN,NaN
1220274000,55665.328,55665.328,43766.34,49541.27,NaN,NaN
1222866000,49537.66,49833.82,29435.109,37256.84,NaN,NaN
1225713600,37260.648,41002.949,31080.99,36595.871,NaN,NaN
1228132800,36595.871,40497.879,33798.48,37550.309,NaN,NaN
1230897600,37550.309,42525.211,36743.711,39300.789,NaN,NaN
1233576000,39296.48,43441.48,37324.441,38344.898,NaN,NaN
1235998800,38704.852,42679.98,35721.828,40925.871,NaN,NaN
1238590800,40917.898,48125.73,40256.172,47289.531,NaN,NaN
1241442000,47289.531,53805.93,47289.531,53197.73,NaN,NaN
1243861200,53202.371,54955.23,49130.02,51465.461,NaN,NaN
1246453200,51464.031,55083.23,48261.84,54765.719,NaN,NaN
1249304400,54765.648,58633.672,54765.648,56488.98,NaN,NaN
1251810000,56489.398,62017.031,55338.922,61517.891,NaN,NaN
1254402000,61518.949,67529.898,59677.898,61545.5,NaN,NaN
1257249600,61539.199,68059.617,60723.961,67044.438,NaN,NaN
1259668800,67050.75,69785.406,65925.188,68588.406,NaN,NaN
1262606400,68587.156,71068.063,64541.488,65401.77,NaN,NaN
1265025600,65402.25,68119.578,61341.109,66410.594,NaN,NaN
1267448400,66510.938,70486.148,66510.938,70371.539,NaN,NaN
1270126800,70374.539,71989.18,65914.203,67529.727,NaN,NaN
1272891600,67533.75,67968.727,57633.898,63046.512,NaN,NaN
1275397200,63033.102,65830.859,60957.84,60957.84,NaN,NaN
1277989200,60934.578,67608.094,60055.711,67525.633,NaN,NaN
1280754000,67523.938,68753.773,63803.941,65143.309,NaN,NaN
1283346000,65154.262,69736.758,65154.262,69429.781,NaN,NaN
1285938000,69438.227,72139.594,68847.039,70660.992,NaN,NaN
1288612800,70686.211,73103.281,67102.938,67735.43,NaN,NaN
1291204800,67731.172,70589.07,66947.648,69295.344,NaN,NaN
1294056000,69309.977,71923.844,65897.648,66549.703,NaN,NaN
1296561600,66574.883,68225.656,64016.359,67367.477,NaN,NaN
1298984400,67380.703,68606.063,65463.02,68586.703,NaN,NaN
1301662800,68588.063,70107.711,65105.309,66132.859,NaN,NaN
1304341200,66119.398,66500.258,61658.738,64620.078,NaN,NaN
1306933200,64616.352,64978.781,60489.27,62403.641,NaN,NaN
1309525200,62403.641,63891.309,58009,58823.449,NaN,NaN
1312203600,58823.449,59541.922,47793.488,56495.121,NaN,NaN
1314882000,56498.238,58589.262,51897.352,52324.422,NaN,NaN
1317646800,52319,59901.469,49432.891,58338.391,NaN,NaN
1320148800,58300.301,59616.352,54537.398,56874.98,NaN,NaN
1322740800,56876.07,59575.988,55298.328,56754.078,NaN,NaN
1325505600,56755.129,63804.73,56649.27,63072.309,NaN,NaN
1328097600,63085.059,66661.656,63085.059,65811.727,NaN,NaN
1330606800,65811.961,68969.992,64095.699,64510.969,NaN,NaN
1333371600,64514.559,65593.148,60897.25,61820.262,NaN,NaN
1335963600,61820.262,62782.949,53028.109,54490.41,NaN,NaN
1338555600,54488.051,57611.461,52271.27,54354.629,NaN,NaN
1341234000,54355.43,57465.941,52212.922,56097.051,NaN,NaN
1343826000,56091.301,60208.852,55239.02,57061.449,NaN,NaN
1346677200,57065.059,63428.281,56202.5,59175.859,NaN,NaN
1349096400,59171.238,60411.52,56580.852,57068.18,NaN,NaN
1351771200,57065.391,59560.828,55125.559,57474.57,NaN,NaN
1354536000,57479.379,61322.172,57128.672,60952.078,NaN,NaN
1357128000,60990.34,63472.551,59114.02,59761.488,NaN,NaN
1359720000,59764.488,60496.051,55430.262,57424.289,NaN,NaN
1362142800,57422.211,59472.488,54647.969,56352.09,NaN,NaN
1364821200,56348.07,56975.82,52391.52,55910.371,NaN,NaN
1367499600,55918.73,57098.621,52942.219,53506.078,NaN,NaN
1370264400,53512.25,54289.07,45405.941,47457.129,NaN,NaN
1372683600,47457.898,49669.148,44107.059,48234.488,NaN,NaN
1375362000,48235,52398.441,47164.25,50008.379,NaN,NaN
1378126800,50012.328,55900.012,50012.328,52338.191,NaN,NaN
1380632400,52337.32,56747.031,51870.328,54256.199,NaN,NaN
1383307200,54255.031,54538.629,51290.281,52482.488,NaN,NaN
1385985600,52479.109,52479.109,49842.309,51507.16,NaN,NaN
1388664000,51522.191,51656.141,46813.691,47638.988,NaN,NaN
1391428800,47622.762,48669.219,46109.449,47094.398,NaN,NaN
1394024400,47092.238,50417.578,44904.828,50414.922,NaN,NaN
1396357200,50412.051,53393.57,49773.621,51626.691,NaN,NaN
1399035600,51630.281,54459.391,51239.34,51239.34,NaN,NaN
1401714000,51239.34,55283.711,51239.34,53168.219,NaN,NaN
1404219600,53170.461,58138.031,52734.672,55829.41,NaN,NaN
1406898000,55827.371,61442.93,55238.609,61288.148,NaN,NaN
1409576400,61294.48,62304.879,53536.379,54115.98,NaN,NaN
1412168400,54115.211,58897.449,48722.289,54628.602,NaN,NaN
1415016000,54628.602,57359.27,50885.648,54664.359,NaN,NaN
1417435200,54719.469,54719.469,45852.809,50007.41,NaN,NaN
1420200000,50004.5,50281.328,46484.32,46907.68,NaN,NaN
1422878400,46933.488,52457.051,46760.191,51583.09,NaN,NaN
1425301200,51579.988,52318.75,47904.852,51150.16,NaN,NaN
1427893200,51186.27,56965.16,51186.27,56229.379,NaN,NaN
1430744400,56230.031,58574.789,52760.48,52760.48,NaN,NaN
1433163600,52752.91,54360.801,52548.191,53080.879,NaN,NaN
1435755600,53080.879,53444.77,48624.141,50864.77,NaN,NaN
1438606800,50866.922,50866.922,42749.23,46625.52,NaN,NaN
1441112400,46625.078,49395.621,43766.609,45059.34,NaN,NaN
1443704400,45064.262,49752.039,44788.93,45868.82,NaN,NaN
1446465600,45868.809,49054.379,45105.891,45120.359,NaN,NaN
1448971200,45121.102,47142.43,43136.969,43349.961,NaN,NaN
1451908800,43348.91,43348.91,37046.07,40402.148,NaN,NaN
1454328000,40396.512,43601.328,38596.172,42795.32,NaN,NaN
1456837200,42795.172,52261.941,42795.172,50055.27,NaN,NaN
1459515600,50054.41,54977.699,47873.648,53910.512,NaN,NaN
1462194000,53909.531,54112.789,48291.512,48471.711,NaN,NaN
1464786000,48468.191,51811.578,48066.672,51526.93,NaN,NaN
1467378000,51540.211,57473.828,50824.988,57308.211,NaN,NaN
1470056400,57309.23,59417.879,55695.52,57901.109,NaN,NaN
1472734800,57901.449,60310.5,56459.109,58367.051,NaN,NaN
1475499600,58370.148,65054.43,58366.551,64924.52,NaN,NaN
1478001600,64921.91,65291.059,58322.32,61906.359,NaN,NaN
1480593600,61906.352,61935.699,56828.555,60227.289,NaN,NaN
1483358400,60227.281,66593.578,59370.906,64670.781,NaN,NaN
1485950400,64686.867,69487.578,63739.961,66662.102,NaN,NaN
1488373200,66661.266,67397.883,62496.172,64984.066,NaN,NaN
1491224400,64989.207,66211.172,62826.281,65403.246,NaN,NaN
1493730000,65404.051,68791.867,60314.695,62711.473,NaN,NaN
1496322000,62711.469,63636.637,60543.609,62899.973,NaN,NaN
1499086800,62900.91,66047.992,62035.098,65920.359,NaN,NaN
1501592400,65925.094,71505.688,65925.094,70835.055,NaN,NaN
1504270800,70848.156,76419.578,70846.023,74293.508,NaN,NaN
1506949200,74294.531,78024.086,73845.219,74308.492,NaN,NaN
1509537600,74310.258,75199.273,70824.914,71970.992,NaN,NaN
1512129600,71955.273,76436.875,71356.398,76402.078,NaN,NaN
1514894400,76402.602,86212.82,76402.602,84912.703,NaN,NaN
1517486400,84912.875,88317.828,79690.086,85353.594,NaN,NaN
1519909200,85337.164,87333.242,82889.438,85365.563,NaN,NaN
1522674000,85364.828,87178.656,82761.969,86115.5,NaN,NaN
1525266000,86110.758,86678.211,75336.891,76753.617,NaN,NaN
1527858000,76779.383,78892.023,69068.766,72762.508,NaN,NaN
1530536400,72762.508,80588.656,71934.703,79220.43,NaN,NaN
1533128400,79212.992,81792.102,74875.797,76677.531,NaN,NaN
1535979600,76675.477,80106.922,74274.508,79342.422,NaN,NaN
1538398800,79350.43,88377.156,78090.719,87423.547,NaN,NaN
1541077200,87427.563,90245.539,84030.359,89504.031,NaN,NaN
1543838400,89511.156,91242.219,83891.742,87887.258,NaN,NaN
1546430400,87887.258,98405.211,87535.867,97393.742,NaN,NaN
1549022400,97395.477,98588.633,93424.289,95584.352,NaN,NaN
1551445200,95584.352,100438.87,91584.258,95414.547,NaN,NaN
1554123600,95422.898,97610.25,92337.539,96353.328,NaN,NaN
1556802000,96339.313,97992.313,89408.93,97030.32,NaN,NaN
1559566800,97035.781,102617.31,95685.844,100967.2,NaN,NaN
1561986000,100973.48,106650.12,100072.77,101812.13,NaN,NaN
1564664400,101818.93,104848.18,95855.297,101134.61,NaN,NaN
1567429200,101132.51,106001.35,99406.148,104745.32,NaN,NaN
1569934800,104745.06,108407.54,99826.297,107219.83,NaN,NaN
1572613200,107220.94,109671.91,105260.78,108233.28,NaN,NaN
1575291600,108233.28,117802.86,108190.46,115645.34,NaN,NaN
1577970000,115651.95,119593.1,112825.49,113760.57,NaN,NaN
1580734800,113760.57,117700.53,99950.961,104171.57,NaN,NaN
1583154000,104259.51,108803.58,61690.531,73019.758,NaN,NaN
1585746000,73010.781,81667.813,67802.469,80719.42,NaN,NaN