{
  "file_generated_by": "FlutterFire CLI",
  "purpose": "FirebaseAppID & ProjectID for this Firebase app in this directory",
  "GOOGLE_APP_ID": "1:693001008360:ios:e1a2cb57df8c4ee7a8455d",
  "FIREBASE_PROJECT_ID": "otpveryfaction3",
  "GCM_SENDER_ID": "693001008360"
}