{
  "project_info": {
    "project_number": "693001008360",
    "project_id": "otpveryfaction3",
    "storage_bucket": "otpveryfaction3.appspot.com"
  },
  "client": [
    {
      "client_info": {
        "mobilesdk_app_id": "1:693001008360:android:a133c93cfba60210a8455d",
        "android_client_info": {
          "package_name": "com.example.grideview"
        }
      },
      "oauth_client": [
        {
          "client_id": "693001008360-002bf5isqgonrhn8rhg7kaq35j8h44g4.apps.googleusercontent.com",
          "client_type": 3
        }
      ],
      "api_key": [
        {
          "current_key": "AIzaSyDDdInK-hK_Uziz5mm_02mC_vC-fre0h5s"
        }
      ],
      "services": {
        "appinvite_service": {
          "other_platform_oauth_client": [
            {
              "client_id": "693001008360-002bf5isqgonrhn8rhg7kaq35j8h44g4.apps.googleusercontent.com",
              "client_type": 3
            }
          ]
        }
      }
    }
  ],
  "configuration_version": "1"
}