%YAML 1.1
%TAG !u! tag:unity3d.com,2011:
--- !u!114 &11400000
MonoBehaviour:
  m_ObjectHideFlags: 0
  m_CorrespondingSourceObject: {fileID: 0}
  m_PrefabInstance: {fileID: 0}
  m_PrefabAsset: {fileID: 0}
  m_GameObject: {fileID: 0}
  m_Enabled: 1
  m_EditorHideFlags: 0
  m_Script: {fileID: 11500000, guid: 7acbc913922424341afa166213736be1, type: 3}
  m_Name: Steel Sword
  m_EditorClassIdentifier: 
  itemId: e9a1c663-7df7-4793-a1c1-efa2cc8fc2a4
  itemDisplayName: Steel sword
  itemDescription: 'Can save lives. Or take them...

    The decision is up to you.'
  itemSprite: {fileID: 21300000, guid: ec3db96bdd16dae4794d88bb340df505, type: 3}
  itemRepresentation: {fileID: 4202972593049961507, guid: 0e2b531cc84746c4299aaa3bba462bce, type: 3}
  damageValue: 5
