%YAML 1.1
%TAG !u! tag:unity3d.com,2011:
--- !u!114 &11400000
MonoBehaviour:
  m_ObjectHideFlags: 0
  m_CorrespondingSourceObject: {fileID: 0}
  m_PrefabInstance: {fileID: 0}
  m_PrefabAsset: {fileID: 0}
  m_GameObject: {fileID: 0}
  m_Enabled: 1
  m_EditorHideFlags: 0
  m_Script: {fileID: 11500000, guid: a89bca65d28234c45a13cb9eed59ce36, type: 3}
  m_Name: Scroll of Fireballs
  m_EditorClassIdentifier: 
  itemId: 24df5cf1-5047-4456-a5bc-01ad4b09a125
  itemDisplayName: Scroll of Fireballs
  itemDescription: A spell scroll. Anybody is capable of casting the spells etched
    inside. Provided the enemy allows them to read it aloud...
  itemSprite: {fileID: 21300000, guid: 9dcc9aa023a5d224d86bb7451aa177d1, type: 3}
  itemRepresentation: {fileID: 255516277744518357, guid: 62474a4647ccbe8439d371eacfab666d, type: 3}
  spellName: Fireball
