{
    "name": "InputControls",
    "maps": [
        {
            "name": "Menu",
            "id": "5d04d1b2-b24d-4805-9e46-30a4e689e091",
            "actions": [
                {
                    "name": "Navigate",
                    "type": "Value",
                    "id": "e7c09b55-bb4d-4290-b939-5a0972a6b96f",
                    "expectedControlType": "Analog",
                    "processors": "AxisDeadzone",
                    "interactions": "",
                    "initialStateCheck": true
                },
                {
                    "name": "Submit",
                    "type": "Button",
                    "id": "4e82fcfe-d945-4317-a129-623c40f90a62",
                    "expectedControlType": "Button",
                    "processors": "",
                    "interactions": "Press(behavior=1)",
                    "initialStateCheck": false
                },
                {
                    "name": "Cancel",
                    "type": "Button",
                    "id": "41520b9f-6eee-4217-b37d-ce913abec5e9",
                    "expectedControlType": "Button",
                    "processors": "",
                    "interactions": "Press(behavior=1)",
                    "initialStateCheck": false
                },
                {
                    "name": "Action1",
                    "type": "Button",
                    "id": "c313547a-6223-43d9-892c-f5582439ccbd",
                    "expectedControlType": "Button",
                    "processors": "",
                    "interactions": "Press(behavior=1)",
                    "initialStateCheck": false
                },
                {
                    "name": "Action2",
                    "type": "Button",
                    "id": "d322ed73-cfc9-44ac-93ec-808ae1aac2cc",
                    "expectedControlType": "Button",
                    "processors": "",
                    "interactions": "Press(behavior=1)",
                    "initialStateCheck": false
                },
                {
                    "name": "Point",
                    "type": "PassThrough",
                    "id": "0e244b9a-189f-4f54-9537-8d6c870ca911",
                    "expectedControlType": "",
                    "processors": "",
                    "interactions": "",
                    "initialStateCheck": false
                },
                {
                    "name": "Click",
                    "type": "Button",
                    "id": "fb180f20-965f-4820-b53f-f831463efbf6",
                    "expectedControlType": "Button",
                    "processors": "",
                    "interactions": "",
                    "initialStateCheck": false
                },
                {
                    "name": "Start",
                    "type": "Button",
                    "id": "0a7693a7-a1da-4f53-8c8c-bdcae795e39e",
                    "expectedControlType": "Button",
                    "processors": "",
                    "interactions": "Press(behavior=1)",
                    "initialStateCheck": false
                },
                {
                    "name": "Select",
                    "type": "Button",
                    "id": "4d381de4-0841-49ac-8bed-e68395f97ae1",
                    "expectedControlType": "Button",
                    "processors": "",
                    "interactions": "Press(behavior=1)",
                    "initialStateCheck": false
                }
            ],
            "bindings": [
                {
                    "name": "",
                    "id": "ad2e21ad-b774-474e-ad71-39a327a185f8",
                    "path": "<Keyboard>/enter",
                    "interactions": "",
                    "processors": "",
                    "groups": "KeyboardAndMouse",
                    "action": "Submit",
                    "isComposite": false,
                    "isPartOfComposite": false
                },
                {
                    "name": "",
                    "id": "3cb61e67-c801-44aa-b33d-7c39ed6c29dd",
                    "path": "<Gamepad>/buttonSouth",
                    "interactions": "",
                    "processors": "",
                    "groups": "Gamepad",
                    "action": "Submit",
                    "isComposite": false,
                    "isPartOfComposite": false
                },
                {
                    "name": "",
                    "id": "037f265a-7769-491e-8469-3d113940fba2",
                    "path": "<Keyboard>/escape",
                    "interactions": "",
                    "processors": "",
                    "groups": "KeyboardAndMouse",
                    "action": "Cancel",
                    "isComposite": false,
                    "isPartOfComposite": false
                },
                {
                    "name": "",
                    "id": "a56467a9-c336-4423-b657-f7dfeae56d64",
                    "path": "<Gamepad>/buttonEast",
                    "interactions": "",
                    "processors": "",
                    "groups": "Gamepad",
                    "action": "Cancel",
                    "isComposite": false,
                    "isPartOfComposite": false
                },
                {
                    "name": "ArrowKeys",
                    "id": "530d4681-11c0-4519-8b08-a98e52c8c89c",
                    "path": "2DVector",
                    "interactions": "",
                    "processors": "",
                    "groups": "",
                    "action": "Navigate",
                    "isComposite": true,
                    "isPartOfComposite": false
                },
                {
                    "name": "up",
                    "id": "2fe5794f-5b6e-45df-b5aa-ef882349b13e",
                    "path": "<Keyboard>/upArrow",
                    "interactions": "",
                    "processors": "",
                    "groups": "KeyboardAndMouse",
                    "action": "Navigate",
                    "isComposite": false,
                    "isPartOfComposite": true
                },
                {
                    "name": "down",
                    "id": "5beee681-e760-4c90-b42c-f8e4d5ac4d93",
                    "path": "<Keyboard>/downArrow",
                    "interactions": "",
                    "processors": "",
                    "groups": "KeyboardAndMouse",
                    "action": "Navigate",
                    "isComposite": false,
                    "isPartOfComposite": true
                },
                {
                    "name": "left",
                    "id": "da6497b2-7637-4b05-b089-0d42a71fcd39",
                    "path": "<Keyboard>/leftArrow",
                    "interactions": "",
                    "processors": "",
                    "groups": "KeyboardAndMouse",
                    "action": "Navigate",
                    "isComposite": false,
                    "isPartOfComposite": true
                },
                {
                    "name": "right",
                    "id": "745e8500-d020-432b-9192-685b58463a7a",
                    "path": "<Keyboard>/rightArrow",
                    "interactions": "",
                    "processors": "",
                    "groups": "KeyboardAndMouse",
                    "action": "Navigate",
                    "isComposite": false,
                    "isPartOfComposite": true
                },
                {
                    "name": "",
                    "id": "24a27b27-9fdf-43b3-aa38-06902ab5be1b",
                    "path": "<Gamepad>/dpad",
                    "interactions": "",
                    "processors": "",
                    "groups": "Gamepad",
                    "action": "Navigate",
                    "isComposite": false,
                    "isPartOfComposite": false
                },
                {
                    "name": "",
                    "id": "53b0fcaf-8208-425e-8f92-1c5d3d6fb9bd",
                    "path": "<Gamepad>/leftStick",
                    "interactions": "",
                    "processors": "",
                    "groups": "Gamepad",
                    "action": "Navigate",
                    "isComposite": false,
                    "isPartOfComposite": false
                },
                {
                    "name": "",
                    "id": "f5d2756a-554c-486f-962c-2bb34d818340",
                    "path": "<Mouse>/position",
                    "interactions": "",
                    "processors": "",
                    "groups": "KeyboardAndMouse",
                    "action": "Point",
                    "isComposite": false,
                    "isPartOfComposite": false
                },
                {
                    "name": "",
                    "id": "e442fa23-91e5-4d0b-84e1-08971678dbb2",
                    "path": "<Mouse>/leftButton",
                    "interactions": "",
                    "processors": "",
                    "groups": "KeyboardAndMouse",
                    "action": "Click",
                    "isComposite": false,
                    "isPartOfComposite": false
                },
                {
                    "name": "",
                    "id": "c94cc1c6-12a7-48c8-8867-59d78eb0b1bb",
                    "path": "<Mouse>/rightButton",
                    "interactions": "",
                    "processors": "",
                    "groups": "KeyboardAndMouse",
                    "action": "Cancel",
                    "isComposite": false,
                    "isPartOfComposite": false
                },
                {
                    "name": "",
                    "id": "4b0c0583-6ff7-4a64-a59a-8921548bf6aa",
                    "path": "<Gamepad>/start",
                    "interactions": "",
                    "processors": "",
                    "groups": "Gamepad",
                    "action": "Start",
                    "isComposite": false,
                    "isPartOfComposite": false
                },
                {
                    "name": "",
                    "id": "a3a6c2f1-6475-4701-9404-4738d7e9a255",
                    "path": "<Keyboard>/backspace",
                    "interactions": "",
                    "processors": "",
                    "groups": "KeyboardAndMouse",
                    "action": "Start",
                    "isComposite": false,
                    "isPartOfComposite": false
                },
                {
                    "name": "",
                    "id": "39b97f28-4bd0-4570-aca5-07b08a280910",
                    "path": "<Gamepad>/select",
                    "interactions": "",
                    "processors": "",
                    "groups": "Gamepad",
                    "action": "Select",
                    "isComposite": false,
                    "isPartOfComposite": false
                },
                {
                    "name": "",
                    "id": "b15d24b6-1579-4189-837a-3760c95b5b10",
                    "path": "<Keyboard>/tab",
                    "interactions": "",
                    "processors": "",
                    "groups": "KeyboardAndMouse",
                    "action": "Select",
                    "isComposite": false,
                    "isPartOfComposite": false
                },
                {
                    "name": "",
                    "id": "6ca346c2-3b0e-4b64-9cc0-e4f7be082d4f",
                    "path": "<Gamepad>/buttonWest",
                    "interactions": "",
                    "processors": "",
                    "groups": "Gamepad",
                    "action": "Action1",
                    "isComposite": false,
                    "isPartOfComposite": false
                },
                {
                    "name": "",
                    "id": "840a887a-0170-4606-9231-1cb23494298d",
                    "path": "<Keyboard>/x",
                    "interactions": "",
                    "processors": "",
                    "groups": "KeyboardAndMouse",
                    "action": "Action1",
                    "isComposite": false,
                    "isPartOfComposite": false
                },
                {
                    "name": "",
                    "id": "9e462fd2-02c5-4647-ad63-349e4f910e6b",
                    "path": "<Gamepad>/buttonNorth",
                    "interactions": "",
                    "processors": "",
                    "groups": "Gamepad",
                    "action": "Action2",
                    "isComposite": false,
                    "isPartOfComposite": false
                },
                {
                    "name": "",
                    "id": "bce60f1f-c54b-44bd-952b-289086389b9b",
                    "path": "<Keyboard>/v",
                    "interactions": "",
                    "processors": "",
                    "groups": "KeyboardAndMouse",
                    "action": "Action2",
                    "isComposite": false,
                    "isPartOfComposite": false
                }
            ]
        }
    ],
    "controlSchemes": [
        {
            "name": "KeyboardAndMouse",
            "bindingGroup": "KeyboardAndMouse",
            "devices": [
                {
                    "devicePath": "<Keyboard>",
                    "isOptional": false,
                    "isOR": false
                },
                {
                    "devicePath": "<Mouse>",
                    "isOptional": false,
                    "isOR": false
                }
            ]
        },
        {
            "name": "Gamepad",
            "bindingGroup": "Gamepad",
            "devices": [
                {
                    "devicePath": "<Gamepad>",
                    "isOptional": false,
                    "isOR": false
                }
            ]
        }
    ]
}