[
    { "id": "white", "alpha": 255, "red": 255, "green": 255, "blue": 255},
    { "id": "red", "alpha": 255, "red": 255, "green": 0, "blue": 0},
    { "id": "green", "alpha": 255, "red": 0, "green": 255, "blue": 0},
    { "id": "blue", "alpha": 255, "red": 0, "green": 0, "blue": 255},
    { "id": "brown", "alpha": 255, "red": 255, "green": 255, "blue": 255}
]