module product

go 1.16

require (
	gitlab.com/golang-lab/shop-proto v0.0.0-20210627071136-a8053f4731cf
	golang.org/x/net v0.0.0-20210614182718-04defd469f4e // indirect
	golang.org/x/sys v0.0.0-20210616094352-59db8d763f22 // indirect
	google.golang.org/genproto v0.0.0-20210624195500-8bfb893ecb84 // indirect
	google.golang.org/grpc v1.38.0
	google.golang.org/protobuf v1.27.0 // indirect
)
