/home/gokul/eclipse-workspace/SeleniumAssignment/src/test/java/Assignment/OrangeHRM_Organization.java
/home/gokul/eclipse-workspace/SeleniumAssignment/src/test/java/Assignment/DemoShopcomputer.java
/home/gokul/eclipse-workspace/SeleniumAssignment/src/test/java/Assignment/DemoShopcellphone.java
/home/gokul/eclipse-workspace/SeleniumAssignment/src/test/java/Assignment/OrangeHRM_AdminUse_Add.java
