[[ "Year","Industry_aggregation_NZSIOC","Industry_code_NZSIOC","Industry_name_NZSIOC","Units" ,"Variable_code" ,"Variable_name","Variable_category","Value","Industry_code_ANZSIC06"],
["2018","Level 1","99999","All industries","Dollars (millions)","H01","Total income","Financial performance","691859","ANZSIC06 divisions A-S (excluding classes K6330, L6711, O7552, O760, O771, O772, S9540, S9601, S9602, and S9603)"],

["2018","Level 1","99999","All industries","Dollars (millions)","H04","Sales, government funding, grants and subsidies","Financial performance","605766","ANZSIC06 divisions A-S (excluding classes K6330, L6711, O7552, O760, O771, O772, S9540, S9601, S9602, and S9603)"],

["2018","Level 1","99999","All industries","Dollars (millions)","H05","Interest, dividends and donations","Financial performance","63509","ANZSIC06 divisions A-S (excluding classes K6330, L6711, O7552, O760, O771, O772, S9540, S9601, S9602, and S9603)"],

["2018","Level 1","99999","All industries","Dollars (millions)","H07","Non-operating income","Financial performance","22583","ANZSIC06 divisions A-S (excluding classes K6330, L6711, O7552, O760, O771, O772, S9540, S9601, S9602, and S9603)"],

["2018","Level 1","99999","All industries","Dollars (millions)","H08","Total expenditure","Financial performance","597623","ANZSIC06 divisions A-S (excluding classes K6330, L6711, O7552, O760, O771, O772, S9540, S9601, S9602, and S9603)"],

["2018","Level 1","99999","All industries","Dollars (millions)","H09","Interest and donations","Financial performance","34223","ANZSIC06 divisions A-S (excluding classes K6330, L6711, O7552, O760, O771, O772, S9540, S9601, S9602, and S9603)"],

["2018","Level 1","99999","All industries","Dollars (millions)","H10","Indirect taxes","Financial performance","7124","ANZSIC06 divisions A-S (excluding classes K6330, L6711, O7552, O760, O771, O772, S9540, S9601, S9602, and S9603)"],

["2018","Level 1","99999","All industries","Dollars (millions)","H11","Depreciation","Financial performance","19863","ANZSIC06 divisions A-S (excluding classes K6330, L6711, O7552, O760, O771, O772, S9540, S9601, S9602, and S9603)"],

["2018","Level 1","99999","All industries","Dollars (millions)","H12","Salaries and wages paid","Financial performance","106351","ANZSIC06 divisions A-S (excluding classes K6330, L6711, O7552, O760, O771, O772, S9540, S9601, S9602, and S9603)"],

["2018","Level 1","99999","All industries","Dollars (millions)","H13","Redundancy and severance","Financial performance","297","ANZSIC06 divisions A-S (excluding classes K6330, L6711, O7552, O760, O771, O772, S9540, S9601, S9602, and S9603)"],

["2018","Level 1","99999","All industries","Dollars (millions)","H14","Salaries and wages to self employed commission agents","Financial performance","1659","ANZSIC06 divisions A-S (excluding classes K6330, L6711, O7552, O760, O771, O772, S9540, S9601, S9602, and S9603)"],

["2018","Level 1","99999","All industries","Dollars (millions)","H19","Purchases and other operating expenses","Financial performance","418642","ANZSIC06 divisions A-S (excluding classes K6330, L6711, O7552, O760, O771, O772, S9540, S9601, S9602, and S9603)"],

["2018","Level 1","99999","All industries","Dollars (millions)","H20","Non-operating expenses","Financial performance","9762","ANZSIC06 divisions A-S (excluding classes K6330, L6711, O7552, O760, O771, O772, S9540, S9601, S9602, and S9603)"],

["2018","Level 1","99999","All industries","Dollars (millions)","H21","Opening stocks","Financial performance","59433","ANZSIC06 divisions A-S (excluding classes K6330, L6711, O7552, O760, O771, O772, S9540, S9601, S9602, and S9603)"],

["2018","Level 1","99999","All industries","Dollars (millions)","H22","Closing stocks","Financial performance","63592","ANZSIC06 divisions A-S (excluding classes K6330, L6711, O7552, O760, O771, O772, S9540, S9601, S9602, and S9603)"],

["2018","Level 1","99999","All industries","Dollars (millions)","H23","Surplus before income tax","Financial performance","98395","ANZSIC06 divisions A-S (excluding classes K6330, L6711, O7552, O760, O771, O772, S9540, S9601, S9602, and S9603)"],

["2018","Level 1","99999","All industries","Dollars (millions)","H24","Total assets","Financial position","2068648","ANZSIC06 divisions A-S (excluding classes K6330, L6711, O7552, O760, O771, O772, S9540, S9601, S9602, and S9603)"],

["2018","Level 1","99999","All industries","Dollars (millions)","H25","Current assets","Financial position","571177","ANZSIC06 divisions A-S (excluding classes K6330, L6711, O7552, O760, O771, O772, S9540, S9601, S9602, and S9603)"],

["2018","Level 1","99999","All industries","Dollars (millions)","H26","Fixed tangible assets","Financial position","499274","ANZSIC06 divisions A-S (excluding classes K6330, L6711, O7552, O760, O771, O772, S9540, S9601, S9602, and S9603)"],

["2018","Level 1","99999","All industries","Dollars (millions)","H29","Other assets","Financial position","998194","ANZSIC06 divisions A-S (excluding classes K6330, L6711, O7552, O760, O771, O772, S9540, S9601, S9602, and S9603)"],

["2018","Level 1","99999","All industries","Dollars (millions)","H30","Total equity and liabilities","Financial position","2068649","ANZSIC06 divisions A-S (excluding classes K6330, L6711, O7552, O760, O771, O772, S9540, S9601, S9602, and S9603)"],

["2018","Level 1","99999","All industries","Dollars (millions)","H31","Shareholders funds or owners equity","Financial position","700186","ANZSIC06 divisions A-S (excluding classes K6330, L6711, O7552, O760, O771, O772, S9540, S9601, S9602, and S9603)"],

["2018","Level 1","99999","All industries","Dollars (millions)","H32","Current liabilities","Financial position","740971","ANZSIC06 divisions A-S (excluding classes K6330, L6711, O7552, O760, O771, O772, S9540, S9601, S9602, and S9603)"],

["2018","Level 1","99999","All industries","Dollars (millions)","H33","Other liabilities","Financial position","627488","ANZSIC06 divisions A-S (excluding classes K6330, L6711, O7552, O760, O771, O772, S9540, S9601, S9602, and S9603)"],

["2018","Level 1","99999","All industries","Dollars","H34","Total income per employee count","Financial ratios","376800","ANZSIC06 divisions A-S (excluding classes K6330, L6711, O7552, O760, O771, O772, S9540, S9601, S9602, and S9603)"],

["2018","Level 1","99999","All industries","Dollars","H35","Surplus per employee count","Financial ratios","53600","ANZSIC06 divisions A-S (excluding classes K6330, L6711, O7552, O760, O771, O772, S9540, S9601, S9602, and S9603)"],

["2018","Level 1","99999","All industries","Percentage","H36","Current ratio","Financial ratios","77","ANZSIC06 divisions A-S (excluding classes K6330, L6711, O7552, O760, O771, O772, S9540, S9601, S9602, and S9603)"],

["2018","Level 1","99999","All industries","Percentage","H37","Quick ratio","Financial ratios","69","ANZSIC06 divisions A-S (excluding classes K6330, L6711, O7552, O760, O771, O772, S9540, S9601, S9602, and S9603)"],

["2018","Level 1","99999","All industries","Percentage","H39","Return on equity","Financial ratios","14","ANZSIC06 divisions A-S (excluding classes K6330, L6711, O7552, O760, O771, O772, S9540, S9601, S9602, and S9603)"],

["2018","Level 1","99999","All industries","Percentage","H40","Return on total assets","Financial ratios","5","ANZSIC06 divisions A-S (excluding classes K6330, L6711, O7552, O760, O771, O772, S9540, S9601, S9602, and S9603)"],

["2018","Level 1","99999","All industries","Percentage","H41","Liabilities structure","Financial ratios","34","ANZSIC06 divisions A-S (excluding classes K6330, L6711, O7552, O760, O771, O772, S9540, S9601, S9602, and S9603)"],

["2018","Level 1","AA","Agriculture, Forestry and Fishing","Dollars (millions)","H01","Total income","Financial performance","44753","ANZSIC06 division A"],

["2018","Level 1","AA","Agriculture, Forestry and Fishing","Dollars (millions)","H04","Sales of goods and services","Financial performance","41108","ANZSIC06 division A"],

["2018","Level 1","AA","Agriculture, Forestry and Fishing","Dollars (millions)","H05","Interest, dividends and donations","Financial performance","540","ANZSIC06 division A"],

["2018","Level 1","AA","Agriculture, Forestry and Fishing","Dollars (millions)","H06","Government funding, grants and subsidies","Financial performance","12","ANZSIC06 division A"],

["2018","Level 1","AA","Agriculture, Forestry and Fishing","Dollars (millions)","H07","Non-operating income","Financial performance","3093","ANZSIC06 division A"],

["2018","Level 1","AA","Agriculture, Forestry and Fishing","Dollars (millions)","H08","Total expenditure","Financial performance","36651","ANZSIC06 division A"],

["2018","Level 1","AA","Agriculture, Forestry and Fishing","Dollars (millions)","H09","Interest and donations","Financial performance","2860","ANZSIC06 division A"],

["2018","Level 1","AA","Agriculture, Forestry and Fishing","Dollars (millions)","H10","Indirect taxes","Financial performance","451","ANZSIC06 division A"],

["2018","Level 1","AA","Agriculture, Forestry and Fishing","Dollars (millions)","H11","Depreciation","Financial performance","1963","ANZSIC06 division A"],

["2018","Level 1","AA","Agriculture, Forestry and Fishing","Dollars (millions)","H12","Salaries and wages paid","Financial performance","5283","ANZSIC06 division A"],

["2018","Level 1","AA","Agriculture, Forestry and Fishing","Dollars (millions)","H13","Redundancy and severance","Financial performance","0","ANZSIC06 division A"],

["2018","Level 1","AA","Agriculture, Forestry and Fishing","Dollars (millions)","H19","Purchases and other operating expenses","Financial performance","25638","ANZSIC06 division A"],

["2018","Level 1","AA","Agriculture, Forestry and Fishing","Dollars (millions)","H20","Non-operating expenses","Financial performance","454","ANZSIC06 division A"],

["2018","Level 1","AA","Agriculture, Forestry and Fishing","Dollars (millions)","H21","Opening stocks","Financial performance","14370","ANZSIC06 division A"],

["2018","Level 1","AA","Agriculture, Forestry and Fishing","Dollars (millions)","H22","Closing stocks","Financial performance","14467","ANZSIC06 division A"],

["2018","Level 1","AA","Agriculture, Forestry and Fishing","Dollars (millions)","H23","Surplus before income tax","Financial performance","8200","ANZSIC06 division A"],

["2018","Level 1","AA","Agriculture, Forestry and Fishing","Dollars (millions)","H24","Total assets","Financial position","171053","ANZSIC06 division A"],

["2018","Level 1","AA","Agriculture, Forestry and Fishing","Dollars (millions)","H25","Current assets","Financial position","33397","ANZSIC06 division A"],

["2018","Level 1","AA","Agriculture, Forestry and Fishing","Dollars (millions)","H26","Fixed tangible assets","Financial position","97637","ANZSIC06 division A"],

["2018","Level 1","AA","Agriculture, Forestry and Fishing","Dollars (millions)","H29","Other assets","Financial position","40018","ANZSIC06 division A"],

["2018","Level 1","AA","Agriculture, Forestry and Fishing","Dollars (millions)","H30","Total equity and liabilities","Financial position","171053","ANZSIC06 division A"],

["2018","Level 1","AA","Agriculture, Forestry and Fishing","Dollars (millions)","H31","Shareholders funds or owners equity","Financial position","80270","ANZSIC06 division A"],

["2018","Level 1","AA","Agriculture, Forestry and Fishing","Dollars (millions)","H32","Current liabilities","Financial position","29317","ANZSIC06 division A"],

["2018","Level 1","AA","Agriculture, Forestry and Fishing","Dollars (millions)","H33","Other liabilities","Financial position","61465","ANZSIC06 division A"],

["2018","Level 1","AA","Agriculture, Forestry and Fishing","Dollars","H34","Total income per employee count","Financial ratios","395500","ANZSIC06 division A"],

["2018","Level 1","AA","Agriculture, Forestry and Fishing","Dollars","H35","Surplus per employee count","Financial ratios","72500","ANZSIC06 division A"],

["2018","Level 1","AA","Agriculture, Forestry and Fishing","Percentage","H36","Current ratio","Financial ratios","114","ANZSIC06 division A"],

["2018","Level 1","AA","Agriculture, Forestry and Fishing","Percentage","H37","Quick ratio","Financial ratios","65","ANZSIC06 division A"],

["2018","Level 1","AA","Agriculture, Forestry and Fishing","Percentage","H39","Return on equity","Financial ratios","10","ANZSIC06 division A"],

["2018","Level 1","AA","Agriculture, Forestry and Fishing","Percentage","H40","Return on total assets","Financial ratios","5","ANZSIC06 division A"],

["2018","Level 1","AA","Agriculture, Forestry and Fishing","Percentage","H41","Liabilities structure","Financial ratios","47","ANZSIC06 division A"],

["2018","Level 3","AA11","Horticulture and Fruit Growing","Dollars (millions)","H01","Total income","Financial performance","4432","ANZSIC06 groups A011, A012, and A013"],

["2018","Level 3","AA11","Horticulture and Fruit Growing","Dollars (millions)","H04","Sales, government funding, grants and subsidies","Financial performance","4119","ANZSIC06 groups A011, A012, and A013"],

["2018","Level 3","AA11","Horticulture and Fruit Growing","Dollars (millions)","H05","Interest, dividends and donations","Financial performance","101","ANZSIC06 groups A011, A012, and A013"],

["2018","Level 3","AA11","Horticulture and Fruit Growing","Dollars (millions)","H07","Non-operating income","Financial performance","211","ANZSIC06 groups A011, A012, and A013"],

["2018","Level 3","AA11","Horticulture and Fruit Growing","Dollars (millions)","H08","Total expenditure","Financial performance","3579","ANZSIC06 groups A011, A012, and A013"],

["2018","Level 3","AA11","Horticulture and Fruit Growing","Dollars (millions)","H09","Interest and donations","Financial performance","180","ANZSIC06 groups A011, A012, and A013"],

["2018","Level 3","AA11","Horticulture and Fruit Growing","Dollars (millions)","H10","Indirect taxes","Financial performance","33","ANZSIC06 groups A011, A012, and A013"],

["2018","Level 3","AA11","Horticulture and Fruit Growing","Dollars (millions)","H11","Depreciation","Financial performance","200","ANZSIC06 groups A011, A012, and A013"],

["2018","Level 3","AA11","Horticulture and Fruit Growing","Dollars (millions)","H12","Salaries and wages paid","Financial performance","744","ANZSIC06 groups A011, A012, and A013"],

["2018","Level 3","AA11","Horticulture and Fruit Growing","Dollars (millions)","H13","Redundancy and severance","Financial performance","0","ANZSIC06 groups A011, A012, and A013"],

["2018","Level 3","AA11","Horticulture and Fruit Growing","Dollars (millions)","H19","Purchases and other operating expenses","Financial performance","2408","ANZSIC06 groups A011, A012, and A013"],

["2018","Level 3","AA11","Horticulture and Fruit Growing","Dollars (millions)","H20","Non-operating expenses","Financial performance","14","ANZSIC06 groups A011, A012, and A013"],

["2018","Level 3","AA11","Horticulture and Fruit Growing","Dollars (millions)","H21","Opening stocks","Financial performance","317","ANZSIC06 groups A011, A012, and A013"],

["2018","Level 3","AA11","Horticulture and Fruit Growing","Dollars (millions)","H22","Closing stocks","Financial performance","317","ANZSIC06 groups A011, A012, and A013"],

["2018","Level 3","AA11","Horticulture and Fruit Growing","Dollars (millions)","H23","Surplus before income tax","Financial performance","854","ANZSIC06 groups A011, A012, and A013"],

["2018","Level 3","AA11","Horticulture and Fruit Growing","Dollars (millions)","H24","Total assets","Financial position","13187","ANZSIC06 groups A011, A012, and A013"],

["2018","Level 3","AA11","Horticulture and Fruit Growing","Dollars (millions)","H25","Current assets","Financial position","2352","ANZSIC06 groups A011, A012, and A013"],

["2018","Level 3","AA11","Horticulture and Fruit Growing","Dollars (millions)","H26","Fixed tangible assets","Financial position","8714","ANZSIC06 groups A011, A012, and A013"],

["2018","Level 3","AA11","Horticulture and Fruit Growing","Dollars (millions)","H29","Other assets","Financial position","2121","ANZSIC06 groups A011, A012, and A013"],

["2018","Level 3","AA11","Horticulture and Fruit Growing","Dollars (millions)","H30","Total equity and liabilities","Financial position","13187","ANZSIC06 groups A011, A012, and A013"],

["2018","Level 3","AA11","Horticulture and Fruit Growing","Dollars (millions)","H31","Shareholders funds or owners equity","Financial position","6107","ANZSIC06 groups A011, A012, and A013"],

["2018","Level 3","AA11","Horticulture and Fruit Growing","Dollars (millions)","H32","Current liabilities","Financial position","3213","ANZSIC06 groups A011, A012, and A013"],

["2018","Level 3","AA11","Horticulture and Fruit Growing","Dollars (millions)","H33","Other liabilities","Financial position","3867","ANZSIC06 groups A011, A012, and A013"],

["2018","Level 3","AA11","Horticulture and Fruit Growing","Dollars","H34","Total income per employee count","Financial ratios","179700","ANZSIC06 groups A011, A012, and A013"],

["2018","Level 3","AA11","Horticulture and Fruit Growing","Dollars","H35","Surplus per employee count","Financial ratios","34600","ANZSIC06 groups A011, A012, and A013"],

["2018","Level 3","AA11","Horticulture and Fruit Growing","Percentage","H36","Current ratio","Financial ratios","73","ANZSIC06 groups A011, A012, and A013"],

["2018","Level 3","AA11","Horticulture and Fruit Growing","Percentage","H37","Quick ratio","Financial ratios","63","ANZSIC06 groups A011, A012, and A013"],

["2018","Level 3","AA11","Horticulture and Fruit Growing","Percentage","H39","Return on equity","Financial ratios","14","ANZSIC06 groups A011, A012, and A013"],

["2018","Level 3","AA11","Horticulture and Fruit Growing","Percentage","H40","Return on total assets","Financial ratios","6","ANZSIC06 groups A011, A012, and A013"],

["2018","Level 3","AA11","Horticulture and Fruit Growing","Percentage","H41","Liabilities structure","Financial ratios","46","ANZSIC06 groups A011, A012, and A013"],

["2018","Level 4","AA111","Horticulture and Fruit Growing","Dollars (millions)","H01","Total income","Financial performance","4432","ANZSIC06 groups A011, A012, and A013"],

["2018","Level 4","AA111","Horticulture and Fruit Growing","Dollars (millions)","H04","Sales, government funding, grants and subsidies","Financial performance","4119","ANZSIC06 groups A011, A012, and A013"],

["2018","Level 4","AA111","Horticulture and Fruit Growing","Dollars (millions)","H05","Interest, dividends and donations","Financial performance","101","ANZSIC06 groups A011, A012, and A013"],

["2018","Level 4","AA111","Horticulture and Fruit Growing","Dollars (millions)","H07","Non-operating income","Financial performance","211","ANZSIC06 groups A011, A012, and A013"],

["2018","Level 4","AA111","Horticulture and Fruit Growing","Dollars (millions)","H08","Total expenditure","Financial performance","3579","ANZSIC06 groups A011, A012, and A013"],

["2018","Level 4","AA111","Horticulture and Fruit Growing","Dollars (millions)","H09","Interest and donations","Financial performance","180","ANZSIC06 groups A011, A012, and A013"],

["2018","Level 4","AA111","Horticulture and Fruit Growing","Dollars (millions)","H10","Indirect taxes","Financial performance","33","ANZSIC06 groups A011, A012, and A013"],

["2018","Level 4","AA111","Horticulture and Fruit Growing","Dollars (millions)","H11","Depreciation","Financial performance","200","ANZSIC06 groups A011, A012, and A013"],

["2018","Level 4","AA111","Horticulture and Fruit Growing","Dollars (millions)","H12","Salaries and wages paid","Financial performance","744","ANZSIC06 groups A011, A012, and A013"],

["2018","Level 4","AA111","Horticulture and Fruit Growing","Dollars (millions)","H13","Redundancy and severance","Financial performance","0","ANZSIC06 groups A011, A012, and A013"],

["2018","Level 4","AA111","Horticulture and Fruit Growing","Dollars (millions)","H19","Purchases and other operating expenses","Financial performance","2408","ANZSIC06 groups A011, A012, and A013"],

["2018","Level 4","AA111","Horticulture and Fruit Growing","Dollars (millions)","H20","Non-operating expenses","Financial performance","14","ANZSIC06 groups A011, A012, and A013"],

["2018","Level 4","AA111","Horticulture and Fruit Growing","Dollars (millions)","H21","Opening stocks","Financial performance","317","ANZSIC06 groups A011, A012, and A013"],

["2018","Level 4","AA111","Horticulture and Fruit Growing","Dollars (millions)","H22","Closing stocks","Financial performance","317","ANZSIC06 groups A011, A012, and A013"],

["2018","Level 4","AA111","Horticulture and Fruit Growing","Dollars (millions)","H23","Surplus before income tax","Financial performance","854","ANZSIC06 groups A011, A012, and A013"],

["2018","Level 4","AA111","Horticulture and Fruit Growing","Dollars (millions)","H24","Total assets","Financial position","13187","ANZSIC06 groups A011, A012, and A013"],

["2018","Level 4","AA111","Horticulture and Fruit Growing","Dollars (millions)","H25","Current assets","Financial position","2352","ANZSIC06 groups A011, A012, and A013"],

["2018","Level 4","AA111","Horticulture and Fruit Growing","Dollars (millions)","H26","Fixed tangible assets","Financial position","8714","ANZSIC06 groups A011, A012, and A013"],

["2018","Level 4","AA111","Horticulture and Fruit Growing","Dollars (millions)","H29","Other assets","Financial position","2121","ANZSIC06 groups A011, A012, and A013"],

["2018","Level 4","AA111","Horticulture and Fruit Growing","Dollars (millions)","H30","Total equity and liabilities","Financial position","13187","ANZSIC06 groups A011, A012, and A013"],

["2018","Level 4","AA111","Horticulture and Fruit Growing","Dollars (millions)","H31","Shareholders funds or owners equity","Financial position","6107","ANZSIC06 groups A011, A012, and A013"],

["2018","Level 4","AA111","Horticulture and Fruit Growing","Dollars (millions)","H32","Current liabilities","Financial position","3213","ANZSIC06 groups A011, A012, and A013"],

["2018","Level 4","AA111","Horticulture and Fruit Growing","Dollars (millions)","H33","Other liabilities","Financial position","3867","ANZSIC06 groups A011, A012, and A013"],

["2018","Level 4","AA111","Horticulture and Fruit Growing","Dollars","H34","Total income per employee count","Financial ratios","179700","ANZSIC06 groups A011, A012, and A013"],

["2018","Level 4","AA111","Horticulture and Fruit Growing","Dollars","H35","Surplus per employee count","Financial ratios","34600","ANZSIC06 groups A011, A012, and A013"],

["2018","Level 4","AA111","Horticulture and Fruit Growing","Percentage","H36","Current ratio","Financial ratios","73","ANZSIC06 groups A011, A012, and A013"],

["2018","Level 4","AA111","Horticulture and Fruit Growing","Percentage","H37","Quick ratio","Financial ratios","63","ANZSIC06 groups A011, A012, and A013"],

["2018","Level 4","AA111","Horticulture and Fruit Growing","Percentage","H39","Return on equity","Financial ratios","14","ANZSIC06 groups A011, A012, and A013"],

["2018","Level 4","AA111","Horticulture and Fruit Growing","Percentage","H40","Return on total assets","Financial ratios","6","ANZSIC06 groups A011, A012, and A013"],

["2018","Level 4","AA111","Horticulture and Fruit Growing","Percentage","H41","Liabilities structure","Financial ratios","46","ANZSIC06 groups A011, A012, and A013"],

["2018","Level 3","AA12","Sheep, Beef Cattle and Grain Farming","Dollars (millions)","H01","Total income","Financial performance","11555","ANZSIC06 groups A014 and A015"],

["2018","Level 3","AA12","Sheep, Beef Cattle and Grain Farming","Dollars (millions)","H04","Sales, government funding, grants and subsidies","Financial performance","10812","ANZSIC06 groups A014 and A015"],

["2018","Level 3","AA12","Sheep, Beef Cattle and Grain Farming","Dollars (millions)","H05","Interest, dividends and donations","Financial performance","135","ANZSIC06 groups A014 and A015"],

["2018","Level 3","AA12","Sheep, Beef Cattle and Grain Farming","Dollars (millions)","H07","Non-operating income","Financial performance","608","ANZSIC06 groups A014 and A015"],

["2018","Level 3","AA12","Sheep, Beef Cattle and Grain Farming","Dollars (millions)","H08","Total expenditure","Financial performance","9867","ANZSIC06 groups A014 and A015"],

["2018","Level 3","AA12","Sheep, Beef Cattle and Grain Farming","Dollars (millions)","H09","Interest and donations","Financial performance","699","ANZSIC06 groups A014 and A015"],

["2018","Level 3","AA12","Sheep, Beef Cattle and Grain Farming","Dollars (millions)","H10","Indirect taxes","Financial performance","178","ANZSIC06 groups A014 and A015"],

["2018","Level 3","AA12","Sheep, Beef Cattle and Grain Farming","Dollars (millions)","H11","Depreciation","Financial performance","526","ANZSIC06 groups A014 and A015"],

["2018","Level 3","AA12","Sheep, Beef Cattle and Grain Farming","Dollars (millions)","H12","Salaries and wages paid","Financial performance","998","ANZSIC06 groups A014 and A015"],

["2018","Level 3","AA12","Sheep, Beef Cattle and Grain Farming","Dollars (millions)","H13","Redundancy and severance","Financial performance","0","ANZSIC06 groups A014 and A015"],

["2018","Level 3","AA12","Sheep, Beef Cattle and Grain Farming","Dollars (millions)","H19","Purchases and other operating expenses","Financial performance","7416","ANZSIC06 groups A014 and A015"],

["2018","Level 3","AA12","Sheep, Beef Cattle and Grain Farming","Dollars (millions)","H20","Non-operating expenses","Financial performance","50","ANZSIC06 groups A014 and A015"],

["2018","Level 3","AA12","Sheep, Beef Cattle and Grain Farming","Dollars (millions)","H21","Opening stocks","Financial performance","6246","ANZSIC06 groups A014 and A015"],

["2018","Level 3","AA12","Sheep, Beef Cattle and Grain Farming","Dollars (millions)","H22","Closing stocks","Financial performance","6393","ANZSIC06 groups A014 and A015"],

["2018","Level 3","AA12","Sheep, Beef Cattle and Grain Farming","Dollars (millions)","H23","Surplus before income tax","Financial performance","1835","ANZSIC06 groups A014 and A015"],

["2018","Level 3","AA12","Sheep, Beef Cattle and Grain Farming","Dollars (millions)","H24","Total assets","Financial position","56454","ANZSIC06 groups A014 and A015"],

["2018","Level 3","AA12","Sheep, Beef Cattle and Grain Farming","Dollars (millions)","H25","Current assets","Financial position","12803","ANZSIC06 groups A014 and A015"],

["2018","Level 3","AA12","Sheep, Beef Cattle and Grain Farming","Dollars (millions)","H26","Fixed tangible assets","Financial position","35858","ANZSIC06 groups A014 and A015"],

["2018","Level 3","AA12","Sheep, Beef Cattle and Grain Farming","Dollars (millions)","H29","Other assets","Financial position","7793","ANZSIC06 groups A014 and A015"],

["2018","Level 3","AA12","Sheep, Beef Cattle and Grain Farming","Dollars (millions)","H30","Total equity and liabilities","Financial position","56454","ANZSIC06 groups A014 and A015"],

["2018","Level 3","AA12","Sheep, Beef Cattle and Grain Farming","Dollars (millions)","H31","Shareholders funds or owners equity","Financial position","31056","ANZSIC06 groups A014 and A015"],

["2018","Level 3","AA12","Sheep, Beef Cattle and Grain Farming","Dollars (millions)","H32","Current liabilities","Financial position","9333","ANZSIC06 groups A014 and A015"],

["2018","Level 3","AA12","Sheep, Beef Cattle and Grain Farming","Dollars (millions)","H33","Other liabilities","Financial position","16065","ANZSIC06 groups A014 and A015"],

["2018","Level 3","AA12","Sheep, Beef Cattle and Grain Farming","Dollars","H34","Total income per employee count","Financial ratios","542300","ANZSIC06 groups A014 and A015"],

["2018","Level 3","AA12","Sheep, Beef Cattle and Grain Farming","Dollars","H35","Surplus per employee count","Financial ratios","86100","ANZSIC06 groups A014 and A015"],

["2018","Level 3","AA12","Sheep, Beef Cattle and Grain Farming","Percentage","H36","Current ratio","Financial ratios","137","ANZSIC06 groups A014 and A015"],

["2018","Level 3","AA12","Sheep, Beef Cattle and Grain Farming","Percentage","H37","Quick ratio","Financial ratios","69","ANZSIC06 groups A014 and A015"],

["2018","Level 3","AA12","Sheep, Beef Cattle and Grain Farming","Percentage","H39","Return on equity","Financial ratios","6","ANZSIC06 groups A014 and A015"],

["2018","Level 3","AA12","Sheep, Beef Cattle and Grain Farming","Percentage","H40","Return on total assets","Financial ratios","3","ANZSIC06 groups A014 and A015"],

["2018","Level 3","AA12","Sheep, Beef Cattle and Grain Farming","Percentage","H41","Liabilities structure","Financial ratios","55","ANZSIC06 groups A014 and A015"],

["2018","Level 4","AA121","Sheep, Beef Cattle and Grain Farming","Dollars (millions)","H01","Total income","Financial performance","11555","ANZSIC06 groups A014 and A015"],

["2018","Level 4","AA121","Sheep, Beef Cattle and Grain Farming","Dollars (millions)","H04","Sales, government funding, grants and subsidies","Financial performance","10812","ANZSIC06 groups A014 and A015"],

["2018","Level 4","AA121","Sheep, Beef Cattle and Grain Farming","Dollars (millions)","H05","Interest, dividends and donations","Financial performance","135","ANZSIC06 groups A014 and A015"],

["2018","Level 4","AA121","Sheep, Beef Cattle and Grain Farming","Dollars (millions)","H07","Non-operating income","Financial performance","608","ANZSIC06 groups A014 and A015"],

["2018","Level 4","AA121","Sheep, Beef Cattle and Grain Farming","Dollars (millions)","H08","Total expenditure","Financial performance","9867","ANZSIC06 groups A014 and A015"],

["2018","Level 4","AA121","Sheep, Beef Cattle and Grain Farming","Dollars (millions)","H09","Interest and donations","Financial performance","699","ANZSIC06 groups A014 and A015"],

["2018","Level 4","AA121","Sheep, Beef Cattle and Grain Farming","Dollars (millions)","H10","Indirect taxes","Financial performance","178","ANZSIC06 groups A014 and A015"],

["2018","Level 4","AA121","Sheep, Beef Cattle and Grain Farming","Dollars (millions)","H11","Depreciation","Financial performance","526","ANZSIC06 groups A014 and A015"],

["2018","Level 4","AA121","Sheep, Beef Cattle and Grain Farming","Dollars (millions)","H12","Salaries and wages paid","Financial performance","998","ANZSIC06 groups A014 and A015"],

["2018","Level 4","AA121","Sheep, Beef Cattle and Grain Farming","Dollars (millions)","H13","Redundancy and severance","Financial performance","0","ANZSIC06 groups A014 and A015"],

["2018","Level 4","AA121","Sheep, Beef Cattle and Grain Farming","Dollars (millions)","H19","Purchases and other operating expenses","Financial performance","7416","ANZSIC06 groups A014 and A015"],

["2018","Level 4","AA121","Sheep, Beef Cattle and Grain Farming","Dollars (millions)","H20","Non-operating expenses","Financial performance","50","ANZSIC06 groups A014 and A015"],

["2018","Level 4","AA121","Sheep, Beef Cattle and Grain Farming","Dollars (millions)","H21","Opening stocks","Financial performance","6246","ANZSIC06 groups A014 and A015"],

["2018","Level 4","AA121","Sheep, Beef Cattle and Grain Farming","Dollars (millions)","H22","Closing stocks","Financial performance","6393","ANZSIC06 groups A014 and A015"],

["2018","Level 4","AA121","Sheep, Beef Cattle and Grain Farming","Dollars (millions)","H23","Surplus before income tax","Financial performance","1835","ANZSIC06 groups A014 and A015"],

["2018","Level 4","AA121","Sheep, Beef Cattle and Grain Farming","Dollars (millions)","H24","Total assets","Financial position","56454","ANZSIC06 groups A014 and A015"],

["2018","Level 4","AA121","Sheep, Beef Cattle and Grain Farming","Dollars (millions)","H25","Current assets","Financial position","12803","ANZSIC06 groups A014 and A015"],

["2018","Level 4","AA121","Sheep, Beef Cattle and Grain Farming","Dollars (millions)","H26","Fixed tangible assets","Financial position","35858","ANZSIC06 groups A014 and A015"],

["2018","Level 4","AA121","Sheep, Beef Cattle and Grain Farming","Dollars (millions)","H29","Other assets","Financial position","7793","ANZSIC06 groups A014 and A015"],

["2018","Level 4","AA121","Sheep, Beef Cattle and Grain Farming","Dollars (millions)","H30","Total equity and liabilities","Financial position","56454","ANZSIC06 groups A014 and A015"],

["2018","Level 4","AA121","Sheep, Beef Cattle and Grain Farming","Dollars (millions)","H31","Shareholders funds or owners equity","Financial position","31056","ANZSIC06 groups A014 and A015"],

["2018","Level 4","AA121","Sheep, Beef Cattle and Grain Farming","Dollars (millions)","H32","Current liabilities","Financial position","9333","ANZSIC06 groups A014 and A015"],

["2018","Level 4","AA121","Sheep, Beef Cattle and Grain Farming","Dollars (millions)","H33","Other liabilities","Financial position","16065","ANZSIC06 groups A014 and A015"],

["2018","Level 4","AA121","Sheep, Beef Cattle and Grain Farming","Dollars","H34","Total income per employee count","Financial ratios","542300","ANZSIC06 groups A014 and A015"],

["2018","Level 4","AA121","Sheep, Beef Cattle and Grain Farming","Dollars","H35","Surplus per employee count","Financial ratios","86100","ANZSIC06 groups A014 and A015"],

["2018","Level 4","AA121","Sheep, Beef Cattle and Grain Farming","Percentage","H36","Current ratio","Financial ratios","137","ANZSIC06 groups A014 and A015"],

["2018","Level 4","AA121","Sheep, Beef Cattle and Grain Farming","Percentage","H37","Quick ratio","Financial ratios","69","ANZSIC06 groups A014 and A015"],

["2018","Level 4","AA121","Sheep, Beef Cattle and Grain Farming","Percentage","H39","Return on equity","Financial ratios","6","ANZSIC06 groups A014 and A015"],

["2018","Level 4","AA121","Sheep, Beef Cattle and Grain Farming","Percentage","H40","Return on total assets","Financial ratios","3","ANZSIC06 groups A014 and A015"],

["2018","Level 4","AA121","Sheep, Beef Cattle and Grain Farming","Percentage","H41","Liabilities structure","Financial ratios","55","ANZSIC06 groups A014 and A015"],

["2018","Level 3","AA13","Dairy Cattle Farming","Dollars (millions)","H01","Total income","Financial performance","13537","ANZSIC06 group A016"],

["2018","Level 3","AA13","Dairy Cattle Farming","Dollars (millions)","H04","Sales, government funding, grants and subsidies","Financial performance","13011","ANZSIC06 group A016"],

["2018","Level 3","AA13","Dairy Cattle Farming","Dollars (millions)","H05","Interest, dividends and donations","Financial performance","181","ANZSIC06 group A016"],

["2018","Level 3","AA13","Dairy Cattle Farming","Dollars (millions)","H07","Non-operating income","Financial performance","345","ANZSIC06 group A016"],

["2018","Level 3","AA13","Dairy Cattle Farming","Dollars (millions)","H08","Total expenditure","Financial performance","11658","ANZSIC06 group A016"],

["2018","Level 3","AA13","Dairy Cattle Farming","Dollars (millions)","H09","Interest and donations","Financial performance","1568","ANZSIC06 group A016"],

["2018","Level 3","AA13","Dairy Cattle Farming","Dollars (millions)","H10","Indirect taxes","Financial performance","172","ANZSIC06 group A016"],

["2018","Level 3","AA13","Dairy Cattle Farming","Dollars (millions)","H11","Depreciation","Financial performance","633","ANZSIC06 group A016"],

["2018","Level 3","AA13","Dairy Cattle Farming","Dollars (millions)","H12","Salaries and wages paid","Financial performance","1442","ANZSIC06 group A016"],

["2018","Level 3","AA13","Dairy Cattle Farming","Dollars (millions)","H13","Redundancy and severance","Financial performance","0","ANZSIC06 group A016"],

["2018","Level 3","AA13","Dairy Cattle Farming","Dollars (millions)","H19","Purchases and other operating expenses","Financial performance","7807","ANZSIC06 group A016"],

["2018","Level 3","AA13","Dairy Cattle Farming","Dollars (millions)","H20","Non-operating expenses","Financial performance","35","ANZSIC06 group A016"],

["2018","Level 3","AA13","Dairy Cattle Farming","Dollars (millions)","H21","Opening stocks","Financial performance","6521","ANZSIC06 group A016"],

["2018","Level 3","AA13","Dairy Cattle Farming","Dollars (millions)","H22","Closing stocks","Financial performance","6388","ANZSIC06 group A016"],

["2018","Level 3","AA13","Dairy Cattle Farming","Dollars (millions)","H23","Surplus before income tax","Financial performance","1746","ANZSIC06 group A016"],

["2018","Level 3","AA13","Dairy Cattle Farming","Dollars (millions)","H24","Total assets","Financial position","64724","ANZSIC06 group A016"],

["2018","Level 3","AA13","Dairy Cattle Farming","Dollars (millions)","H25","Current assets","Financial position","11749","ANZSIC06 group A016"],

["2018","Level 3","AA13","Dairy Cattle Farming","Dollars (millions)","H26","Fixed tangible assets","Financial position","41237","ANZSIC06 group A016"],

["2018","Level 3","AA13","Dairy Cattle Farming","Dollars (millions)","H29","Other assets","Financial position","11738","ANZSIC06 group A016"],

["2018","Level 3","AA13","Dairy Cattle Farming","Dollars (millions)","H30","Total equity and liabilities","Financial position","64724","ANZSIC06 group A016"],

["2018","Level 3","AA13","Dairy Cattle Farming","Dollars (millions)","H31","Shareholders funds or owners equity","Financial position","22473","ANZSIC06 group A016"],

["2018","Level 3","AA13","Dairy Cattle Farming","Dollars (millions)","H32","Current liabilities","Financial position","10558","ANZSIC06 group A016"],

["2018","Level 3","AA13","Dairy Cattle Farming","Dollars (millions)","H33","Other liabilities","Financial position","31693","ANZSIC06 group A016"],

["2018","Level 3","AA13","Dairy Cattle Farming","Dollars","H34","Total income per employee count","Financial ratios","536400","ANZSIC06 group A016"],

["2018","Level 3","AA13","Dairy Cattle Farming","Dollars","H35","Surplus per employee count","Financial ratios","69200","ANZSIC06 group A016"],

["2018","Level 3","AA13","Dairy Cattle Farming","Percentage","H36","Current ratio","Financial ratios","111","ANZSIC06 group A016"],

["2018","Level 3","AA13","Dairy Cattle Farming","Percentage","H37","Quick ratio","Financial ratios","51","ANZSIC06 group A016"],

["2018","Level 3","AA13","Dairy Cattle Farming","Percentage","H39","Return on equity","Financial ratios","8","ANZSIC06 group A016"],

["2018","Level 3","AA13","Dairy Cattle Farming","Percentage","H40","Return on total assets","Financial ratios","3","ANZSIC06 group A016"],

["2018","Level 3","AA13","Dairy Cattle Farming","Percentage","H41","Liabilities structure","Financial ratios","35","ANZSIC06 group A016"],

["2018","Level 4","AA131","Dairy Cattle Farming","Dollars (millions)","H01","Total income","Financial performance","13537","ANZSIC06 group A016"],

["2018","Level 4","AA131","Dairy Cattle Farming","Dollars (millions)","H04","Sales, government funding, grants and subsidies","Financial performance","13011","ANZSIC06 group A016"],

["2018","Level 4","AA131","Dairy Cattle Farming","Dollars (millions)","H05","Interest, dividends and donations","Financial performance","181","ANZSIC06 group A016"],

["2018","Level 4","AA131","Dairy Cattle Farming","Dollars (millions)","H07","Non-operating income","Financial performance","345","ANZSIC06 group A016"],

["2018","Level 4","AA131","Dairy Cattle Farming","Dollars (millions)","H08","Total expenditure","Financial performance","11658","ANZSIC06 group A016"],

["2018","Level 4","AA131","Dairy Cattle Farming","Dollars (millions)","H09","Interest and donations","Financial performance","1568","ANZSIC06 group A016"],

["2018","Level 4","AA131","Dairy Cattle Farming","Dollars (millions)","H10","Indirect taxes","Financial performance","172","ANZSIC06 group A016"],

["2018","Level 4","AA131","Dairy Cattle Farming","Dollars (millions)","H11","Depreciation","Financial performance","633","ANZSIC06 group A016"],

["2018","Level 4","AA131","Dairy Cattle Farming","Dollars (millions)","H12","Salaries and wages paid","Financial performance","1442","ANZSIC06 group A016"],

["2018","Level 4","AA131","Dairy Cattle Farming","Dollars (millions)","H13","Redundancy and severance","Financial performance","0","ANZSIC06 group A016"],

["2018","Level 4","AA131","Dairy Cattle Farming","Dollars (millions)","H19","Purchases and other operating expenses","Financial performance","7807","ANZSIC06 group A016"],

["2018","Level 4","AA131","Dairy Cattle Farming","Dollars (millions)","H20","Non-operating expenses","Financial performance","35","ANZSIC06 group A016"],

["2018","Level 4","AA131","Dairy Cattle Farming","Dollars (millions)","H21","Opening stocks","Financial performance","6521","ANZSIC06 group A016"],

["2018","Level 4","AA131","Dairy Cattle Farming","Dollars (millions)","H22","Closing stocks","Financial performance","6388","ANZSIC06 group A016"],

["2018","Level 4","AA131","Dairy Cattle Farming","Dollars (millions)","H23","Surplus before income tax","Financial performance","1746","ANZSIC06 group A016"],

["2018","Level 4","AA131","Dairy Cattle Farming","Dollars (millions)","H24","Total assets","Financial position","64724","ANZSIC06 group A016"],

["2018","Level 4","AA131","Dairy Cattle Farming","Dollars (millions)","H25","Current assets","Financial position","11749","ANZSIC06 group A016"],

["2018","Level 4","AA131","Dairy Cattle Farming","Dollars (millions)","H26","Fixed tangible assets","Financial position","41237","ANZSIC06 group A016"],

["2018","Level 4","AA131","Dairy Cattle Farming","Dollars (millions)","H29","Other assets","Financial position","11738","ANZSIC06 group A016"],

["2018","Level 4","AA131","Dairy Cattle Farming","Dollars (millions)","H30","Total equity and liabilities","Financial position","64724","ANZSIC06 group A016"],

["2018","Level 4","AA131","Dairy Cattle Farming","Dollars (millions)","H31","Shareholders funds or owners equity","Financial position","22473","ANZSIC06 group A016"],

["2018","Level 4","AA131","Dairy Cattle Farming","Dollars (millions)","H32","Current liabilities","Financial position","10558","ANZSIC06 group A016"],

["2018","Level 4","AA131","Dairy Cattle Farming","Dollars (millions)","H33","Other liabilities","Financial position","31693","ANZSIC06 group A016"],

["2018","Level 4","AA131","Dairy Cattle Farming","Dollars","H34","Total income per employee count","Financial ratios","536400","ANZSIC06 group A016"],

["2018","Level 4","AA131","Dairy Cattle Farming","Dollars","H35","Surplus per employee count","Financial ratios","69200","ANZSIC06 group A016"],

["2018","Level 4","AA131","Dairy Cattle Farming","Percentage","H36","Current ratio","Financial ratios","111","ANZSIC06 group A016"],

["2018","Level 4","AA131","Dairy Cattle Farming","Percentage","H37","Quick ratio","Financial ratios","51","ANZSIC06 group A016"],

["2018","Level 4","AA131","Dairy Cattle Farming","Percentage","H39","Return on equity","Financial ratios","8","ANZSIC06 group A016"],

["2018","Level 4","AA131","Dairy Cattle Farming","Percentage","H40","Return on total assets","Financial ratios","3","ANZSIC06 group A016"],

["2018","Level 4","AA131","Dairy Cattle Farming","Percentage","H41","Liabilities structure","Financial ratios","35","ANZSIC06 group A016"],

["2018","Level 3","AA14","Poultry, Deer and Other Livestock Farming","Dollars (millions)","H01","Total income","Financial performance","2111","ANZSIC06 groups A017, A018, and A019"],

["2018","Level 3","AA14","Poultry, Deer and Other Livestock Farming","Dollars (millions)","H04","Sales, government funding, grants and subsidies","Financial performance","2028","ANZSIC06 groups A017, A018, and A019"],

["2018","Level 3","AA14","Poultry, Deer and Other Livestock Farming","Dollars (millions)","H05","Interest, dividends and donations","Financial performance","24","ANZSIC06 groups A017, A018, and A019"],

["2018","Level 3","AA14","Poultry, Deer and Other Livestock Farming","Dollars (millions)","H07","Non-operating income","Financial performance","59","ANZSIC06 groups A017, A018, and A019"],

["2018","Level 3","AA14","Poultry, Deer and Other Livestock Farming","Dollars (millions)","H08","Total expenditure","Financial performance","1868","ANZSIC06 groups A017, A018, and A019"],

["2018","Level 3","AA14","Poultry, Deer and Other Livestock Farming","Dollars (millions)","H09","Interest and donations","Financial performance","97","ANZSIC06 groups A017, A018, and A019"],

["2018","Level 3","AA14","Poultry, Deer and Other Livestock Farming","Dollars (millions)","H10","Indirect taxes","Financial performance","14","ANZSIC06 groups A017, A018, and A019"],

["2018","Level 3","AA14","Poultry, Deer and Other Livestock Farming","Dollars (millions)","H11","Depreciation","Financial performance","104","ANZSIC06 groups A017, A018, and A019"],

["2018","Level 3","AA14","Poultry, Deer and Other Livestock Farming","Dollars (millions)","H12","Salaries and wages paid","Financial performance","274","ANZSIC06 groups A017, A018, and A019"],

["2018","Level 3","AA14","Poultry, Deer and Other Livestock Farming","Dollars (millions)","H13","Redundancy and severance","Financial performance","0","ANZSIC06 groups A017, A018, and A019"],

["2018","Level 3","AA14","Poultry, Deer and Other Livestock Farming","Dollars (millions)","H19","Purchases and other operating expenses","Financial performance","1373","ANZSIC06 groups A017, A018, and A019"],

["2018","Level 3","AA14","Poultry, Deer and Other Livestock Farming","Dollars (millions)","H20","Non-operating expenses","Financial performance","6","ANZSIC06 groups A017, A018, and A019"],

["2018","Level 3","AA14","Poultry, Deer and Other Livestock Farming","Dollars (millions)","H21","Opening stocks","Financial performance","620","ANZSIC06 groups A017, A018, and A019"],

["2018","Level 3","AA14","Poultry, Deer and Other Livestock Farming","Dollars (millions)","H22","Closing stocks","Financial performance","655","ANZSIC06 groups A017, A018, and A019"],

["2018","Level 3","AA14","Poultry, Deer and Other Livestock Farming","Dollars (millions)","H23","Surplus before income tax","Financial performance","277","ANZSIC06 groups A017, A018, and A019"],

["2018","Level 3","AA14","Poultry, Deer and Other Livestock Farming","Dollars (millions)","H24","Total assets","Financial position","6439","ANZSIC06 groups A017, A018, and A019"],

["2018","Level 3","AA14","Poultry, Deer and Other Livestock Farming","Dollars (millions)","H25","Current assets","Financial position","1800","ANZSIC06 groups A017, A018, and A019"],

["2018","Level 3","AA14","Poultry, Deer and Other Livestock Farming","Dollars (millions)","H26","Fixed tangible assets","Financial position","3754","ANZSIC06 groups A017, A018, and A019"],

["2018","Level 3","AA14","Poultry, Deer and Other Livestock Farming","Dollars (millions)","H29","Other assets","Financial position","885","ANZSIC06 groups A017, A018, and A019"],

["2018","Level 3","AA14","Poultry, Deer and Other Livestock Farming","Dollars (millions)","H30","Total equity and liabilities","Financial position","6439","ANZSIC06 groups A017, A018, and A019"],

["2018","Level 3","AA14","Poultry, Deer and Other Livestock Farming","Dollars (millions)","H31","Shareholders funds or owners equity","Financial position","2734","ANZSIC06 groups A017, A018, and A019"],

["2018","Level 3","AA14","Poultry, Deer and Other Livestock Farming","Dollars (millions)","H32","Current liabilities","Financial position","1619","ANZSIC06 groups A017, A018, and A019"],

["2018","Level 3","AA14","Poultry, Deer and Other Livestock Farming","Dollars (millions)","H33","Other liabilities","Financial position","2086","ANZSIC06 groups A017, A018, and A019"],

["2018","Level 3","AA14","Poultry, Deer and Other Livestock Farming","Dollars","H34","Total income per employee count","Financial ratios","344600","ANZSIC06 groups A017, A018, and A019"],

["2018","Level 3","AA14","Poultry, Deer and Other Livestock Farming","Dollars","H35","Surplus per employee count","Financial ratios","45200","ANZSIC06 groups A017, A018, and A019"],

["2018","Level 3","AA14","Poultry, Deer and Other Livestock Farming","Percentage","H36","Current ratio","Financial ratios","111","ANZSIC06 groups A017, A018, and A019"],

["2018","Level 3","AA14","Poultry, Deer and Other Livestock Farming","Percentage","H37","Quick ratio","Financial ratios","71","ANZSIC06 groups A017, A018, and A019"],

["2018","Level 3","AA14","Poultry, Deer and Other Livestock Farming","Percentage","H39","Return on equity","Financial ratios","10","ANZSIC06 groups A017, A018, and A019"],

["2018","Level 3","AA14","Poultry, Deer and Other Livestock Farming","Percentage","H40","Return on total assets","Financial ratios","4","ANZSIC06 groups A017, A018, and A019"],

["2018","Level 3","AA14","Poultry, Deer and Other Livestock Farming","Percentage","H41","Liabilities structure","Financial ratios","42","ANZSIC06 groups A017, A018, and A019"],

["2018","Level 4","AA141","Poultry, Deer and Other Livestock Farming","Dollars (millions)","H01","Total income","Financial performance","2111","ANZSIC06 groups A017, A018, and A019"],

["2018","Level 4","AA141","Poultry, Deer and Other Livestock Farming","Dollars (millions)","H04","Sales, government funding, grants and subsidies","Financial performance","2028","ANZSIC06 groups A017, A018, and A019"],

["2018","Level 4","AA141","Poultry, Deer and Other Livestock Farming","Dollars (millions)","H05","Interest, dividends and donations","Financial performance","24","ANZSIC06 groups A017, A018, and A019"],

["2018","Level 4","AA141","Poultry, Deer and Other Livestock Farming","Dollars (millions)","H07","Non-operating income","Financial performance","59","ANZSIC06 groups A017, A018, and A019"],

["2018","Level 4","AA141","Poultry, Deer and Other Livestock Farming","Dollars (millions)","H08","Total expenditure","Financial performance","1868","ANZSIC06 groups A017, A018, and A019"],

["2018","Level 4","AA141","Poultry, Deer and Other Livestock Farming","Dollars (millions)","H09","Interest and donations","Financial performance","97","ANZSIC06 groups A017, A018, and A019"],

["2018","Level 4","AA141","Poultry, Deer and Other Livestock Farming","Dollars (millions)","H10","Indirect taxes","Financial performance","14","ANZSIC06 groups A017, A018, and A019"],

["2018","Level 4","AA141","Poultry, Deer and Other Livestock Farming","Dollars (millions)","H11","Depreciation","Financial performance","104","ANZSIC06 groups A017, A018, and A019"],

["2018","Level 4","AA141","Poultry, Deer and Other Livestock Farming","Dollars (millions)","H12","Salaries and wages paid","Financial performance","274","ANZSIC06 groups A017, A018, and A019"],

["2018","Level 4","AA141","Poultry, Deer and Other Livestock Farming","Dollars (millions)","H13","Redundancy and severance","Financial performance","0","ANZSIC06 groups A017, A018, and A019"],

["2018","Level 4","AA141","Poultry, Deer and Other Livestock Farming","Dollars (millions)","H19","Purchases and other operating expenses","Financial performance","1373","ANZSIC06 groups A017, A018, and A019"],

["2018","Level 4","AA141","Poultry, Deer and Other Livestock Farming","Dollars (millions)","H20","Non-operating expenses","Financial performance","6","ANZSIC06 groups A017, A018, and A019"],

["2018","Level 4","AA141","Poultry, Deer and Other Livestock Farming","Dollars (millions)","H21","Opening stocks","Financial performance","620","ANZSIC06 groups A017, A018, and A019"],

["2018","Level 4","AA141","Poultry, Deer and Other Livestock Farming","Dollars (millions)","H22","Closing stocks","Financial performance","655","ANZSIC06 groups A017, A018, and A019"],

["2018","Level 4","AA141","Poultry, Deer and Other Livestock Farming","Dollars (millions)","H23","Surplus before income tax","Financial performance","277","ANZSIC06 groups A017, A018, and A019"],

["2018","Level 4","AA141","Poultry, Deer and Other Livestock Farming","Dollars (millions)","H24","Total assets","Financial position","6439","ANZSIC06 groups A017, A018, and A019"],

["2018","Level 4","AA141","Poultry, Deer and Other Livestock Farming","Dollars (millions)","H25","Current assets","Financial position","1800","ANZSIC06 groups A017, A018, and A019"],

["2018","Level 4","AA141","Poultry, Deer and Other Livestock Farming","Dollars (millions)","H26","Fixed tangible assets","Financial position","3754","ANZSIC06 groups A017, A018, and A019"],

["2018","Level 4","AA141","Poultry, Deer and Other Livestock Farming","Dollars (millions)","H29","Other assets","Financial position","885","ANZSIC06 groups A017, A018, and A019"],

["2018","Level 4","AA141","Poultry, Deer and Other Livestock Farming","Dollars (millions)","H30","Total equity and liabilities","Financial position","6439","ANZSIC06 groups A017, A018, and A019"],

["2018","Level 4","AA141","Poultry, Deer and Other Livestock Farming","Dollars (millions)","H31","Shareholders funds or owners equity","Financial position","2734","ANZSIC06 groups A017, A018, and A019"],

["2018","Level 4","AA141","Poultry, Deer and Other Livestock Farming","Dollars (millions)","H32","Current liabilities","Financial position","1619","ANZSIC06 groups A017, A018, and A019"],

["2018","Level 4","AA141","Poultry, Deer and Other Livestock Farming","Dollars (millions)","H33","Other liabilities","Financial position","2086","ANZSIC06 groups A017, A018, and A019"],

["2018","Level 4","AA141","Poultry, Deer and Other Livestock Farming","Dollars","H34","Total income per employee count","Financial ratios","344600","ANZSIC06 groups A017, A018, and A019"],

["2018","Level 4","AA141","Poultry, Deer and Other Livestock Farming","Dollars","H35","Surplus per employee count","Financial ratios","45200","ANZSIC06 groups A017, A018, and A019"],

["2018","Level 4","AA141","Poultry, Deer and Other Livestock Farming","Percentage","H36","Current ratio","Financial ratios","111","ANZSIC06 groups A017, A018, and A019"],

["2018","Level 4","AA141","Poultry, Deer and Other Livestock Farming","Percentage","H37","Quick ratio","Financial ratios","71","ANZSIC06 groups A017, A018, and A019"],

["2018","Level 4","AA141","Poultry, Deer and Other Livestock Farming","Percentage","H39","Return on equity","Financial ratios","10","ANZSIC06 groups A017, A018, and A019"],

["2018","Level 4","AA141","Poultry, Deer and Other Livestock Farming","Percentage","H40","Return on total assets","Financial ratios","4","ANZSIC06 groups A017, A018, and A019"],

["2018","Level 4","AA141","Poultry, Deer and Other Livestock Farming","Percentage","H41","Liabilities structure","Financial ratios","42","ANZSIC06 groups A017, A018, and A019"],

["2018","Level 3","AA21","Forestry and Logging","Dollars (millions)","H01","Total income","Financial performance","7298","ANZSIC06 group A030"],

["2018","Level 3","AA21","Forestry and Logging","Dollars (millions)","H04","Sales of goods and services","Financial performance","5478","ANZSIC06 group A030"],

["2018","Level 3","AA21","Forestry and Logging","Dollars (millions)","H05","Interest, dividends and donations","Financial performance","30","ANZSIC06 group A030"],

["2018","Level 3","AA21","Forestry and Logging","Dollars (millions)","H06","Government funding, grants and subsidies","Financial performance","0","ANZSIC06 group A030"],

["2018","Level 3","AA21","Forestry and Logging","Dollars (millions)","H07","Non-operating income","Financial performance","1790","ANZSIC06 group A030"],

["2018","Level 3","AA21","Forestry and Logging","Dollars (millions)","H08","Total expenditure","Financial performance","4459","ANZSIC06 group A030"],

["2018","Level 3","AA21","Forestry and Logging","Dollars (millions)","H09","Interest and donations","Financial performance","182","ANZSIC06 group A030"],

["2018","Level 3","AA21","Forestry and Logging","Dollars (millions)","H10","Indirect taxes","Financial performance","19","ANZSIC06 group A030"],

["2018","Level 3","AA21","Forestry and Logging","Dollars (millions)","H11","Depreciation","Financial performance","173","ANZSIC06 group A030"],

["2018","Level 3","AA21","Forestry and Logging","Dollars (millions)","H12","Salaries and wages paid","Financial performance","371","ANZSIC06 group A030"],

["2018","Level 3","AA21","Forestry and Logging","Dollars (millions)","H13","Redundancy and severance","Financial performance","0","ANZSIC06 group A030"],

["2018","Level 3","AA21","Forestry and Logging","Dollars (millions)","H19","Purchases and other operating expenses","Financial performance","3426","ANZSIC06 group A030"],

["2018","Level 3","AA21","Forestry and Logging","Dollars (millions)","H20","Non-operating expenses","Financial performance","287","ANZSIC06 group A030"],

["2018","Level 3","AA21","Forestry and Logging","Dollars (millions)","H21","Opening stocks","Financial performance","254","ANZSIC06 group A030"],

["2018","Level 3","AA21","Forestry and Logging","Dollars (millions)","H22","Closing stocks","Financial performance","287","ANZSIC06 group A030"],

["2018","Level 3","AA21","Forestry and Logging","Dollars (millions)","H23","Surplus before income tax","Financial performance","2872","ANZSIC06 group A030"],

["2018","Level 3","AA21","Forestry and Logging","Dollars (millions)","H24","Total assets","Financial position","21891","ANZSIC06 group A030"],

["2018","Level 3","AA21","Forestry and Logging","Dollars (millions)","H25","Current assets","Financial position","2491","ANZSIC06 group A030"],

["2018","Level 3","AA21","Forestry and Logging","Dollars (millions)","H26","Fixed tangible assets","Financial position","3974","ANZSIC06 group A030"],

["2018","Level 3","AA21","Forestry and Logging","Dollars (millions)","H29","Other assets","Financial position","15426","ANZSIC06 group A030"],

["2018","Level 3","AA21","Forestry and Logging","Dollars (millions)","H30","Total equity and liabilities","Financial position","21891","ANZSIC06 group A030"],

["2018","Level 3","AA21","Forestry and Logging","Dollars (millions)","H31","Shareholders funds or owners equity","Financial position","14397","ANZSIC06 group A030"],

["2018","Level 3","AA21","Forestry and Logging","Dollars (millions)","H32","Current liabilities","Financial position","2469","ANZSIC06 group A030"],

["2018","Level 3","AA21","Forestry and Logging","Dollars (millions)","H33","Other liabilities","Financial position","5024","ANZSIC06 group A030"],

["2018","Level 3","AA21","Forestry and Logging","Dollars","H34","Total income per employee count","Financial ratios","1421800","ANZSIC06 group A030"],

["2018","Level 3","AA21","Forestry and Logging","Dollars","H35","Surplus per employee count","Financial ratios","559600","ANZSIC06 group A030"],

["2018","Level 3","AA21","Forestry and Logging","Percentage","H36","Current ratio","Financial ratios","101","ANZSIC06 group A030"],

["2018","Level 3","AA21","Forestry and Logging","Percentage","H37","Quick ratio","Financial ratios","89","ANZSIC06 group A030"],

["2018","Level 3","AA21","Forestry and Logging","Percentage","H39","Return on equity","Financial ratios","20","ANZSIC06 group A030"],

["2018","Level 3","AA21","Forestry and Logging","Percentage","H40","Return on total assets","Financial ratios","13","ANZSIC06 group A030"],

["2018","Level 3","AA21","Forestry and Logging","Percentage","H41","Liabilities structure","Financial ratios","66","ANZSIC06 group A030"],

["2018","Level 4","AA211","Forestry and Logging","Dollars (millions)","H01","Total income","Financial performance","7298","ANZSIC06 group A030"],

["2018","Level 4","AA211","Forestry and Logging","Dollars (millions)","H04","Sales of goods and services","Financial performance","5478","ANZSIC06 group A030"],

["2018","Level 4","AA211","Forestry and Logging","Dollars (millions)","H05","Interest, dividends and donations","Financial performance","30","ANZSIC06 group A030"],

["2018","Level 4","AA211","Forestry and Logging","Dollars (millions)","H06","Government funding, grants and subsidies","Financial performance","0","ANZSIC06 group A030"],

["2018","Level 4","AA211","Forestry and Logging","Dollars (millions)","H07","Non-operating income","Financial performance","1790","ANZSIC06 group A030"],

["2018","Level 4","AA211","Forestry and Logging","Dollars (millions)","H08","Total expenditure","Financial performance","4459","ANZSIC06 group A030"],

["2018","Level 4","AA211","Forestry and Logging","Dollars (millions)","H09","Interest and donations","Financial performance","182","ANZSIC06 group A030"],

["2018","Level 4","AA211","Forestry and Logging","Dollars (millions)","H10","Indirect taxes","Financial performance","19","ANZSIC06 group A030"],

["2018","Level 4","AA211","Forestry and Logging","Dollars (millions)","H11","Depreciation","Financial performance","173","ANZSIC06 group A030"],

["2018","Level 4","AA211","Forestry and Logging","Dollars (millions)","H12","Salaries and wages paid","Financial performance","371","ANZSIC06 group A030"],

["2018","Level 4","AA211","Forestry and Logging","Dollars (millions)","H13","Redundancy and severance","Financial performance","0","ANZSIC06 group A030"],

["2018","Level 4","AA211","Forestry and Logging","Dollars (millions)","H19","Purchases and other operating expenses","Financial performance","3426","ANZSIC06 group A030"],

["2018","Level 4","AA211","Forestry and Logging","Dollars (millions)","H20","Non-operating expenses","Financial performance","287","ANZSIC06 group A030"],

["2018","Level 4","AA211","Forestry and Logging","Dollars (millions)","H21","Opening stocks","Financial performance","254","ANZSIC06 group A030"],

["2018","Level 4","AA211","Forestry and Logging","Dollars (millions)","H22","Closing stocks","Financial performance","287","ANZSIC06 group A030"],

["2018","Level 4","AA211","Forestry and Logging","Dollars (millions)","H23","Surplus before income tax","Financial performance","2872","ANZSIC06 group A030"],

["2018","Level 4","AA211","Forestry and Logging","Dollars (millions)","H24","Total assets","Financial position","21891","ANZSIC06 group A030"],

["2018","Level 4","AA211","Forestry and Logging","Dollars (millions)","H25","Current assets","Financial position","2491","ANZSIC06 group A030"],

["2018","Level 4","AA211","Forestry and Logging","Dollars (millions)","H26","Fixed tangible assets","Financial position","3974","ANZSIC06 group A030"],

["2018","Level 4","AA211","Forestry and Logging","Dollars (millions)","H29","Other assets","Financial position","15426","ANZSIC06 group A030"],

["2018","Level 4","AA211","Forestry and Logging","Dollars (millions)","H30","Total equity and liabilities","Financial position","21891","ANZSIC06 group A030"],

["2018","Level 4","AA211","Forestry and Logging","Dollars (millions)","H31","Shareholders funds or owners equity","Financial position","14397","ANZSIC06 group A030"],

["2018","Level 4","AA211","Forestry and Logging","Dollars (millions)","H32","Current liabilities","Financial position","2469","ANZSIC06 group A030"],

["2018","Level 4","AA211","Forestry and Logging","Dollars (millions)","H33","Other liabilities","Financial position","5024","ANZSIC06 group A030"],

["2018","Level 4","AA211","Forestry and Logging","Dollars","H34","Total income per employee count","Financial ratios","1421800","ANZSIC06 group A030"],

["2018","Level 4","AA211","Forestry and Logging","Dollars","H35","Surplus per employee count","Financial ratios","559600","ANZSIC06 group A030"],

["2018","Level 4","AA211","Forestry and Logging","Percentage","H36","Current ratio","Financial ratios","101","ANZSIC06 group A030"],

["2018","Level 4","AA211","Forestry and Logging","Percentage","H37","Quick ratio","Financial ratios","89","ANZSIC06 group A030"],

["2018","Level 4","AA211","Forestry and Logging","Percentage","H39","Return on equity","Financial ratios","20","ANZSIC06 group A030"],

["2018","Level 4","AA211","Forestry and Logging","Percentage","H40","Return on total assets","Financial ratios","13","ANZSIC06 group A030"],

["2018","Level 4","AA211","Forestry and Logging","Percentage","H41","Liabilities structure","Financial ratios","66","ANZSIC06 group A030"],

["2018","Level 3","AA31","Fishing and Aquaculture","Dollars (millions)","H01","Total income","Financial performance","1446","ANZSIC06 groups A020 and A041"],

["2018","Level 3","AA31","Fishing and Aquaculture","Dollars (millions)","H04","Sales, government funding, grants and subsidies","Financial performance","1391","ANZSIC06 groups A020 and A041"],

["2018","Level 3","AA31","Fishing and Aquaculture","Dollars (millions)","H05","Interest, dividends and donations","Financial performance","45","ANZSIC06 groups A020 and A041"],

["2018","Level 3","AA31","Fishing and Aquaculture","Dollars (millions)","H07","Non-operating income","Financial performance","10","ANZSIC06 groups A020 and A041"],

["2018","Level 3","AA31","Fishing and Aquaculture","Dollars (millions)","H08","Total expenditure","Financial performance","1251","ANZSIC06 groups A020 and A041"],

["2018","Level 3","AA31","Fishing and Aquaculture","Dollars (millions)","H09","Interest and donations","Financial performance","22","ANZSIC06 groups A020 and A041"],

["2018","Level 3","AA31","Fishing and Aquaculture","Dollars (millions)","H10","Indirect taxes","Financial performance","19","ANZSIC06 groups A020 and A041"],

["2018","Level 3","AA31","Fishing and Aquaculture","Dollars (millions)","H11","Depreciation","Financial performance","63","ANZSIC06 groups A020 and A041"],

["2018","Level 3","AA31","Fishing and Aquaculture","Dollars (millions)","H12","Salaries and wages paid","Financial performance","214","ANZSIC06 groups A020 and A041"],

["2018","Level 3","AA31","Fishing and Aquaculture","Dollars (millions)","H13","Redundancy and severance","Financial performance","0","ANZSIC06 groups A020 and A041"],

["2018","Level 3","AA31","Fishing and Aquaculture","Dollars (millions)","H19","Purchases and other operating expenses","Financial performance","907","ANZSIC06 groups A020 and A041"],

["2018","Level 3","AA31","Fishing and Aquaculture","Dollars (millions)","H20","Non-operating expenses","Financial performance","25","ANZSIC06 groups A020 and A041"],

["2018","Level 3","AA31","Fishing and Aquaculture","Dollars (millions)","H21","Opening stocks","Financial performance","164","ANZSIC06 groups A020 and A041"],

["2018","Level 3","AA31","Fishing and Aquaculture","Dollars (millions)","H22","Closing stocks","Financial performance","167","ANZSIC06 groups A020 and A041"],

["2018","Level 3","AA31","Fishing and Aquaculture","Dollars (millions)","H23","Surplus before income tax","Financial performance","199","ANZSIC06 groups A020 and A041"],

["2018","Level 3","AA31","Fishing and Aquaculture","Dollars (millions)","H24","Total assets","Financial position","2125","ANZSIC06 groups A020 and A041"],

["2018","Level 3","AA31","Fishing and Aquaculture","Dollars (millions)","H25","Current assets","Financial position","588","ANZSIC06 groups A020 and A041"],

["2018","Level 3","AA31","Fishing and Aquaculture","Dollars (millions)","H26","Fixed tangible assets","Financial position","562","ANZSIC06 groups A020 and A041"],

["2018","Level 3","AA31","Fishing and Aquaculture","Dollars (millions)","H29","Other assets","Financial position","975","ANZSIC06 groups A020 and A041"],

["2018","Level 3","AA31","Fishing and Aquaculture","Dollars (millions)","H30","Total equity and liabilities","Financial position","2125","ANZSIC06 groups A020 and A041"],

["2018","Level 3","AA31","Fishing and Aquaculture","Dollars (millions)","H31","Shareholders funds or owners equity","Financial position","925","ANZSIC06 groups A020 and A041"],

["2018","Level 3","AA31","Fishing and Aquaculture","Dollars (millions)","H32","Current liabilities","Financial position","462","ANZSIC06 groups A020 and A041"],

["2018","Level 3","AA31","Fishing and Aquaculture","Dollars (millions)","H33","Other liabilities","Financial position","738","ANZSIC06 groups A020 and A041"],

["2018","Level 3","AA31","Fishing and Aquaculture","Dollars","H34","Total income per employee count","Financial ratios","481100","ANZSIC06 groups A020 and A041"],

["2018","Level 3","AA31","Fishing and Aquaculture","Dollars","H35","Surplus per employee count","Financial ratios","66100","ANZSIC06 groups A020 and A041"],

["2018","Level 3","AA31","Fishing and Aquaculture","Percentage","H36","Current ratio","Financial ratios","127","ANZSIC06 groups A020 and A041"],

["2018","Level 3","AA31","Fishing and Aquaculture","Percentage","H37","Quick ratio","Financial ratios","91","ANZSIC06 groups A020 and A041"],

["2018","Level 3","AA31","Fishing and Aquaculture","Percentage","H39","Return on equity","Financial ratios","21","ANZSIC06 groups A020 and A041"],

["2018","Level 3","AA31","Fishing and Aquaculture","Percentage","H40","Return on total assets","Financial ratios","9","ANZSIC06 groups A020 and A041"],

["2018","Level 3","AA31","Fishing and Aquaculture","Percentage","H41","Liabilities structure","Financial ratios","44","ANZSIC06 groups A020 and A041"],

["2018","Level 3","AA32","Agriculture, Forestry and Fishing Support Services and Hunting","Dollars (millions)","H01","Total income","Financial performance","4374","ANZSIC06 groups A042, A051, and A052"],

["2018","Level 3","AA32","Agriculture, Forestry and Fishing Support Services and Hunting","Dollars (millions)","H04","Sales of goods and services","Financial performance","4270","ANZSIC06 groups A042, A051, and A052"],

["2018","Level 3","AA32","Agriculture, Forestry and Fishing Support Services and Hunting","Dollars (millions)","H05","Interest, dividends and donations","Financial performance","24","ANZSIC06 groups A042, A051, and A052"],

["2018","Level 3","AA32","Agriculture, Forestry and Fishing Support Services and Hunting","Dollars (millions)","H06","Government funding, grants and subsidies","Financial performance","11","ANZSIC06 groups A042, A051, and A052"],

["2018","Level 3","AA32","Agriculture, Forestry and Fishing Support Services and Hunting","Dollars (millions)","H07","Non-operating income","Financial performance","69","ANZSIC06 groups A042, A051, and A052"],

["2018","Level 3","AA32","Agriculture, Forestry and Fishing Support Services and Hunting","Dollars (millions)","H08","Total expenditure","Financial performance","3969","ANZSIC06 groups A042, A051, and A052"],

["2018","Level 3","AA32","Agriculture, Forestry and Fishing Support Services and Hunting","Dollars (millions)","H09","Interest and donations","Financial performance","111","ANZSIC06 groups A042, A051, and A052"],

["2018","Level 3","AA32","Agriculture, Forestry and Fishing Support Services and Hunting","Dollars (millions)","H10","Indirect taxes","Financial performance","15","ANZSIC06 groups A042, A051, and A052"],

["2018","Level 3","AA32","Agriculture, Forestry and Fishing Support Services and Hunting","Dollars (millions)","H11","Depreciation","Financial performance","265","ANZSIC06 groups A042, A051, and A052"],

["2018","Level 3","AA32","Agriculture, Forestry and Fishing Support Services and Hunting","Dollars (millions)","H12","Salaries and wages paid","Financial performance","1239","ANZSIC06 groups A042, A051, and A052"],

["2018","Level 3","AA32","Agriculture, Forestry and Fishing Support Services and Hunting","Dollars (millions)","H13","Redundancy and severance","Financial performance","0","ANZSIC06 groups A042, A051, and A052"],

["2018","Level 3","AA32","Agriculture, Forestry and Fishing Support Services and Hunting","Dollars (millions)","H19","Purchases and other operating expenses","Financial performance","2301","ANZSIC06 groups A042, A051, and A052"],

["2018","Level 3","AA32","Agriculture, Forestry and Fishing Support Services and Hunting","Dollars (millions)","H20","Non-operating expenses","Financial performance","38","ANZSIC06 groups A042, A051, and A052"],

["2018","Level 3","AA32","Agriculture, Forestry and Fishing Support Services and Hunting","Dollars (millions)","H21","Opening stocks","Financial performance","247","ANZSIC06 groups A042, A051, and A052"],

["2018","Level 3","AA32","Agriculture, Forestry and Fishing Support Services and Hunting","Dollars (millions)","H22","Closing stocks","Financial performance","260","ANZSIC06 groups A042, A051, and A052"],

["2018","Level 3","AA32","Agriculture, Forestry and Fishing Support Services and Hunting","Dollars (millions)","H23","Surplus before income tax","Financial performance","418","ANZSIC06 groups A042, A051, and A052"],

["2018","Level 3","AA32","Agriculture, Forestry and Fishing Support Services and Hunting","Dollars (millions)","H24","Total assets","Financial position","6233","ANZSIC06 groups A042, A051, and A052"],

["2018","Level 3","AA32","Agriculture, Forestry and Fishing Support Services and Hunting","Dollars (millions)","H25","Current assets","Financial position","1614","ANZSIC06 groups A042, A051, and A052"],

["2018","Level 3","AA32","Agriculture, Forestry and Fishing Support Services and Hunting","Dollars (millions)","H26","Fixed tangible assets","Financial position","3538","ANZSIC06 groups A042, A051, and A052"],

["2018","Level 3","AA32","Agriculture, Forestry and Fishing Support Services and Hunting","Dollars (millions)","H29","Other assets","Financial position","1081","ANZSIC06 groups A042, A051, and A052"],

["2018","Level 3","AA32","Agriculture, Forestry and Fishing Support Services and Hunting","Dollars (millions)","H30","Total equity and liabilities","Financial position","6233","ANZSIC06 groups A042, A051, and A052"],

["2018","Level 3","AA32","Agriculture, Forestry and Fishing Support Services and Hunting","Dollars (millions)","H31","Shareholders funds or owners equity","Financial position","2578","ANZSIC06 groups A042, A051, and A052"],

["2018","Level 3","AA32","Agriculture, Forestry and Fishing Support Services and Hunting","Dollars (millions)","H32","Current liabilities","Financial position","1662","ANZSIC06 groups A042, A051, and A052"],

["2018","Level 3","AA32","Agriculture, Forestry and Fishing Support Services and Hunting","Dollars (millions)","H33","Other liabilities","Financial position","1992","ANZSIC06 groups A042, A051, and A052"],

["2018","Level 3","AA32","Agriculture, Forestry and Fishing Support Services and Hunting","Dollars","H34","Total income per employee count","Financial ratios","158000","ANZSIC06 groups A042, A051, and A052"],

["2018","Level 3","AA32","Agriculture, Forestry and Fishing Support Services and Hunting","Dollars","H35","Surplus per employee count","Financial ratios","15100","ANZSIC06 groups A042, A051, and A052"],

["2018","Level 3","AA32","Agriculture, Forestry and Fishing Support Services and Hunting","Percentage","H36","Current ratio","Financial ratios","97","ANZSIC06 groups A042, A051, and A052"],

["2018","Level 3","AA32","Agriculture, Forestry and Fishing Support Services and Hunting","Percentage","H37","Quick ratio","Financial ratios","81","ANZSIC06 groups A042, A051, and A052"],

["2018","Level 3","AA32","Agriculture, Forestry and Fishing Support Services and Hunting","Percentage","H39","Return on equity","Financial ratios","16","ANZSIC06 groups A042, A051, and A052"],

["2018","Level 3","AA32","Agriculture, Forestry and Fishing Support Services and Hunting","Percentage","H40","Return on total assets","Financial ratios","7","ANZSIC06 groups A042, A051, and A052"],

["2018","Level 3","AA32","Agriculture, Forestry and Fishing Support Services and Hunting","Percentage","H41","Liabilities structure","Financial ratios","41","ANZSIC06 groups A042, A051, and A052"],

["2018","Level 1","BB","Mining","Dollars (millions)","H01","Total income","Financial performance","7494","ANZSIC06 division B"],

["2018","Level 1","BB","Mining","Dollars (millions)","H04","Sales of goods and services","Financial performance","5374","ANZSIC06 division B"],

["2018","Level 1","BB","Mining","Dollars (millions)","H05","Interest, dividends and donations","Financial performance","1366","ANZSIC06 division B"],

["2018","Level 1","BB","Mining","Dollars (millions)","H06","Government funding, grants and subsidies","Financial performance","2","ANZSIC06 division B"],

["2018","Level 1","BB","Mining","Dollars (millions)","H07","Non-operating income","Financial performance","752","ANZSIC06 division B"],

["2018","Level 1","BB","Mining","Dollars (millions)","H08","Total expenditure","Financial performance","5299","ANZSIC06 division B"],

["2018","Level 1","BB","Mining","Dollars (millions)","H09","Interest and donations","Financial performance","174","ANZSIC06 division B"],

["2018","Level 1","BB","Mining","Dollars (millions)","H10","Indirect taxes","Financial performance","40","ANZSIC06 division B"],

["2018","Level 1","BB","Mining","Dollars (millions)","H11","Depreciation","Financial performance","1072","ANZSIC06 division B"],

["2018","Level 1","BB","Mining","Dollars (millions)","H12","Salaries and wages paid","Financial performance","644","ANZSIC06 division B"],

["2018","Level 1","BB","Mining","Dollars (millions)","H13","Redundancy and severance","Financial performance","4","ANZSIC06 division B"],

["2018","Level 1","BB","Mining","Dollars (millions)","H19","Purchases and other operating expenses","Financial performance","2526","ANZSIC06 division B"],

["2018","Level 1","BB","Mining","Dollars (millions)","H20","Non-operating expenses","Financial performance","844","ANZSIC06 division B"],

["2018","Level 1","BB","Mining","Dollars (millions)","H21","Opening stocks","Financial performance","276","ANZSIC06 division B"],

["2018","Level 1","BB","Mining","Dollars (millions)","H22","Closing stocks","Financial performance","288","ANZSIC06 division B"],

["2018","Level 1","BB","Mining","Dollars (millions)","H23","Surplus before income tax","Financial performance","2207","ANZSIC06 division B"],

["2018","Level 1","BB","Mining","Dollars (millions)","H24","Total assets","Financial position","12918","ANZSIC06 division B"],

["2018","Level 1","BB","Mining","Dollars (millions)","H25","Current assets","Financial position","4917","ANZSIC06 division B"],

["2018","Level 1","BB","Mining","Dollars (millions)","H26","Fixed tangible assets","Financial position","5948","ANZSIC06 division B"],

["2018","Level 1","BB","Mining","Dollars (millions)","H27","Additions to fixed assets","Financial position","821","ANZSIC06 division B"],

["2018","Level 1","BB","Mining","Dollars (millions)","H28","Disposals of fixed assets","Financial position","134","ANZSIC06 division B"],

["2018","Level 1","BB","Mining","Dollars (millions)","H29","Other assets","Financial position","2053","ANZSIC06 division B"],

["2018","Level 1","BB","Mining","Dollars (millions)","H30","Total equity and liabilities","Financial position","12918","ANZSIC06 division B"],

["2018","Level 1","BB","Mining","Dollars (millions)","H31","Shareholders funds or owners equity","Financial position","4116","ANZSIC06 division B"],

["2018","Level 1","BB","Mining","Dollars (millions)","H32","Current liabilities","Financial position","3919","ANZSIC06 division B"],

["2018","Level 1","BB","Mining","Dollars (millions)","H33","Other liabilities","Financial position","4883","ANZSIC06 division B"],

["2018","Level 1","BB","Mining","Dollars","H34","Total income per employee count","Financial ratios","1442500","ANZSIC06 division B"],

["2018","Level 1","BB","Mining","Dollars","H35","Surplus per employee count","Financial ratios","424900","ANZSIC06 division B"],

["2018","Level 1","BB","Mining","Percentage","H36","Current ratio","Financial ratios","125","ANZSIC06 division B"],

["2018","Level 1","BB","Mining","Percentage","H37","Quick ratio","Financial ratios","118","ANZSIC06 division B"],

["2018","Level 1","BB","Mining","Percentage","H39","Return on equity","Financial ratios","54","ANZSIC06 division B"],

["2018","Level 1","BB","Mining","Percentage","H40","Return on total assets","Financial ratios","17","ANZSIC06 division B"],

["2018","Level 1","BB","Mining","Percentage","H41","Liabilities structure","Financial ratios","32","ANZSIC06 division B"],

["2018","Level 1","CC","Manufacturing","Dollars (millions)","H01","Total income","Financial performance","112031","ANZSIC06 division C"],

["2018","Level 1","CC","Manufacturing","Dollars (millions)","H02","Sales of goods not further processed","Financial performance","10083","ANZSIC06 division C"],

["2018","Level 1","CC","Manufacturing","Dollars (millions)","H03","Sales of other goods and services","Financial performance","100696","ANZSIC06 division C"],

["2018","Level 1","CC","Manufacturing","Dollars (millions)","H05","Interest, dividends and donations","Financial performance","557","ANZSIC06 division C"],

["2018","Level 1","CC","Manufacturing","Dollars (millions)","H06","Government funding, grants and subsidies","Financial performance","86","ANZSIC06 division C"],

["2018","Level 1","CC","Manufacturing","Dollars (millions)","H07","Non-operating income","Financial performance","608","ANZSIC06 division C"],

["2018","Level 1","CC","Manufacturing","Dollars (millions)","H08","Total expenditure","Financial performance","105531","ANZSIC06 division C"],

["2018","Level 1","CC","Manufacturing","Dollars (millions)","H09","Interest and donations","Financial performance","843","ANZSIC06 division C"],

["2018","Level 1","CC","Manufacturing","Dollars (millions)","H10","Indirect taxes","Financial performance","3676","ANZSIC06 division C"],

["2018","Level 1","CC","Manufacturing","Dollars (millions)","H11","Depreciation","Financial performance","2782","ANZSIC06 division C"],

["2018","Level 1","CC","Manufacturing","Dollars (millions)","H12","Salaries and wages paid","Financial performance","15244","ANZSIC06 division C"],

["2018","Level 1","CC","Manufacturing","Dollars (millions)","H13","Redundancy and severance","Financial performance","23","ANZSIC06 division C"],

["2018","Level 1","CC","Manufacturing","Dollars (millions)","H17","Purchases of goods bought for resale","Financial performance","7699","ANZSIC06 division C"],

["2018","Level 1","CC","Manufacturing","Dollars (millions)","H18","Other Purchases and operating expenses","Financial performance","74271","ANZSIC06 division C"],

["2018","Level 1","CC","Manufacturing","Dollars (millions)","H20","Non-operating expenses","Financial performance","1016","ANZSIC06 division C"],

["2018","Level 1","CC","Manufacturing","Dollars (millions)","H21","Opening stocks","Financial performance","12824","ANZSIC06 division C"],

["2018","Level 1","CC","Manufacturing","Dollars (millions)","H22","Closing stocks","Financial performance","14208","ANZSIC06 division C"],

["2018","Level 1","CC","Manufacturing","Dollars (millions)","H23","Surplus before income tax","Financial performance","7884","ANZSIC06 division C"],

["2018","Level 1","CC","Manufacturing","Dollars (millions)","H24","Total assets","Financial position","86115","ANZSIC06 division C"],

["2018","Level 1","CC","Manufacturing","Dollars (millions)","H25","Current assets","Financial position","39837","ANZSIC06 division C"],

["2018","Level 1","CC","Manufacturing","Dollars (millions)","H26","Fixed tangible assets","Financial position","28375","ANZSIC06 division C"],

["2018","Level 1","CC","Manufacturing","Dollars (millions)","H27","Additions to fixed assets","Financial position","4631","ANZSIC06 division C"],

["2018","Level 1","CC","Manufacturing","Dollars (millions)","H28","Disposals of fixed assets","Financial position","1922","ANZSIC06 division C"],

["2018","Level 1","CC","Manufacturing","Dollars (millions)","H29","Other assets","Financial position","17903","ANZSIC06 division C"],

["2018","Level 1","CC","Manufacturing","Dollars (millions)","H30","Total equity and liabilities","Financial position","86115","ANZSIC06 division C"],

["2018","Level 1","CC","Manufacturing","Dollars (millions)","H31","Shareholders funds or owners equity","Financial position","41662","ANZSIC06 division C"],

["2018","Level 1","CC","Manufacturing","Dollars (millions)","H32","Current liabilities","Financial position","27659","ANZSIC06 division C"],

["2018","Level 1","CC","Manufacturing","Dollars (millions)","H33","Other liabilities","Financial position","16793","ANZSIC06 division C"],

["2018","Level 1","CC","Manufacturing","Dollars","H34","Total income per employee count","Financial ratios","476900","ANZSIC06 division C"],

["2018","Level 1","CC","Manufacturing","Dollars","H35","Surplus per employee count","Financial ratios","33600","ANZSIC06 division C"],

["2018","Level 1","CC","Manufacturing","Percentage","H36","Current ratio","Financial ratios","144","ANZSIC06 division C"],

["2018","Level 1","CC","Manufacturing","Percentage","H37","Quick ratio","Financial ratios","93","ANZSIC06 division C"],

["2018","Level 1","CC","Manufacturing","Percentage","H38","Margin on sales of goods for resale","Financial ratios","24","ANZSIC06 division C"],

["2018","Level 1","CC","Manufacturing","Percentage","H39","Return on equity","Financial ratios","19","ANZSIC06 division C"],

["2018","Level 1","CC","Manufacturing","Percentage","H40","Return on total assets","Financial ratios","9","ANZSIC06 division C"],

["2018","Level 1","CC","Manufacturing","Percentage","H41","Liabilities structure","Financial ratios","48","ANZSIC06 division C"],

["2018","Level 3","CC15","Beverage and Tobacco Product Manufacturing","Dollars (millions)","H01","Total income","Financial performance","6222","ANZSIC06 groups C121 and C122"],

["2018","Level 3","CC15","Beverage and Tobacco Product Manufacturing","Dollars (millions)","H02","Sales of goods not further processed","Financial performance","303","ANZSIC06 groups C121 and C122"],

["2018","Level 3","CC15","Beverage and Tobacco Product Manufacturing","Dollars (millions)","H03","Sales of other goods and services","Financial performance","5823","ANZSIC06 groups C121 and C122"],

["2018","Level 3","CC15","Beverage and Tobacco Product Manufacturing","Dollars (millions)","H05","Interest, dividends and donations","Financial performance","34","ANZSIC06 groups C121 and C122"],

["2018","Level 3","CC15","Beverage and Tobacco Product Manufacturing","Dollars (millions)","H06","Government funding, grants and subsidies","Financial performance","2","ANZSIC06 groups C121 and C122"],

["2018","Level 3","CC15","Beverage and Tobacco Product Manufacturing","Dollars (millions)","H07","Non-operating income","Financial performance","60","ANZSIC06 groups C121 and C122"],

["2018","Level 3","CC15","Beverage and Tobacco Product Manufacturing","Dollars (millions)","H08","Total expenditure","Financial performance","5770","ANZSIC06 groups C121 and C122"],

["2018","Level 3","CC15","Beverage and Tobacco Product Manufacturing","Dollars (millions)","H09","Interest and donations","Financial performance","119","ANZSIC06 groups C121 and C122"],

["2018","Level 3","CC15","Beverage and Tobacco Product Manufacturing","Dollars (millions)","H10","Indirect taxes","Financial performance","1127","ANZSIC06 groups C121 and C122"],

["2018","Level 3","CC15","Beverage and Tobacco Product Manufacturing","Dollars (millions)","H11","Depreciation","Financial performance","215","ANZSIC06 groups C121 and C122"],

["2018","Level 3","CC15","Beverage and Tobacco Product Manufacturing","Dollars (millions)","H12","Salaries and wages paid","Financial performance","621","ANZSIC06 groups C121 and C122"],

["2018","Level 3","CC15","Beverage and Tobacco Product Manufacturing","Dollars (millions)","H13","Redundancy and severance","Financial performance","4","ANZSIC06 groups C121 and C122"],

["2018","Level 3","CC15","Beverage and Tobacco Product Manufacturing","Dollars (millions)","H17","Purchases of goods bought for resale","Financial performance","202","ANZSIC06 groups C121 and C122"],

["2018","Level 3","CC15","Beverage and Tobacco Product Manufacturing","Dollars (millions)","H18","Other Purchases and operating expenses","Financial performance","3448","ANZSIC06 groups C121 and C122"],

["2018","Level 3","CC15","Beverage and Tobacco Product Manufacturing","Dollars (millions)","H20","Non-operating expenses","Financial performance","37","ANZSIC06 groups C121 and C122"],

["2018","Level 3","CC15","Beverage and Tobacco Product Manufacturing","Dollars (millions)","H21","Opening stocks","Financial performance","1675","ANZSIC06 groups C121 and C122"],

["2018","Level 3","CC15","Beverage and Tobacco Product Manufacturing","Dollars (millions)","H22","Closing stocks","Financial performance","1755","ANZSIC06 groups C121 and C122"],

["2018","Level 3","CC15","Beverage and Tobacco Product Manufacturing","Dollars (millions)","H23","Surplus before income tax","Financial performance","533","ANZSIC06 groups C121 and C122"],

["2018","Level 3","CC15","Beverage and Tobacco Product Manufacturing","Dollars (millions)","H24","Total assets","Financial position","9437","ANZSIC06 groups C121 and C122"],

["2018","Level 3","CC15","Beverage and Tobacco Product Manufacturing","Dollars (millions)","H25","Current assets","Financial position","3769","ANZSIC06 groups C121 and C122"],

["2018","Level 3","CC15","Beverage and Tobacco Product Manufacturing","Dollars (millions)","H26","Fixed tangible assets","Financial position","3886","ANZSIC06 groups C121 and C122"],

["2018","Level 3","CC15","Beverage and Tobacco Product Manufacturing","Dollars (millions)","H27","Additions to fixed assets","Financial position","533","ANZSIC06 groups C121 and C122"],

["2018","Level 3","CC15","Beverage and Tobacco Product Manufacturing","Dollars (millions)","H28","Disposals of fixed assets","Financial position","150","ANZSIC06 groups C121 and C122"],

["2018","Level 3","CC15","Beverage and Tobacco Product Manufacturing","Dollars (millions)","H29","Other assets","Financial position","1782","ANZSIC06 groups C121 and C122"],

["2018","Level 3","CC15","Beverage and Tobacco Product Manufacturing","Dollars (millions)","H30","Total equity and liabilities","Financial position","9437","ANZSIC06 groups C121 and C122"],

["2018","Level 3","CC15","Beverage and Tobacco Product Manufacturing","Dollars (millions)","H31","Shareholders funds or owners equity","Financial position","4340","ANZSIC06 groups C121 and C122"],

["2018","Level 3","CC15","Beverage and Tobacco Product Manufacturing","Dollars (millions)","H32","Current liabilities","Financial position","2300","ANZSIC06 groups C121 and C122"],

["2018","Level 3","CC15","Beverage and Tobacco Product Manufacturing","Dollars (millions)","H33","Other liabilities","Financial position","2797","ANZSIC06 groups C121 and C122"],

["2018","Level 3","CC15","Beverage and Tobacco Product Manufacturing","Dollars","H34","Total income per employee count","Financial ratios","606900","ANZSIC06 groups C121 and C122"],

["2018","Level 3","CC15","Beverage and Tobacco Product Manufacturing","Dollars","H35","Surplus per employee count","Financial ratios","51900","ANZSIC06 groups C121 and C122"],

["2018","Level 3","CC15","Beverage and Tobacco Product Manufacturing","Percentage","H36","Current ratio","Financial ratios","164","ANZSIC06 groups C121 and C122"],

["2018","Level 3","CC15","Beverage and Tobacco Product Manufacturing","Percentage","H37","Quick ratio","Financial ratios","88","ANZSIC06 groups C121 and C122"],

["2018","Level 3","CC15","Beverage and Tobacco Product Manufacturing","Percentage","H38","Margin on sales of goods for resale","Financial ratios","33","ANZSIC06 groups C121 and C122"],

["2018","Level 3","CC15","Beverage and Tobacco Product Manufacturing","Percentage","H39","Return on equity","Financial ratios","12","ANZSIC06 groups C121 and C122"],

["2018","Level 3","CC15","Beverage and Tobacco Product Manufacturing","Percentage","H40","Return on total assets","Financial ratios","6","ANZSIC06 groups C121 and C122"],

["2018","Level 3","CC15","Beverage and Tobacco Product Manufacturing","Percentage","H41","Liabilities structure","Financial ratios","46","ANZSIC06 groups C121 and C122"],

["2018","Level 4","CC151","Beverage and Tobacco Product Manufacturing","Dollars (millions)","H01","Total income","Financial performance","6222","ANZSIC06 groups C121 and C122"],

["2018","Level 4","CC151","Beverage and Tobacco Product Manufacturing","Dollars (millions)","H02","Sales of goods not further processed","Financial performance","303","ANZSIC06 groups C121 and C122"],

["2018","Level 4","CC151","Beverage and Tobacco Product Manufacturing","Dollars (millions)","H03","Sales of other goods and services","Financial performance","5823","ANZSIC06 groups C121 and C122"],

["2018","Level 4","CC151","Beverage and Tobacco Product Manufacturing","Dollars (millions)","H05","Interest, dividends and donations","Financial performance","34","ANZSIC06 groups C121 and C122"],

["2018","Level 4","CC151","Beverage and Tobacco Product Manufacturing","Dollars (millions)","H06","Government funding, grants and subsidies","Financial performance","2","ANZSIC06 groups C121 and C122"],

["2018","Level 4","CC151","Beverage and Tobacco Product Manufacturing","Dollars (millions)","H07","Non-operating income","Financial performance","60","ANZSIC06 groups C121 and C122"],

["2018","Level 4","CC151","Beverage and Tobacco Product Manufacturing","Dollars (millions)","H08","Total expenditure","Financial performance","5770","ANZSIC06 groups C121 and C122"],

["2018","Level 4","CC151","Beverage and Tobacco Product Manufacturing","Dollars (millions)","H09","Interest and donations","Financial performance","119","ANZSIC06 groups C121 and C122"],

["2018","Level 4","CC151","Beverage and Tobacco Product Manufacturing","Dollars (millions)","H10","Indirect taxes","Financial performance","1127","ANZSIC06 groups C121 and C122"],

["2018","Level 4","CC151","Beverage and Tobacco Product Manufacturing","Dollars (millions)","H11","Depreciation","Financial performance","215","ANZSIC06 groups C121 and C122"],

["2018","Level 4","CC151","Beverage and Tobacco Product Manufacturing","Dollars (millions)","H12","Salaries and wages paid","Financial performance","621","ANZSIC06 groups C121 and C122"],

["2018","Level 4","CC151","Beverage and Tobacco Product Manufacturing","Dollars (millions)","H13","Redundancy and severance","Financial performance","4","ANZSIC06 groups C121 and C122"],

["2018","Level 4","CC151","Beverage and Tobacco Product Manufacturing","Dollars (millions)","H17","Purchases of goods bought for resale","Financial performance","202","ANZSIC06 groups C121 and C122"],

["2018","Level 4","CC151","Beverage and Tobacco Product Manufacturing","Dollars (millions)","H18","Other Purchases and operating expenses","Financial performance","3448","ANZSIC06 groups C121 and C122"],

["2018","Level 4","CC151","Beverage and Tobacco Product Manufacturing","Dollars (millions)","H20","Non-operating expenses","Financial performance","37","ANZSIC06 groups C121 and C122"],

["2018","Level 4","CC151","Beverage and Tobacco Product Manufacturing","Dollars (millions)","H21","Opening stocks","Financial performance","1675","ANZSIC06 groups C121 and C122"],

["2018","Level 4","CC151","Beverage and Tobacco Product Manufacturing","Dollars (millions)","H22","Closing stocks","Financial performance","1755","ANZSIC06 groups C121 and C122"],

["2018","Level 4","CC151","Beverage and Tobacco Product Manufacturing","Dollars (millions)","H23","Surplus before income tax","Financial performance","533","ANZSIC06 groups C121 and C122"],

["2018","Level 4","CC151","Beverage and Tobacco Product Manufacturing","Dollars (millions)","H24","Total assets","Financial position","9437","ANZSIC06 groups C121 and C122"]]