[gd_scene load_steps=6 format=2]

[ext_resource path="res://sprites/sun.png" type="Texture" id=1]
[ext_resource path="res://sprites/exoplanet.png" type="Texture" id=2]
[ext_resource path="res://sprites/moon.png" type="Texture" id=3]

[sub_resource type="Animation" id=2]
resource_name = "Tourner"
loop = true
tracks/0/type = "value"
tracks/0/path = NodePath(".:rotation_degrees")
tracks/0/interp = 1
tracks/0/loop_wrap = true
tracks/0/imported = false
tracks/0/enabled = true
tracks/0/keys = {
"times": PoolRealArray( 0, 1 ),
"transitions": PoolRealArray( 1, 1 ),
"update": 0,
"values": [ 0.0, 360.0 ]
}

[sub_resource type="Animation" id=1]
resource_name = "Tourner"
loop = true
tracks/0/type = "value"
tracks/0/path = NodePath(".:rotation_degrees")
tracks/0/interp = 1
tracks/0/loop_wrap = true
tracks/0/imported = false
tracks/0/enabled = true
tracks/0/keys = {
"times": PoolRealArray( 0, 1 ),
"transitions": PoolRealArray( 1, 1 ),
"update": 0,
"values": [ 0.0, 360.0 ]
}

[node name="Système solaire" type="Node2D"]

[node name="Soleil" type="Sprite" parent="."]
position = Vector2( 659, 342 )
rotation = 6.28319
scale = Vector2( 0.85, 0.8 )
texture = ExtResource( 1 )

[node name="Terre" type="Sprite" parent="Soleil"]
position = Vector2( -5.76465, 353.25 )
rotation = 6.28319
scale = Vector2( 0.416667, 0.4375 )
texture = ExtResource( 2 )

[node name="Lune" type="Sprite" parent="Soleil/Terre"]
position = Vector2( -5.64746, -251.428 )
scale = Vector2( 0.45098, 0.484127 )
texture = ExtResource( 3 )

[node name="AnimationPlayer2" type="AnimationPlayer" parent="Soleil/Terre"]
autoplay = "Tourner"
anims/Tourner = SubResource( 2 )

[node name="AnimationPlayer" type="AnimationPlayer" parent="Soleil"]
autoplay = "Tourner"
playback_speed = 0.2
anims/Tourner = SubResource( 1 )
