@startuml password
participant "client application" as ca #90EE90
participant kong
participant "webapp backend" as wb #87CEFA
participant "resource service" as rs #9932CC

autonumber 1
== get token ==
ca -[#90EE90]> kong: Post (sending username and password)
kong -> wb: Proxy
wb -[#87CEFA]> wb: Verify user info
wb -[#87CEFA]> kong: Post (with full info)
kong -> kong: verify
kong -> wb: return access token
wb -[#87CEFA]> kong: return access token
kong -> ca: return

autonumber 1
== get resource ==
ca -[#90EE90]> kong: Post (sending Host and Token)
kong -> kong: verify token
kong -> rs: Proxy, load balance...
rs -[#9932CC]> kong: return resource
kong -> ca: return

autonumber 1
== refresh token ==
ca -[#90EE90]> kong: send refresh token and other info
kong -> ca: return token and refresh token

@enduml