<svg width="210" height="30" viewBox="0 0 210 30" fill="none" xmlns="http://www.w3.org/2000/svg">
<path d="M195.113 30C203.228 30 209.807 23.4215 209.807 15.3063C209.807 7.19121 203.228 0.61264 195.113 0.61264C186.998 0.61264 180.42 7.19121 180.42 15.3063C180.42 23.4215 186.998 30 195.113 30ZM192.188 12.3806L202.622 7.79739L198.039 18.2319L187.605 22.8151L192.188 12.3806Z" fill="#FF385C"/>
<path d="M195.113 16.8242C196.044 16.8242 196.799 16.0696 196.799 15.1386C196.799 14.2077 196.044 13.453 195.113 13.453C194.182 13.453 193.428 14.2077 193.428 15.1386C193.428 16.0696 194.182 16.8242 195.113 16.8242Z" fill="#FF385C"/>
<path d="M24.1589 14.6992C24.1589 6.43586 19.0283 1.72455 12.3313 1.72455C5.59731 1.72455 0.503662 6.43586 0.503662 14.6992C0.503662 22.9255 5.59731 27.6738 12.3313 27.6738C19.0283 27.6738 24.1589 22.9625 24.1589 14.6992ZM18.7446 14.6992C18.7446 20.0518 16.2039 22.9501 12.3313 22.9501C8.4463 22.9501 5.91797 20.0518 5.91797 14.6992C5.91797 9.34652 8.4463 6.4482 12.3313 6.4482C16.2039 6.4482 18.7446 9.34652 18.7446 14.6992Z" fill="#282828"/>
<path d="M28.1148 27.3284H33.4551V19.1391H37.9444C43.7534 19.1391 47.1327 15.6735 47.1327 10.6292C47.1327 5.60953 43.8151 2.06988 38.0801 2.06988H28.1148V27.3284ZM33.4551 14.8595V6.43586H37.0564C40.1397 6.43586 41.6321 8.11319 41.6321 10.6292C41.6321 13.1328 40.1397 14.8595 37.0811 14.8595H33.4551Z" fill="#282828"/>
<path d="M50.6015 27.3284H67.6707V22.9255H55.9418V16.8945H66.7457V12.4915H55.9418V6.47286H67.6214V2.06988H50.6015V27.3284Z" fill="#282828"/>
<path d="M92.994 2.06988H87.6784V17.9551H87.4564L76.5538 2.06988H71.8671V27.3284H77.2074V11.4308H77.3924L88.3814 27.3284H92.994V2.06988Z" fill="#282828"/>
<path d="M96.4443 6.47286H104.177V27.3284H109.456V6.47286H117.189V2.06988H96.4443V6.47286Z" fill="#282828"/>
<path d="M120.605 27.3284H125.945V18.3745H129.843L134.628 27.3284H140.523L135.158 17.5111C138.032 16.2778 139.623 13.7742 139.623 10.3208C139.623 5.3012 136.305 2.06988 130.57 2.06988H120.605V27.3284ZM125.945 14.0825V6.43586H129.547C132.63 6.43586 134.122 7.80486 134.122 10.3208C134.122 12.8245 132.63 14.0825 129.571 14.0825H125.945Z" fill="#282828"/>
<path d="M148.737 2.06988H143.397V27.3284H148.737V2.06988Z" fill="#282828"/>
<path d="M153.131 27.3284H158.471V19.1391H162.961C168.77 19.1391 172.149 15.6735 172.149 10.6292C172.149 5.60953 168.831 2.06988 163.096 2.06988H153.131V27.3284ZM158.471 14.8595V6.43586H162.073C165.156 6.43586 166.648 8.11319 166.648 10.6292C166.648 13.1328 165.156 14.8595 162.097 14.8595H158.471Z" fill="#282828"/>
</svg>
