<?xml version="1.0" encoding="UTF-8"?>
<!DOCTYPE svg PUBLIC "-//W3C//DTD SVG 1.1//EN" "http://www.w3.org/Graphics/SVG/1.1/DTD/svg11.dtd">
<!-- Creator: CorelDRAW X5 -->
<svg xmlns="http://www.w3.org/2000/svg" xml:space="preserve" width="210mm" height="30.552mm" style="shape-rendering:geometricPrecision; text-rendering:geometricPrecision; image-rendering:optimizeQuality; fill-rule:evenodd; clip-rule:evenodd"
viewBox="0 0 21000 3055"
 xmlns:xlink="http://www.w3.org/1999/xlink">
 <defs>
  <style type="text/css">
   <![CDATA[
    .fil0 {fill:#7B131F}
    .fil1 {fill:#E2071F}
    .fil2 {fill:white}
    .fil3 {fill:#7B131F;fill-rule:nonzero}
   ]]>
  </style>
 </defs>
 <g id="__x0023_Layer_x0020_1">
  <metadata id="CorelCorpID_0Corel-Layer"/>
  <polygon class="fil0" points="3309,3055 0,3055 0,0 3309,0 "/>
  <polygon class="fil1" points="417,533 2190,533 3076,1523 2190,2605 417,2605 1211,1523 "/>
  <polygon class="fil2" points="3076,1523 2190,533 417,533 1211,1523 "/>
  <path class="fil3" d="M5551 1099c-91,-107 -223,-169 -394,-169 -347,0 -603,280 -603,663 0,384 256,663 588,663 185,0 335,-82 429,-221l382 282c-173,245 -467,358 -752,358 -650,0 -1123,-421 -1123,-1082 0,-660 473,-1082 1123,-1082 233,0 526,79 703,303l-353 285z"/>
  <polygon class="fil3" points="6198,564 6656,564 6656,2622 6198,2622 "/>
  <polygon class="fil3" points="7073,564 7767,564 8246,1907 8252,1907 8734,564 9425,564 9425,2622 8967,2622 8967,1044 8961,1044 8414,2622 8064,2622 7538,1044 7531,1044 7531,2622 7073,2622 "/>
  <path class="fil3" d="M9849 564l776 0c365,0 761,76 761,523 0,229 -144,386 -358,453l0 6c273,34 456,235 456,503 0,430 -412,573 -783,573l-852 0 0 -2059zm458 823l0 0 333 0c141,0 288,-58 288,-224 0,-172 -165,-215 -309,-215l-312 0 0 439zm0 852l0 0 412 0c144,0 306,-61 306,-241 0,-195 -221,-227 -370,-227l-348 0 0 468z"/>
  <polygon class="fil3" points="12067,597 12369,597 13539,2275 13545,2275 13545,597 13785,597 13785,2618 13482,2618 12313,940 12307,940 12307,2618 12067,2618 "/>
  <polygon class="fil3" points="14287,597 14527,597 14527,2618 14287,2618 "/>
  <path class="fil3" d="M15686 597l225 0 859 2021 -280 0 -205 -497 -1010 0 -209 497 -271 0 891 -2021zm108 308l0 0 -6 0 -419 993 824 0 -399 -993z"/>
  <path class="fil3" d="M18757 2481c-231,129 -493,188 -757,188 -627,0 -1079,-428 -1079,-1062 0,-636 482,-1062 1087,-1062 265,0 523,72 714,266l-180 188c-137,-148 -346,-231 -552,-231 -462,0 -813,348 -813,839 0,483 340,840 837,840 162,0 353,-43 502,-117l0 -620 -465 0 0 -222 705 0 0 993z"/>
  <path class="fil3" d="M19916 597l225 0 859 2021 -280 0 -206 -497 -1010 0 -209 497 -271 0 891 -2021zm108 308l0 0 -5 0 -419 993 825 0 -400 -993z"/>
 </g>
</svg>
