{
  "setupFiles": ["dotenv/config"],
  "setupFilesAfterEnv": ["<rootDir>/src/__tests__/setup.ts"],
  "testMatch": ["**/__tests__/**/?(*.)+(spec|test).[jt]s?(x)"],
  "transform": {
    "^.+\\.ts$": "ts-jest"
  },
  "collectCoverageFrom": ["<rootDir>/src/**"],
  "coveragePathIgnorePatterns": ["generated"],
  "coverageReporters": ["lcov", "text-summary"],
  "testTimeout": 30000,
  "detectOpenHandles": true,
  "forceExit": true
}
