{
  "transform": {
    "^.+\\.ts$": "ts-jest"
  },
  "collectCoverageFrom": ["<rootDir>/src/**"],
  "coveragePathIgnorePatterns": ["generated"],
  "coverageReporters": ["lcov", "text-summary"],
  "detectOpenHandles": true,
  "forceExit": true
}
