EESchema Schematic File Version 4
EELAYER 30 0
EELAYER END
$Descr A4 11693 8268
encoding utf-8
Sheet 1 1
Title "Micro Centrifuge"
Date "2020-02-17"
Rev "v.1.0"
Comp "Delft Open Hardware"
Comment1 ""
Comment2 ""
Comment3 ""
Comment4 ""
$EndDescr
$Comp
L Connector:Screw_Terminal_01x02 J4
U 1 1 5E483572
P 4900 1650
F 0 "J4" H 4818 1325 50  0000 C CNN
F 1 "Screw_Terminal_01x02" H 4818 1416 50  0000 C CNN
F 2 "Screw_Terminals:TerminalBlock_bornier-2_P5.08mm" H 4900 1650 50  0001 C CNN
F 3 "~" H 4900 1650 50  0001 C CNN
	1    4900 1650
	-1   0    0    1   
$EndComp
$Comp
L MCU_Module:WeMos_D1_mini U1
U 1 1 5E484D72
P 4750 5700
F 0 "U1" H 4750 4811 50  0000 C CNN
F 1 "WeMos_D1_mini" H 4750 4720 50  0000 C CNN
F 2 "Module:WEMOS_D1_mini_light" H 4750 4550 50  0001 C CNN
F 3 "https://wiki.wemos.cc/products:d1:d1_mini#documentation" H 2900 4550 50  0001 C CNN
	1    4750 5700
	1    0    0    -1  
$EndComp
$Comp
L Device:Rotary_Encoder_Switch SW1
U 1 1 5E487F24
P 2300 4300
F 0 "SW1" H 2300 4667 50  0000 C CNN
F 1 "Rotary_Encoder_Switch" H 2300 4576 50  0000 C CNN
F 2 "Rotary_Encoder:RotaryEncoder_Alps_EC11E-Switch_Vertical_H20mm" H 2150 4460 50  0001 C CNN
F 3 "~" H 2300 4560 50  0001 C CNN
	1    2300 4300
	1    0    0    -1  
$EndComp
$Comp
L Connector:Screw_Terminal_01x02 J1
U 1 1 5E48C668
P 1850 6900
F 0 "J1" H 1768 6575 50  0000 C CNN
F 1 "Screw_Terminal_01x02" H 1768 6666 50  0000 C CNN
F 2 "Screw_Terminals:TerminalBlock_bornier-2_P5.08mm" H 1850 6900 50  0001 C CNN
F 3 "~" H 1850 6900 50  0001 C CNN
	1    1850 6900
	-1   0    0    1   
$EndComp
$Comp
L power:GND #PWR01
U 1 1 5E4A02B0
P 2750 4900
F 0 "#PWR01" H 2750 4650 50  0001 C CNN
F 1 "GND" H 2600 4800 50  0000 C CNN
F 2 "" H 2750 4900 50  0001 C CNN
F 3 "" H 2750 4900 50  0001 C CNN
	1    2750 4900
	1    0    0    -1  
$EndComp
$Comp
L power:VCC #PWR08
U 1 1 5E4A354D
P 4650 4650
F 0 "#PWR08" H 4650 4500 50  0001 C CNN
F 1 "VCC" H 4667 4823 50  0000 C CNN
F 2 "" H 4650 4650 50  0001 C CNN
F 3 "" H 4650 4650 50  0001 C CNN
	1    4650 4650
	1    0    0    -1  
$EndComp
Wire Wire Line
	4650 4650 4650 4900
$Comp
L power:GND #PWR010
U 1 1 5E4EAC4F
P 4750 6850
F 0 "#PWR010" H 4750 6600 50  0001 C CNN
F 1 "GND" H 4755 6677 50  0000 C CNN
F 2 "" H 4750 6850 50  0001 C CNN
F 3 "" H 4750 6850 50  0001 C CNN
	1    4750 6850
	1    0    0    -1  
$EndComp
Wire Wire Line
	4750 6500 4750 6850
Wire Wire Line
	5150 5900 5650 5900
Wire Wire Line
	5150 5800 5650 5800
Text GLabel 5650 6000 2    50   Input ~ 0
ROT_ENC_DT
Text GLabel 5650 5900 2    50   Input ~ 0
ROT_ENC_CLK
Wire Wire Line
	5150 6000 5650 6000
Wire Wire Line
	5150 5700 5650 5700
Wire Wire Line
	5150 5600 5650 5600
Text GLabel 1400 3900 2    50   Input ~ 0
ROT_ENC_DT
Wire Wire Line
	2600 4400 2750 4400
Wire Wire Line
	2600 4200 2850 4200
Text GLabel 3000 4200 2    50   Input ~ 0
ROT_SW
Text GLabel 5650 5800 2    50   Input ~ 0
ROT_SW
Wire Wire Line
	2050 6900 2450 6900
Wire Wire Line
	2450 6900 2450 7100
$Comp
L power:GND #PWR04
U 1 1 5E51DAAC
P 2450 7100
F 0 "#PWR04" H 2450 6850 50  0001 C CNN
F 1 "GND" H 2455 6927 50  0000 C CNN
F 2 "" H 2450 7100 50  0001 C CNN
F 3 "" H 2450 7100 50  0001 C CNN
	1    2450 7100
	1    0    0    -1  
$EndComp
Wire Wire Line
	2050 6800 2550 6800
Text GLabel 2650 6800 2    50   Input ~ 0
END_SW
Text GLabel 5650 5700 2    50   Input ~ 0
END_SW
$Comp
L Device:R R1
U 1 1 5E5220F9
P 2550 6550
F 0 "R1" H 2620 6596 50  0000 L CNN
F 1 "10K" H 2620 6505 50  0000 L CNN
F 2 "Resistor_THT:R_Axial_DIN0204_L3.6mm_D1.6mm_P5.08mm_Horizontal" V 2480 6550 50  0001 C CNN
F 3 "~" H 2550 6550 50  0001 C CNN
	1    2550 6550
	1    0    0    -1  
$EndComp
Wire Wire Line
	2550 6700 2550 6800
Connection ~ 2550 6800
Wire Wire Line
	2550 6800 2650 6800
Wire Wire Line
	2550 6400 2550 6300
Wire Wire Line
	2550 6300 2800 6300
$Comp
L power:VCC #PWR05
U 1 1 5E525350
P 2800 6300
F 0 "#PWR05" H 2800 6150 50  0001 C CNN
F 1 "VCC" H 2817 6473 50  0000 C CNN
F 2 "" H 2800 6300 50  0001 C CNN
F 3 "" H 2800 6300 50  0001 C CNN
	1    2800 6300
	1    0    0    -1  
$EndComp
$Comp
L Device:R R2
U 1 1 5E528790
P 2850 3900
F 0 "R2" H 2920 3946 50  0000 L CNN
F 1 "10K" H 2920 3855 50  0000 L CNN
F 2 "Resistor_THT:R_Axial_DIN0204_L3.6mm_D1.6mm_P5.08mm_Horizontal" V 2780 3900 50  0001 C CNN
F 3 "~" H 2850 3900 50  0001 C CNN
	1    2850 3900
	1    0    0    -1  
$EndComp
Wire Wire Line
	2850 4050 2850 4200
Connection ~ 2850 4200
Wire Wire Line
	2850 4200 3000 4200
$Comp
L power:VCC #PWR06
U 1 1 5E52A983
P 2850 3600
F 0 "#PWR06" H 2850 3450 50  0001 C CNN
F 1 "VCC" H 2867 3773 50  0000 C CNN
F 2 "" H 2850 3600 50  0001 C CNN
F 3 "" H 2850 3600 50  0001 C CNN
	1    2850 3600
	1    0    0    -1  
$EndComp
Wire Wire Line
	2850 3750 2850 3600
Wire Notes Line
	3450 3350 3450 5050
Wire Notes Line
	750  5050 750  3350
Wire Notes Line
	3450 6000 1000 6000
Wire Notes Line
	1000 6000 1000 7350
Wire Notes Line
	1000 7350 3450 7350
Wire Notes Line
	3450 7350 3450 6000
Text Notes 1550 5900 0    118  ~ 24
SAFETY SWITCH
Text Notes 1400 3250 0    118  ~ 24
ROTARY ENCODER
Text Notes 5050 4150 0    118  ~ 24
MCU
Text Notes 8500 3100 0    118  ~ 24
LCD
Text GLabel 5650 5600 2    50   Input ~ 0
ESC_CONTROL
Wire Notes Line
	6600 4250 6600 7350
Wire Notes Line
	4050 4250 4050 7350
Wire Notes Line
	4050 4250 6600 4250
Wire Notes Line
	4050 7350 6600 7350
Text GLabel 5500 3050 2    50   Input ~ 0
ESC_CONTROL
Wire Notes Line
	4200 2700 6650 2700
Wire Notes Line
	6650 2700 6650 3600
Wire Notes Line
	6650 3600 4200 3600
Wire Notes Line
	4200 2700 4200 3600
Text Notes 4700 2600 0    118  ~ 24
MOTOR CONTROL\n
Wire Wire Line
	5100 1550 5550 1550
Wire Wire Line
	5100 1650 5550 1650
$Comp
L power:GND #PWR011
U 1 1 5E63191B
P 5550 1800
F 0 "#PWR011" H 5550 1550 50  0001 C CNN
F 1 "GND" H 5555 1627 50  0000 C CNN
F 2 "" H 5550 1800 50  0001 C CNN
F 3 "" H 5550 1800 50  0001 C CNN
	1    5550 1800
	1    0    0    -1  
$EndComp
Wire Wire Line
	5550 1650 5550 1800
Text GLabel 5550 1550 2    50   Input ~ 0
POWER_IN
Wire Wire Line
	8700 1800 9200 1800
Wire Wire Line
	8700 1900 9000 1900
$Comp
L power:GND #PWR013
U 1 1 5E64AFC4
P 9000 2400
F 0 "#PWR013" H 9000 2150 50  0001 C CNN
F 1 "GND" H 9005 2227 50  0000 C CNN
F 2 "" H 9000 2400 50  0001 C CNN
F 3 "" H 9000 2400 50  0001 C CNN
	1    9000 2400
	1    0    0    -1  
$EndComp
Wire Wire Line
	9000 1900 9000 2400
$Comp
L power:VCC #PWR014
U 1 1 5E64D3EA
P 9200 1550
F 0 "#PWR014" H 9200 1400 50  0001 C CNN
F 1 "VCC" H 9217 1723 50  0000 C CNN
F 2 "" H 9200 1550 50  0001 C CNN
F 3 "" H 9200 1550 50  0001 C CNN
	1    9200 1550
	1    0    0    -1  
$EndComp
Wire Wire Line
	9200 1550 9200 1800
Text GLabel 9300 2100 2    50   Input ~ 0
SCL
Text GLabel 9300 2000 2    50   Input ~ 0
SDA
Wire Wire Line
	5150 5400 5650 5400
Wire Wire Line
	5150 5500 5650 5500
Text GLabel 5650 5400 2    50   Input ~ 0
SCL
Text GLabel 5650 5500 2    50   Input ~ 0
SDA
Wire Wire Line
	5300 3150 5300 3250
$Comp
L power:GND #PWR09
U 1 1 5E6732AC
P 5300 3250
F 0 "#PWR09" H 5300 3000 50  0001 C CNN
F 1 "GND" H 5305 3077 50  0000 C CNN
F 2 "" H 5300 3250 50  0001 C CNN
F 3 "" H 5300 3250 50  0001 C CNN
	1    5300 3250
	1    0    0    -1  
$EndComp
Wire Notes Line
	7850 1250 10050 1250
Wire Notes Line
	10050 1250 10050 2700
Wire Notes Line
	10050 2700 7850 2700
Wire Notes Line
	7850 2700 7850 1250
Text Notes 8750 1150 0    118  ~ 24
IMU
$Comp
L Connector_Generic:Conn_02x02_Odd_Even J2
U 1 1 5E6E7E98
P 2250 1850
F 0 "J2" H 2300 2067 50  0000 C CNN
F 1 "Conn_02x02_Odd_Even" H 2300 1976 50  0000 C CNN
F 2 "LM2596_Module:LM2596" H 2250 1850 50  0001 C CNN
F 3 "~" H 2250 1850 50  0001 C CNN
	1    2250 1850
	1    0    0    -1  
$EndComp
Wire Wire Line
	2050 1850 1600 1850
Wire Wire Line
	2050 1950 1800 1950
Wire Wire Line
	1800 1950 1800 2150
Wire Wire Line
	2550 1850 2950 1850
Wire Wire Line
	2550 1950 2800 1950
Wire Wire Line
	2800 1950 2800 2150
Text GLabel 1600 1850 0    50   Input ~ 0
POWER_IN
$Comp
L power:GND #PWR07
U 1 1 5E6F14E8
P 2950 2300
F 0 "#PWR07" H 2950 2050 50  0001 C CNN
F 1 "GND" H 2955 2127 50  0000 C CNN
F 2 "" H 2950 2300 50  0001 C CNN
F 3 "" H 2950 2300 50  0001 C CNN
	1    2950 2300
	1    0    0    -1  
$EndComp
$Comp
L power:GND #PWR03
U 1 1 5E6F1891
P 1800 2150
F 0 "#PWR03" H 1800 1900 50  0001 C CNN
F 1 "GND" H 1805 1977 50  0000 C CNN
F 2 "" H 1800 2150 50  0001 C CNN
F 3 "" H 1800 2150 50  0001 C CNN
	1    1800 2150
	1    0    0    -1  
$EndComp
Wire Notes Line
	1000 2600 3550 2600
Wire Notes Line
	3550 2600 3550 1450
Wire Notes Line
	3550 1450 1000 1450
Wire Notes Line
	1000 1450 1000 2600
Wire Notes Line
	4400 1150 4400 2150
Wire Notes Line
	4400 2150 6450 2150
Wire Notes Line
	6450 2150 6450 1150
Wire Notes Line
	6450 1150 4400 1150
Text Notes 5150 1050 0    118  ~ 24
POWER
Text Notes 1100 1350 0    118  ~ 24
DC-DC BUCK CONVERTOR
$Comp
L Device:CP C1
U 1 1 5E7AC37B
P 2950 2000
F 0 "C1" H 3068 2046 50  0000 L CNN
F 1 "10uF" H 3068 1955 50  0000 L CNN
F 2 "Capacitor_THT:CP_Radial_D5.0mm_P2.00mm" H 2988 1850 50  0001 C CNN
F 3 "~" H 2950 2000 50  0001 C CNN
	1    2950 2000
	1    0    0    -1  
$EndComp
Wire Wire Line
	2800 2150 2950 2150
Wire Wire Line
	2950 2150 2950 2300
Connection ~ 2950 2150
$Comp
L power:VCC #PWR0101
U 1 1 5E7E19E0
P 2950 1700
F 0 "#PWR0101" H 2950 1550 50  0001 C CNN
F 1 "VCC" H 2967 1873 50  0000 C CNN
F 2 "" H 2950 1700 50  0001 C CNN
F 3 "" H 2950 1700 50  0001 C CNN
	1    2950 1700
	1    0    0    -1  
$EndComp
Wire Wire Line
	2950 1700 2950 1850
Connection ~ 2950 1850
$Comp
L Connector:Screw_Terminal_01x04 J5
U 1 1 5E4B5EF9
P 8500 2000
F 0 "J5" H 8418 1575 50  0000 C CNN
F 1 "Screw_Terminal_01x04" H 8418 1666 50  0000 C CNN
F 2 "Screw_Terminals:TerminalBlock_bornier-4_P5.08mm" H 8500 2000 50  0001 C CNN
F 3 "~" H 8500 2000 50  0001 C CNN
	1    8500 2000
	-1   0    0    1   
$EndComp
Wire Wire Line
	5000 3050 5500 3050
Wire Wire Line
	5000 3150 5300 3150
$Comp
L Connector:Screw_Terminal_01x02 J3
U 1 1 5E4BAFCE
P 4800 3150
F 0 "J3" H 4718 2825 50  0000 C CNN
F 1 "Screw_Terminal_01x02" H 4718 2916 50  0000 C CNN
F 2 "Screw_Terminals:TerminalBlock_bornier-2_P5.08mm" H 4800 3150 50  0001 C CNN
F 3 "~" H 4800 3150 50  0001 C CNN
	1    4800 3150
	-1   0    0    1   
$EndComp
Wire Wire Line
	8700 2000 9300 2000
Wire Wire Line
	8700 2100 9300 2100
Wire Wire Line
	2750 4400 2750 4650
Text GLabel 950  3700 2    50   Input ~ 0
ROT_ENC_CLK
Connection ~ 2750 4650
$Comp
L Device:R R3
U 1 1 5F6D9FA4
P 1600 4200
F 0 "R3" V 1500 4250 50  0000 C CNN
F 1 "R" V 1500 4150 50  0000 C CNN
F 2 "Resistor_THT:R_Axial_DIN0204_L3.6mm_D1.6mm_P5.08mm_Horizontal" V 1530 4200 50  0001 C CNN
F 3 "~" H 1600 4200 50  0001 C CNN
	1    1600 4200
	0    1    1    0   
$EndComp
$Comp
L Device:C C2
U 1 1 5F6DB2AA
P 1150 4650
F 0 "C2" H 1350 4600 50  0000 R CNN
F 1 "C" H 1350 4700 50  0000 R CNN
F 2 "Capacitor_THT:C_Disc_D3.0mm_W2.0mm_P2.50mm" H 1188 4500 50  0001 C CNN
F 3 "~" H 1150 4650 50  0001 C CNN
	1    1150 4650
	-1   0    0    1   
$EndComp
$Comp
L Device:R R4
U 1 1 5F6E5C9F
P 1600 4400
F 0 "R4" V 1500 4400 50  0000 C CNN
F 1 "R" V 1700 4400 50  0000 C CNN
F 2 "Resistor_THT:R_Axial_DIN0204_L3.6mm_D1.6mm_P5.08mm_Horizontal" V 1530 4400 50  0001 C CNN
F 3 "~" H 1600 4400 50  0001 C CNN
	1    1600 4400
	0    -1   -1   0   
$EndComp
$Comp
L Device:C C3
U 1 1 5F6E5CA5
P 1400 4650
F 0 "C3" H 1500 4700 50  0000 L CNN
F 1 "C" H 1500 4600 50  0000 L CNN
F 2 "Capacitor_THT:C_Disc_D3.0mm_W2.0mm_P2.50mm" H 1438 4500 50  0001 C CNN
F 3 "~" H 1400 4650 50  0001 C CNN
	1    1400 4650
	1    0    0    -1  
$EndComp
Wire Wire Line
	1750 4200 2000 4200
Wire Wire Line
	1750 4400 2000 4400
Wire Wire Line
	2000 4300 1850 4300
Wire Wire Line
	1850 4300 1850 4650
Wire Wire Line
	1850 4650 2750 4650
Wire Wire Line
	1450 4400 1400 4400
Wire Wire Line
	1400 4400 1400 4500
Wire Wire Line
	1150 4800 1150 4850
Wire Wire Line
	1150 4850 1400 4850
Connection ~ 2750 4850
Wire Wire Line
	2750 4850 2750 4900
Wire Wire Line
	1150 4200 1150 4500
Wire Wire Line
	1150 4200 1450 4200
Wire Wire Line
	1150 4200 950  4200
Wire Wire Line
	950  4200 950  3700
Connection ~ 1150 4200
Wire Wire Line
	1400 4400 1400 3900
Connection ~ 1400 4400
Wire Notes Line
	750  3350 3450 3350
Wire Notes Line
	750  5050 3450 5050
Wire Wire Line
	2750 4650 2750 4850
Wire Wire Line
	1400 4800 1400 4850
Connection ~ 1400 4850
Wire Wire Line
	1400 4850 2750 4850
Wire Wire Line
	7700 3700 8200 3700
Wire Wire Line
	7700 3800 8000 3800
$Comp
L power:GND #PWR02
U 1 1 5F77F7E4
P 8000 4300
F 0 "#PWR02" H 8000 4050 50  0001 C CNN
F 1 "GND" H 8005 4127 50  0000 C CNN
F 2 "" H 8000 4300 50  0001 C CNN
F 3 "" H 8000 4300 50  0001 C CNN
	1    8000 4300
	1    0    0    -1  
$EndComp
Wire Wire Line
	8000 3800 8000 4300
$Comp
L power:VCC #PWR012
U 1 1 5F77F7EB
P 8200 3450
F 0 "#PWR012" H 8200 3300 50  0001 C CNN
F 1 "VCC" H 8217 3623 50  0000 C CNN
F 2 "" H 8200 3450 50  0001 C CNN
F 3 "" H 8200 3450 50  0001 C CNN
	1    8200 3450
	1    0    0    -1  
$EndComp
Wire Wire Line
	8200 3450 8200 3700
Text GLabel 8300 4000 2    50   Input ~ 0
SCL
Text GLabel 8300 3900 2    50   Input ~ 0
SDA
$Comp
L Connector:Screw_Terminal_01x04 J6
U 1 1 5F77F7F4
P 7500 3900
F 0 "J6" H 7418 3475 50  0000 C CNN
F 1 "Screw_Terminal_01x04" H 7418 3566 50  0000 C CNN
F 2 "Screw_Terminals:TerminalBlock_bornier-4_P5.08mm" H 7500 3900 50  0001 C CNN
F 3 "~" H 7500 3900 50  0001 C CNN
	1    7500 3900
	-1   0    0    1   
$EndComp
Wire Wire Line
	7700 3900 8200 3900
Wire Wire Line
	7700 4000 8150 4000
$Comp
L Driver_Display:PCA8574-LCD-Breakout U2
U 1 1 5F79FE2F
P 9800 4300
F 0 "U2" H 8922 4004 50  0000 R CNN
F 1 "PCA8574-LCD-Breakout" H 10200 3450 50  0000 R CNN
F 2 "Display:PCA8574-Breakout" H 9550 4300 50  0001 C CNN
F 3 "" H 9550 4300 50  0001 C CNN
	1    9800 4300
	-1   0    0    1   
$EndComp
Wire Notes Line
	7050 3200 7050 6150
Wire Wire Line
	8000 3800 8600 3800
Wire Wire Line
	8600 3800 8600 3950
Connection ~ 8000 3800
Wire Wire Line
	8200 3700 8650 3700
Wire Wire Line
	8650 3700 8650 3850
Connection ~ 8200 3700
Wire Wire Line
	8650 3850 8800 3850
Wire Wire Line
	8600 3950 8800 3950
Wire Wire Line
	8800 3750 8750 3750
Wire Wire Line
	8750 3750 8750 4200
Wire Wire Line
	8750 4200 8200 4200
Wire Wire Line
	8200 4200 8200 3900
Connection ~ 8200 3900
Wire Wire Line
	8200 3900 8300 3900
Wire Wire Line
	8150 4000 8150 4250
Wire Wire Line
	8150 4250 8700 4250
Wire Wire Line
	8700 4250 8700 3650
Wire Wire Line
	8700 3650 8800 3650
Connection ~ 8150 4000
Wire Wire Line
	8150 4000 8300 4000
Wire Wire Line
	10550 4400 10700 4400
Wire Wire Line
	10450 4400 10450 4450
Wire Wire Line
	10450 4450 10650 4450
Wire Wire Line
	9550 4400 9550 4500
Wire Wire Line
	9050 4400 9050 4500
Wire Wire Line
	9050 4500 8750 4500
Wire Wire Line
	8750 4500 8750 5550
Wire Wire Line
	9150 4400 9150 4650
Wire Wire Line
	9150 4650 8850 4650
Wire Wire Line
	8850 4650 8850 6100
Wire Wire Line
	8850 6100 10550 6100
Wire Wire Line
	10550 6100 10550 5550
Wire Wire Line
	10650 4450 10650 6000
Wire Wire Line
	10700 4400 10700 6050
Wire Wire Line
	9850 4400 9850 4850
Wire Wire Line
	9850 4850 9600 4850
Wire Wire Line
	9600 4850 9600 5150
Wire Wire Line
	9950 4400 9950 4900
Wire Wire Line
	9950 4900 9500 4900
Wire Wire Line
	9500 4900 9500 5150
Wire Wire Line
	10050 4400 10050 4950
Wire Wire Line
	10050 4950 9400 4950
Wire Wire Line
	9400 4950 9400 5150
Wire Wire Line
	10150 4400 10150 5000
Wire Wire Line
	10150 5000 9300 5000
Wire Wire Line
	9300 5000 9300 5150
Wire Wire Line
	10250 4400 10250 5050
Wire Wire Line
	10250 5050 9200 5050
Wire Wire Line
	9200 5050 9200 5150
Wire Wire Line
	9100 5150 9100 5100
Wire Wire Line
	9100 5100 10350 5100
Wire Wire Line
	10350 5100 10350 4400
Wire Wire Line
	9650 4400 9650 4650
Wire Wire Line
	9650 4650 9800 4650
Wire Wire Line
	9800 4650 9800 5150
Wire Wire Line
	9250 4400 9250 4700
Wire Wire Line
	9250 4700 10600 4700
Wire Wire Line
	10600 4700 10600 5950
Wire Notes Line
	10900 3200 10900 6150
Wire Notes Line
	7050 3200 10900 3200
Wire Notes Line
	7050 6150 10900 6150
Wire Wire Line
	9450 4400 9450 4550
Wire Wire Line
	9350 4400 9350 4600
Wire Wire Line
	9350 4600 10100 4600
Wire Wire Line
	10100 4600 10100 5150
$Comp
L Display_Character:WC1602A DS1
U 1 1 5F7C3383
P 9700 5550
F 0 "DS1" V 9400 6250 50  0000 L CNN
F 1 "WC1602A" V 9900 5150 50  0000 L CNN
F 2 "Display:WC1602A" H 9700 4650 50  0001 C CIN
F 3 "http://www.wincomlcd.com/pdf/WC1602A-SFYLYHTC06.pdf" H 10400 5550 50  0001 C CNN
	1    9700 5550
	0    1    1    0   
$EndComp
Wire Wire Line
	10300 4500 10300 5150
Wire Wire Line
	9550 4500 10300 4500
Wire Wire Line
	10200 4550 10200 5150
Wire Wire Line
	9450 4550 10200 4550
Wire Wire Line
	8750 5550 8900 5550
Wire Wire Line
	10500 5550 10550 5550
Wire Wire Line
	9750 4400 9750 5150
Wire Wire Line
	9750 5150 9700 5150
Wire Wire Line
	10600 5950 10300 5950
Wire Wire Line
	10000 5950 10000 6000
Wire Wire Line
	10000 6000 10650 6000
Wire Wire Line
	9900 5950 9900 6050
Wire Wire Line
	9900 6050 10700 6050
$Comp
L Connector:Conn_01x03_Male J7
U 1 1 5F86C896
P 5550 6850
F 0 "J7" H 5450 6950 50  0000 R CNN
F 1 "Conn_01x03_Male" H 6100 7100 50  0000 R CNN
F 2 "Screw_Terminals:TerminalBlock_bornier-3_P5.08mm" H 5550 6850 50  0001 C CNN
F 3 "~" H 5550 6850 50  0001 C CNN
	1    5550 6850
	1    0    0    -1  
$EndComp
Wire Wire Line
	5150 6100 5650 6100
Text GLabel 5650 6100 2    50   Input ~ 0
D8_PWM
Wire Wire Line
	5150 5300 5650 5300
Wire Wire Line
	5150 5200 5650 5200
Text GLabel 5650 5300 2    50   Input ~ 0
D0_IO
Text GLabel 5650 5200 2    50   Input ~ 0
A0_IO
Wire Wire Line
	5750 6750 5900 6750
Wire Wire Line
	5750 6850 5900 6850
Wire Wire Line
	5750 6950 5900 6950
Text GLabel 5900 6950 2    50   Input ~ 0
A0_IO
Text GLabel 5900 6850 2    50   Input ~ 0
D0_IO
Text GLabel 5900 6750 2    50   Input ~ 0
D8_PWM
$EndSCHEMATC
