400,0,23.11,1030.44
0,0,22.76,1030.42
400,0,22.86,1030.63
400,0,22.93,1030.74
403,0,22.73,1030.06
414,2,22.66,1030.93
413,1,22.75,1031.1
403,0,22.71,1030.72
400,0,22.68,1030.87
406,0,22.71,1031.04
400,0,22.72,1029.85
410,1,22.75,1030.51
445,6,22.76,1030.58
441,6,22.77,1030.5
436,5,22.76,1030.46
441,6,22.77,1030.97
433,5,22.8,1030.53
426,3,22.76,1030.4
438,5,22.82,1031.05
439,5,22.84,1030.39
433,5,22.8,1030.8
417,2,22.58,1030.15
447,7,22.81,1031.08
432,4,22.79,1031.06
426,3,22.78,1031.09
422,3,22.75,1030.99
423,3,22.75,1031.05
409,1,22.77,1031.08
418,2,22.75,1030.11
417,2,22.74,1029.91
414,2,22.84,1030.58
406,0,22.89,1030.68
405,0,22.74,1029.86
420,3,22.82,1031.22
409,1,22.75,1029.74
410,1,22.96,1030.6
405,0,22.85,1030.46
407,1,22.86,1030.42
403,0,22.86,1030.53
403,0,22.83,1031.07
400,0,22.72,1030.89
441,6,22.77,1030.98
427,4,22.7,1030.17
438,5,22.72,1030.95
438,5,22.79,1030.63
427,4,22.75,1030.51
428,4,22.73,1030.91
422,3,22.71,1030.53
417,2,22.63,1030.71
436,5,22.56,1030.7
454,8,22.68,1030.79
442,6,22.72,1030.52
444,6,22.75,1030.94
441,6,22.73,1030.46
436,5,22.79,1031.05
451,7,22.88,1030.66
438,5,22.73,1030.94
454,8,22.81,1030.63
443,6,22.74,1030.23
434,5,22.85,1031.26
438,5,22.92,1030.57
433,5,22.88,1031.15
436,5,22.89,1030.49
435,5,22.9,1030.45
433,5,22.89,1031.33
443,6,22.89,1030.5
445,6,22.75,1030.74
454,8,22.8,1030.45
454,8,22.95,1030.69
441,6,23.02,1030.83
425,3,22.91,1030.72
441,6,22.83,1031.12
445,6,22.85,1030.89
438,5,22.82,1030.52
441,6,22.85,1030.62
438,5,22.81,1031.0
434,5,22.83,1030.59
441,6,22.72,1030.2
447,7,22.74,1029.91
452,7,22.83,1030.51
447,7,22.75,1030.95
451,7,22.8,1030.48
447,7,22.85,1031.1
435,5,22.81,1031.04
438,5,22.91,1030.55
433,5,22.7,1030.66
444,6,22.9,1030.53
441,6,22.87,1031.15
435,5,22.9,1030.48
433,5,23.02,1030.72
418,2,22.75,1030.74
436,5,22.92,1031.23
422,3,22.95,1030.65
410,1,22.76,1029.99
423,3,22.92,1030.7
413,1,22.75,1029.93
425,3,22.86,1030.64
402,0,22.77,1031.08
406,0,22.81,1030.56
410,1,22.73,1030.94
411,1,22.81,1030.51
405,0,22.81,1031.04
445,6,22.85,1030.57
493,14,22.76,1030.48
487,13,22.93,1030.71
457,8,22.92,1031.31
697,45,22.89,1031.32
607,31,22.89,1031.32
530,19,22.91,1030.52
497,14,22.92,1030.49
428,4,22.91,1030.98
420,3,22.89,1031.22
400,0,22.72,1030.9
423,3,23.01,1030.7
400,0,22.92,1031.31
422,3,22.93,1031.14
426,3,22.92,1031.31
400,0,22.81,1030.5
411,1,22.76,1029.94
413,1,22.75,1030.95
417,2,22.78,1030.45
427,4,22.88,1030.58
422,3,22.75,1030.03
457,8,23.07,1030.85
402,0,22.93,1031.33
428,4,22.79,1029.85
446,7,23.01,1030.76
426,3,23.0,1030.75
442,6,22.91,1031.11
457,8,23.02,1030.78
424,3,22.91,1031.35
423,3,22.81,1030.5
444,6,22.94,1030.65
428,4,22.88,1031.15
452,7,22.78,1030.26
457,8,22.88,1031.21
452,7,22.93,1031.23
450,7,23.24,1031.71
0,0,22.74,1030.39
400,0,22.9,1030.64
418,2,22.73,1029.84
424,3,22.76,1031.06
445,6,22.77,1029.82
427,4,22.84,1030.63
422,3,22.91,1031.35
426,3,22.89,1030.6
418,2,22.87,1030.57
402,0,22.74,1030.97
432,4,22.87,1031.15
428,4,22.96,1030.9
400,0,22.92,1030.84
414,2,22.75,1030.98
465,9,22.79,1031.17
439,5,22.86,1030.74
418,2,22.84,1030.61
441,6,22.72,1030.95
451,7,22.8,1031.24
439,5,22.83,1030.64
418,2,22.75,1029.34
447,7,22.75,1029.93
445,6,22.94,1030.89
403,0,22.8,1030.64
400,0,22.8,1030.65
514,17,23.21,1031.61
0,0,22.77,1031.25
443,6,22.81,1031.25
436,5,22.94,1030.86
426,3,22.89,1030.68
574,26,22.89,1030.6
992,90,22.9,1030.88
730,50,22.74,1029.67
586,28,22.84,1030.61
519,18,22.92,1030.89
618,33,23.18,1031.35
0,0,22.77,1029.64
0,0,22.98,1030.77
0,0,22.77,1029.85
418,2,22.97,1030.73
485,12,22.87,1030.65
487,13,22.75,1029.66
491,13,22.86,1030.53
400,0,22.91,1031.19
482,12,23.06,1030.94
470,10,22.98,1030.77
441,6,22.87,1030.52
400,0,22.87,1030.54
476,11,22.88,1030.63
451,7,22.76,1030.32
434,5,22.86,1031.38
472,10,22.92,1030.84
400,0,22.81,1031.19
477,11,23.0,1030.96
465,9,22.75,1030.2
421,3,22.75,1031.0
495,14,22.73,1030.81
466,10,22.73,1030.81
481,12,22.95,1030.91
461,9,22.82,1030.54
401,0,22.73,1030.97
466,10,22.83,1030.69
473,11,22.8,1031.34
417,2,22.74,1029.58
472,10,22.93,1030.87
455,8,22.74,1030.29
481,12,22.79,1030.57
488,13,22.81,1030.51
400,0,22.83,1030.67
463,9,22.96,1030.92
493,14,22.95,1030.87
411,1,22.79,1030.65
520,18,22.87,1030.68
456,8,22.73,1030.27
505,15,22.97,1030.86
407,1,22.82,1031.24
530,19,22.84,1030.63
462,9,22.83,1031.23
481,12,22.87,1030.6
416,2,22.74,1029.81
530,19,22.85,1030.67
470,10,22.85,1031.15
448,7,22.73,1030.94
425,3,22.95,1030.88
500,15,22.84,1030.97
496,14,22.85,1030.73
470,10,22.83,1030.64
451,7,22.74,1031.04
637,36,22.71,1030.83
602,30,22.73,1030.81
607,31,22.73,1029.92
488,13,23.06,1031.13
514,17,22.81,1032.62
597,30,22.81,1031.19
589,28,22.73,1030.94
497,14,22.81,1030.7
626,34,22.75,1031.11
605,31,22.82,1030.6
551,23,22.82,1031.21
505,15,22.79,1030.57
596,29,22.8,1030.6
597,30,22.9,1030.88
611,32,22.95,1030.87
486,13,22.71,1030.94
561,24,22.81,1030.62
589,28,22.75,1030.35
614,32,22.76,1030.48
487,13,22.81,1030.63
617,33,22.87,1030.84
614,32,22.75,1030.54
478,11,22.74,1030.05
599,30,22.8,1031.24
612,32,22.8,1030.53
603,30,22.81,1030.58
597,30,22.83,1030.61
488,13,22.78,1030.27
596,29,22.84,1030.61
575,26,22.84,1031.25
459,8,22.86,1030.72
580,27,22.86,1030.69
574,26,22.74,1029.48
607,31,22.92,1030.72
465,9,22.73,1030.59
627,34,23.04,1030.97
627,34,23.25,1030.66
0,0,22.86,1030.61
0,0,22.87,1031.23
0,0,22.95,1030.85
400,0,22.88,1030.77
460,9,22.73,1030.99
432,4,22.78,1030.45
478,11,22.73,1030.97
400,0,22.78,1030.46
540,21,22.77,1029.64
577,26,22.84,1031.2
451,7,22.96,1030.85
508,16,22.87,1030.57
454,8,23.0,1030.86
483,12,22.89,1030.68
533,20,22.88,1030.67
566,25,22.91,1031.25
423,3,22.97,1030.78
569,25,22.74,1030.85
580,27,22.92,1031.37
465,9,22.91,1030.55
483,12,22.77,1030.25
506,16,22.73,1030.27
514,17,22.84,1031.09
565,25,22.75,1030.94
403,0,22.73,1030.7
533,20,22.89,1031.33
560,24,23.11,1031.05
566,25,22.83,1030.41
427,4,22.73,1030.43
591,29,22.75,1029.82
546,22,22.9,1030.64
486,13,22.76,1031.07
492,14,22.73,1030.94
539,21,22.95,1030.82
478,11,22.86,1030.61
539,21,22.76,1029.94
476,11,23.1,1031.07
476,11,22.97,1030.81
546,22,22.9,1030.69
578,27,22.87,1030.56
416,2,22.76,1030.22
578,27,22.93,1030.75
584,28,22.89,1031.32
470,10,22.88,1030.55
455,8,23.12,1031.09
455,8,23.31,1031.34
0,0,22.93,1031.14
0,0,22.73,1031.02
0,0,22.88,1031.31
470,10,22.77,1029.8
534,20,22.74,1030.74
569,25,23.02,1030.86
488,13,22.88,1030.56
416,2,22.73,1030.65
560,24,22.89,1030.6
492,14,22.9,1030.61
526,19,22.95,1030.77
435,5,22.9,1030.59
508,16,22.91,1030.5
448,7,22.93,1030.58
523,18,22.91,1031.4
448,7,22.93,1030.63
400,0,23.0,1030.8
533,20,22.92,1031.37
462,9,23.05,1030.9
526,19,22.94,1030.65
433,5,22.75,1031.02
491,13,22.91,1030.5
520,18,22.93,1031.38
464,9,22.78,1030.18
450,7,22.75,1029.71
540,21,22.73,1030.7
492,14,22.99,1030.83
502,15,22.73,1031.02
428,4,22.92,1030.56
542,21,22.81,1031.14
501,15,23.31,1030.64
0,0,22.95,1031.42
0,0,22.73,1030.91
0,0,22.95,1031.26
448,7,22.77,1029.74
524,18,22.93,1031.22
548,22,22.73,1030.7
515,17,22.95,1030.61
411,1,22.95,1031.42
552,23,22.95,1030.61
500,15,22.78,1030.22
565,25,22.95,1030.61
456,8,23.03,1030.75
503,15,23.0,1030.72
527,19,22.94,1031.35
503,15,22.96,1031.44
620,33,22.97,1031.45
574,26,22.73,1030.75
660,39,22.95,1030.55
665,40,22.91,1031.3
540,21,22.95,1031.21
572,26,22.73,1030.91
645,37,22.73,1030.7
570,25,22.95,1031.41
594,29,22.94,1030.62
475,11,22.87,1031.23
503,15,22.84,1031.24
565,25,22.96,1030.8
480,12,22.9,1030.59
463,9,22.83,1030.56
556,23,22.9,1031.29
545,22,22.96,1030.77
529,19,22.93,1031.46
428,4,22.92,1030.65
570,25,22.95,1030.98
502,15,22.99,1030.79
551,23,22.93,1030.77
455,8,22.88,1030.45
486,13,22.87,1030.54
548,22,22.75,1030.92
506,16,22.94,1030.6
475,11,22.94,1030.71
530,19,22.75,1029.29
589,28,22.95,1030.73
508,16,22.99,1030.71
410,1,22.74,1030.33
591,29,22.97,1030.65
491,13,22.76,1029.89
569,25,23.08,1030.84
436,5,22.98,1030.58
581,27,22.76,1029.51
566,25,22.98,1031.41
578,27,23.05,1030.82
451,7,22.79,1029.8
520,18,22.96,1030.9
539,21,23.04,1030.89
523,18,22.97,1030.54
470,10,23.02,1030.8
498,14,23.13,1030.92
540,21,22.98,1031.39
454,8,22.76,1029.67
536,20,22.76,1030.74
553,23,22.99,1030.59
564,24,22.79,1030.45
539,21,22.97,1030.56
406,0,22.95,1030.57
545,22,23.1,1030.88
491,13,22.75,1029.66
482,12,22.95,1031.42
520,18,22.95,1030.65
565,25,22.93,1031.22
505,15,22.98,1031.41
427,4,23.07,1030.9
531,19,22.73,1030.73
570,25,22.95,1031.36
500,15,23.0,1030.69
415,2,23.08,1030.86
537,20,22.78,1029.76
488,13,22.95,1031.31
520,18,22.97,1030.86
414,2,22.8,1029.44
566,25,22.91,1030.98
482,12,23.15,1030.61
0,0,22.77,1030.6
0,0,23.06,1030.59
0,0,22.86,1030.8
0,0,22.83,1030.65
400,0,22.85,1030.78
417,2,22.73,1030.59
485,12,22.78,1030.56
451,7,22.83,1030.78
434,5,22.84,1030.71
409,1,22.81,1030.72
400,0,22.82,1030.74
452,7,22.84,1030.71
456,8,22.85,1030.72
472,10,22.83,1030.75
400,0,22.82,1030.74
460,9,22.83,1030.7
452,7,22.81,1030.62
444,6,22.81,1030.88
451,7,22.8,1030.72
539,21,22.74,1030.55
526,19,22.8,1030.7
508,16,22.8,1030.76
447,7,22.81,1030.71
520,18,22.8,1030.64
506,16,22.81,1030.82
485,12,22.81,1030.67
447,7,22.81,1030.67
539,21,22.8,1030.69
542,21,22.81,1030.72
542,21,22.81,1030.88
457,8,22.81,1030.83
540,21,22.84,1030.74
520,18,22.84,1030.81
517,17,22.82,1030.74
416,2,22.83,1030.73
496,14,22.83,1030.62
481,12,22.84,1030.71
472,10,22.84,1030.76
456,8,22.82,1030.73
540,21,22.81,1030.67
533,20,22.81,1030.66
533,20,22.84,1030.76
426,3,22.81,1030.83
518,17,22.84,1030.77
495,14,22.86,1030.66
478,11,22.87,1030.76
464,9,22.87,1030.62
548,22,22.88,1030.77
536,20,22.88,1030.78
503,15,22.81,1030.74
427,4,22.88,1030.67
492,14,22.87,1030.75
464,9,22.76,1030.5
480,12,22.88,1030.77
447,7,22.85,1030.62
526,19,22.85,1030.67
519,18,22.83,1030.7
518,17,22.81,1030.69
427,4,22.82,1030.6
496,14,22.81,1030.72
473,11,22.8,1030.77
508,16,22.79,1030.68
466,10,22.79,1030.79
539,21,22.8,1030.75
529,19,22.79,1030.79
518,17,22.77,1030.77
417,2,22.76,1030.75
487,13,22.77,1030.6
486,13,22.79,1030.74
546,22,22.77,1030.7
450,7,22.78,1030.72
552,23,22.66,1030.7
539,21,22.81,1030.83
501,15,22.83,1030.77
439,5,22.83,1030.7
542,21,22.84,1030.77
529,19,22.85,1030.65
527,19,22.88,1030.83
425,3,22.85,1030.68
498,14,22.86,1030.76
506,16,22.87,1030.78
570,25,22.88,1030.71
442,6,22.88,1030.67
526,19,22.88,1030.67
487,13,22.89,1030.73
477,11,22.9,1030.67
463,9,22.88,1030.82
530,19,22.88,1030.7
515,17,22.87,1030.81
506,16,22.86,1030.82
472,10,22.87,1030.75
543,21,22.87,1030.7
531,19,22.86,1030.85
422,3,22.88,1030.83
478,11,22.82,1030.76
546,22,22.85,1030.72
517,17,22.87,1030.78
415,2,22.88,1030.85
487,13,22.86,1030.71
461,9,22.86,1030.82
531,19,22.86,1030.84
426,3,22.83,1030.86
497,14,22.85,1030.68
465,9,22.83,1030.81
463,9,22.82,1030.79
443,6,22.81,1030.72
501,15,22.81,1030.69
482,12,22.79,1030.58
422,3,22.79,1030.74
519,18,22.78,1030.75
502,15,22.68,1030.61
496,14,22.75,1030.59
400,0,22.74,1030.85
531,19,22.74,1030.63
536,20,22.76,1030.94
514,17,22.77,1030.76
463,9,22.77,1030.76
540,21,22.79,1030.79
588,28,22.77,1030.68
578,27,22.81,1030.74
463,9,22.81,1030.78
529,19,22.77,1030.52
600,30,22.83,1030.77
577,26,22.76,1030.7
464,9,22.84,1030.79
565,25,22.86,1030.74
591,29,22.86,1030.77
465,9,22.86,1030.74
531,19,22.86,1030.74
607,31,22.85,1030.73
607,31,22.86,1030.74
488,13,22.85,1030.78
577,26,22.84,1030.87
618,33,22.74,1030.6
520,18,22.86,1030.74
569,25,22.88,1030.72
572,26,22.86,1030.69
602,30,22.85,1030.89
483,12,22.84,1030.71
543,21,22.83,1030.65
605,31,22.83,1030.78
599,30,22.82,1030.69
470,10,22.82,1030.71
529,19,22.82,1030.76
599,30,22.85,1030.89
574,26,22.83,1030.75
463,9,22.83,1030.75
545,22,22.81,1030.82
588,28,22.82,1030.73
478,11,22.81,1030.58
551,23,22.81,1030.66
520,18,22.81,1030.71
588,28,22.84,1030.65
466,10,22.82,1030.76
534,20,22.8,1030.76
524,18,22.8,1030.61
594,29,22.8,1030.68
470,10,22.83,1030.78
545,22,22.83,1030.8
520,18,22.82,1030.78
459,8,22.82,1030.73
560,24,22.82,1030.74
551,23,22.82,1030.71
534,20,22.82,1030.7
486,13,22.83,1030.65
572,26,22.85,1030.72
551,23,22.82,1030.6
540,21,22.86,1030.82
498,14,22.83,1030.75
577,26,22.85,1030.69
569,25,22.82,1030.71
545,22,22.86,1030.74
498,14,22.84,1030.77
586,28,22.86,1030.77
574,26,22.84,1030.71
506,16,22.85,1030.78
638,36,22.86,1030.79
666,40,22.86,1030.74
652,38,22.86,1030.72
607,31,22.83,1030.75
1238,127,22.89,1030.71
1470,163,22.88,1030.72
1228,126,22.86,1030.74
1324,140,22.9,1030.78
1168,117,22.9,1030.81
995,90,22.92,1030.76
1128,110,22.91,1030.77
1749,205,22.91,1030.72
1683,195,22.94,1030.84
1879,225,22.95,1030.82
1338,142,22.92,1030.57
1530,172,22.94,1030.75
1548,174,22.94,1030.81
848,68,22.91,1030.71
933,81,22.92,1030.83
949,83,22.91,1030.92
840,67,22.91,1030.69
588,28,22.9,1030.73
730,50,22.91,1030.76
704,46,22.91,1030.76
649,37,22.92,1030.78
549,22,22.9,1030.86
660,39,22.93,1030.79
623,33,22.93,1030.72
526,19,22.91,1030.66
634,35,22.92,1030.78
611,32,22.9,1030.69
580,27,22.83,1030.67
520,18,22.88,1030.81
615,32,22.88,1030.83
572,26,22.88,1030.83
524,18,22.87,1030.75
537,20,22.86,1030.8
584,28,22.87,1030.72
537,20,22.86,1030.69
574,26,22.85,1030.78
495,14,22.86,1030.69
526,19,22.82,1030.71
545,22,22.83,1030.73
501,15,22.84,1030.74
552,23,22.83,1030.7
505,15,22.84,1030.71
575,26,22.83,1030.73
478,11,22.82,1030.73
529,19,22.82,1030.73
553,23,22.84,1030.76
597,30,22.77,1030.68
457,8,22.84,1030.71
523,18,22.85,1030.73
569,25,22.87,1030.68
461,9,22.83,1030.57
508,16,22.85,1030.89
548,22,22.86,1030.8
602,30,22.87,1030.84
456,8,22.87,1030.7
526,19,22.86,1030.74
577,26,22.87,1030.64
596,29,22.86,1030.72
425,3,22.86,1030.64
574,26,22.88,1030.78
594,29,22.86,1030.74
569,25,22.88,1030.77
475,11,22.87,1030.81
602,30,22.88,1030.85
567,25,22.87,1030.86
450,7,22.86,1030.74
578,27,22.87,1030.64
589,28,22.85,1030.72
578,27,22.85,1030.69
495,14,22.82,1030.82
624,34,22.85,1030.8
600,30,22.83,1030.72
567,25,22.81,1030.64
505,15,22.8,1030.72
638,36,22.84,1030.85
592,29,22.84,1030.79
498,14,22.83,1030.69
617,33,22.83,1030.7
597,30,22.82,1030.71
549,22,22.81,1030.76
524,18,22.79,1030.85
646,37,22.8,1030.86
611,32,22.79,1030.79
589,28,22.79,1030.79
545,22,22.8,1030.73
633,35,22.79,1030.69
607,31,22.79,1030.79
518,17,22.79,1030.76
631,35,22.8,1030.75
646,37,22.69,1030.58
626,34,22.79,1030.73
536,20,22.8,1030.65
640,36,22.77,1030.62
653,38,22.76,1030.8
611,32,22.79,1030.81
551,23,22.79,1030.68
674,41,22.8,1030.76
666,40,22.78,1030.81
624,34,22.79,1030.73
555,23,22.78,1030.77
683,43,22.77,1030.65
653,38,22.77,1030.66
483,12,22.77,1030.89
640,36,22.78,1030.7
674,41,22.78,1030.83
653,38,22.8,1030.78
483,12,22.78,1030.78
637,36,22.82,1030.73
659,39,22.8,1030.69
646,37,22.84,1030.79
482,12,22.8,1030.75
633,35,22.79,1030.73
653,38,22.81,1030.71
515,17,22.81,1030.8
570,25,22.83,1030.8
589,28,22.82,1030.74
633,35,22.82,1030.92
508,16,22.81,1030.75
556,23,22.8,1030.83
624,34,22.81,1030.72
652,38,22.82,1030.74
519,18,22.78,1030.8
574,26,22.81,1030.68
633,35,22.8,1030.67
666,40,22.8,1030.78
533,20,22.77,1030.76
581,27,22.78,1030.77
646,37,22.79,1030.68
565,25,22.81,1030.79
617,33,22.81,1030.72
589,28,22.83,1030.72
633,35,22.81,1030.82
570,25,22.79,1030.82
640,36,22.82,1030.63
581,27,22.8,1030.69
581,27,22.81,1030.78
675,41,22.84,1030.9
638,36,22.79,1030.79
600,30,22.73,1030.65
542,21,22.81,1030.7
666,40,22.79,1030.69
637,36,22.81,1030.88
611,32,22.82,1030.79
556,23,22.81,1030.7
624,34,22.79,1030.87
637,36,22.81,1030.8
624,34,22.7,1030.5
542,21,22.81,1030.88
675,41,22.82,1030.74
646,37,22.82,1030.74
508,16,22.8,1030.64
600,30,22.81,1030.71
567,25,22.77,1030.78
640,36,22.79,1030.71
526,19,22.65,1030.57
611,32,22.75,1030.68
591,29,22.78,1030.72
555,23,22.81,1030.71
530,19,22.8,1030.69
600,30,22.77,1030.77
589,28,22.8,1030.72
483,12,22.78,1030.8
617,33,22.69,1030.67
640,36,22.81,1030.71
600,30,22.81,1030.66
476,11,22.8,1030.67
570,25,22.8,1030.7
594,29,22.81,1030.66
629,34,22.83,1030.73
505,15,22.82,1030.7
575,26,22.79,1030.66
574,26,22.83,1030.73
617,33,22.84,1030.79
518,17,22.81,1030.74
594,29,22.84,1030.73
569,25,22.84,1030.84
543,21,22.83,1030.8
570,25,22.82,1030.81
594,29,22.82,1030.74
575,26,22.83,1030.67
533,20,22.82,1030.77
629,34,22.81,1030.74
611,32,22.82,1030.7
478,11,22.8,1030.68
594,29,22.82,1030.78
581,27,22.81,1030.8
640,36,22.8,1030.76
515,17,22.78,1030.77
596,29,22.81,1030.76
570,25,22.81,1030.62
575,26,22.79,1030.73
530,19,22.81,1030.71
594,29,22.81,1030.79
575,26,22.82,1030.74
539,21,22.82,1030.66
629,34,22.81,1030.72
611,32,22.82,1030.74
600,30,22.83,1030.77
472,10,22.81,1030.79
617,33,22.81,1030.76
633,35,22.81,1030.66
500,15,22.81,1030.75
575,26,22.79,1030.6
574,26,22.79,1030.73
581,27,22.77,1030.77
526,19,22.8,1030.81
594,29,22.79,1030.84
574,26,22.68,1030.67
574,26,22.77,1030.89
536,20,22.78,1030.83
596,29,22.77,1030.73
581,27,22.8,1030.69
581,27,22.79,1030.81
481,12,22.76,1030.8
633,35,22.77,1030.81
612,32,22.84,1030.81
482,12,22.79,1030.76
574,26,22.79,1030.77
551,23,22.8,1030.84
633,35,22.79,1030.79
518,17,22.8,1030.81
600,30,22.81,1030.86
567,25,22.81,1030.83
567,25,22.81,1030.76
524,18,22.83,1030.83
581,27,22.82,1030.7
581,27,22.82,1030.9
570,25,22.81,1030.74
539,21,22.83,1030.75
617,33,22.81,1030.74
600,30,22.84,1030.81
482,12,22.83,1030.73
617,33,22.81,1030.78
629,34,22.81,1030.72
603,30,22.85,1030.76
486,13,22.84,1030.82
555,23,22.82,1030.74
617,33,22.83,1030.81
624,34,22.82,1030.69
500,15,22.83,1030.67
556,23,22.82,1030.77
556,23,22.83,1030.88
524,18,22.83,1030.83
600,30,22.83,1030.85
581,27,22.84,1030.69
580,27,22.83,1030.67
549,22,22.86,1030.82
614,32,22.86,1030.72
591,29,22.81,1030.78
589,28,22.83,1030.69
556,23,22.84,1030.85
638,36,22.84,1030.79
599,30,22.87,1030.81
502,15,22.85,1030.68
586,28,22.88,1030.72
618,33,22.87,1030.75
629,34,22.87,1030.72
517,17,22.88,1030.77
589,28,22.84,1030.77
627,34,22.87,1030.86
649,37,22.85,1030.88
517,17,22.85,1030.78
591,29,22.8,1030.64
594,29,22.82,1030.78
530,19,22.86,1030.84
597,30,22.87,1030.75
578,27,22.87,1030.81
567,25,22.87,1030.67
546,22,22.89,1030.74
617,33,22.88,1030.77
589,28,22.86,1030.69
578,27,22.88,1030.71
534,20,22.88,1030.69
624,34,22.88,1030.77
599,30,22.87,1030.81
586,28,22.88,1030.75
496,14,22.89,1030.95
640,36,22.88,1030.75
618,33,22.9,1030.8
502,15,22.9,1030.8
597,30,22.88,1030.88
552,23,22.91,1030.74
626,34,22.88,1030.82
496,14,22.85,1030.65
565,25,22.86,1030.87
565,25,22.85,1030.8
565,25,22.83,1030.8
519,18,22.88,1030.82
584,28,22.8,1030.76
575,26,22.82,1030.73
508,16,22.84,1030.77
615,32,22.82,1030.78
603,30,22.81,1030.77
589,28,22.82,1030.82
488,13,22.78,1030.75
607,31,22.78,1030.72
640,36,22.79,1030.79
607,31,22.74,1030.69
505,15,22.8,1030.88
589,28,22.79,1030.79
574,26,22.76,1030.64
527,19,22.78,1030.77
581,27,22.79,1030.79
565,25,22.79,1030.79
565,25,22.81,1030.72
530,19,22.82,1030.78
603,30,22.82,1030.77
575,26,22.81,1030.82
553,23,22.82,1030.78
508,16,22.82,1030.79
617,33,22.83,1030.78
600,30,22.82,1030.68
478,11,22.82,1030.78
553,23,22.81,1030.7
567,25,22.8,1030.81
617,33,22.81,1030.88
497,14,22.82,1030.84
553,23,22.79,1030.74
565,25,22.78,1030.67
551,23,22.79,1030.95
518,17,22.82,1030.78
581,27,22.8,1030.8
567,25,22.82,1030.79
553,23,22.81,1030.71
530,19,22.82,1030.79
600,30,22.81,1030.68
556,23,22.8,1030.7
472,10,22.77,1030.74
530,19,22.76,1030.77
591,29,22.76,1030.82
566,25,22.74,1030.71
463,9,22.76,1030.72
540,21,22.75,1030.84
519,18,22.75,1030.81
591,29,22.75,1030.71
465,9,22.75,1030.71
552,23,22.74,1030.82
539,21,22.76,1030.85
496,14,22.75,1030.69
575,26,22.75,1030.88
552,23,22.77,1030.85
539,21,22.78,1030.8
459,8,22.77,1030.76
600,30,22.78,1030.83
577,26,22.78,1030.78
561,24,22.8,1030.81
476,11,22.81,1030.82
530,19,22.79,1030.73
589,28,22.76,1031.02
485,12,22.78,1030.8
539,21,22.71,1030.75
556,23,22.8,1030.75
545,22,22.78,1030.83
495,14,22.8,1030.8
575,26,22.79,1030.76
555,23,22.77,1030.95
545,22,22.78,1030.83
505,15,22.79,1030.79
581,27,22.78,1030.78
565,25,22.78,1030.77
473,11,22.81,1030.82
533,20,22.8,1030.75
567,25,22.81,1030.82
589,28,22.8,1030.72
478,11,22.79,1030.84
545,22,22.82,1030.79
533,20,22.76,1030.72
503,15,22.77,1030.82
555,23,22.77,1030.87
561,24,22.8,1030.77
549,22,22.8,1030.76
460,9,22.78,1030.8
581,27,22.79,1030.89
600,30,22.8,1030.73
570,25,22.83,1030.88
476,11,22.81,1030.88
553,23,22.77,1030.77
561,24,22.75,1030.75
614,32,22.81,1030.88
493,14,22.81,1030.78
556,23,22.84,1030.81
555,23,22.83,1030.83
524,18,22.82,1030.65
594,29,22.82,1030.87
570,25,22.82,1030.82
575,26,22.81,1030.74
545,22,22.79,1030.87
617,33,22.77,1030.81
607,31,22.75,1030.72
575,26,22.74,1030.71
483,12,22.76,1030.82
638,36,22.76,1030.85
618,33,22.73,1030.72
508,16,22.74,1030.92
580,27,22.75,1030.84
556,23,22.76,1030.85
641,36,22.77,1030.84
505,15,22.76,1030.85
591,29,22.75,1030.82
566,25,22.78,1030.88
536,20,22.68,1030.81
605,31,22.76,1030.8
591,29,22.76,1030.74
584,28,22.77,1030.84
551,23,22.79,1030.87
624,34,22.77,1030.85
607,31,22.73,1030.73
508,16,22.77,1030.82
577,26,22.77,1030.86
646,37,22.71,1030.78
615,32,22.75,1030.77
519,18,22.75,1030.84
591,29,22.73,1030.8
577,26,22.76,1030.85
649,37,22.72,1030.85
531,19,22.69,1030.86
597,30,22.69,1030.79
586,28,22.7,1030.92
602,30,22.74,1030.93
548,22,22.72,1030.77
631,35,22.67,1030.81
618,33,22.68,1030.86
539,21,22.67,1030.77
679,42,22.69,1030.72
665,40,22.69,1030.67
633,35,22.74,1030.87
529,19,22.7,1030.76
624,34,22.77,1030.89
674,41,22.73,1030.75
672,41,22.76,1030.85
552,23,22.75,1030.84
638,36,22.74,1030.77
612,32,22.77,1030.86
581,27,22.81,1030.9
666,40,22.78,1030.7
659,39,22.79,1030.76
659,39,22.61,1030.46
629,34,22.79,1031.01
690,44,22.8,1030.72
666,40,22.77,1030.76
646,37,22.75,1030.84
523,18,22.75,1030.86
686,43,22.74,1030.85
672,41,22.78,1030.77
637,36,22.7,1030.82
545,22,22.72,1030.84
607,31,22.68,1030.75
679,42,22.71,1030.83
531,19,22.69,1030.69
626,34,22.69,1030.74
597,30,22.65,1030.68
588,28,22.69,1030.77
533,20,22.67,1030.76
605,31,22.67,1030.82
599,30,22.6,1030.66
534,20,22.68,1030.71
627,34,22.66,1030.66
605,31,22.66,1030.85
592,29,22.67,1030.84
492,14,22.67,1030.76
592,29,22.66,1030.85
641,36,22.67,1030.81
623,33,22.63,1030.75
520,18,22.68,1030.78
588,28,22.69,1030.8
645,37,22.69,1030.83
649,37,22.69,1030.82
529,19,22.67,1030.79
605,31,22.68,1030.81
584,28,22.67,1030.86
548,22,22.71,1030.83
631,35,22.72,1030.84
618,33,22.68,1030.78
612,32,22.74,1030.89
567,25,22.72,1030.74
624,34,22.75,1030.86
618,33,22.76,1030.8
614,32,22.74,1030.81
542,21,22.74,1030.97
650,38,22.74,1030.81
615,32,22.72,1030.69
503,15,22.72,1030.87
580,27,22.73,1030.83
586,28,22.68,1030.81
627,34,22.7,1030.81
520,18,22.72,1030.78
580,27,22.68,1030.73
553,23,22.74,1030.81
577,26,22.68,1030.94
515,17,22.67,1030.81
584,28,22.68,1030.89
570,25,22.73,1030.85
565,25,22.67,1030.79
527,19,22.68,1030.75
599,30,22.69,1030.88
581,27,22.73,1030.83
505,15,22.71,1030.77
646,37,22.7,1030.9
638,36,22.7,1030.82
618,33,22.69,1030.82
501,15,22.73,1030.91
567,25,22.71,1030.86
602,30,22.75,1030.82
517,17,22.73,1030.96
592,29,22.73,1031.01
567,25,22.7,1030.84
596,29,22.7,1030.74
545,22,22.74,1030.77
603,30,22.74,1030.82
603,30,22.74,1030.74
565,25,22.74,1030.77
483,12,22.76,1030.8
591,29,22.74,1030.85
627,34,22.72,1030.95
607,31,22.72,1030.84
503,15,22.75,1030.86
566,25,22.7,1030.84
570,25,22.68,1030.68
527,19,22.68,1030.87
592,29,22.68,1030.93
553,23,22.68,1030.95
566,25,22.65,1030.68
542,21,22.68,1030.97
599,30,22.7,1030.9
607,31,22.66,1030.88
592,29,22.65,1030.92
492,14,22.64,1030.83
650,38,22.68,1030.86
634,35,22.66,1030.83
518,17,22.59,1030.85
607,31,22.65,1031.06
591,29,22.64,1030.71
645,37,22.66,1030.83
539,21,22.69,1030.95
620,33,22.57,1030.67
617,33,22.7,1030.82
618,33,22.74,1030.82
560,24,22.73,1030.97
615,32,22.75,1030.98
611,32,22.72,1030.78
515,17,22.76,1030.96
578,27,22.75,1030.78
638,36,22.77,1030.82
640,36,22.77,1030.98
518,17,22.76,1030.82
597,30,22.75,1030.79
575,26,22.77,1030.87
617,33,22.74,1030.79
524,18,22.76,1030.9
591,29,22.72,1030.87
584,28,22.72,1030.86
520,18,22.71,1030.9
624,34,22.73,1030.91
577,26,22.71,1030.77
589,28,22.7,1030.89
503,15,22.69,1030.91
543,21,22.71,1030.86
615,32,22.68,1030.92
618,33,22.67,1030.9
497,14,22.64,1030.93
574,26,22.65,1030.89
551,23,22.66,1030.88
612,32,22.68,1031.0
506,16,22.68,1030.86
570,25,22.66,1030.96
553,23,22.64,1030.98
542,21,22.61,1030.91
618,33,22.61,1030.86
577,26,22.6,1030.9
592,29,22.49,1030.76
485,12,22.59,1030.96
581,27,22.59,1030.91
631,35,22.57,1030.77
602,30,22.51,1030.72
496,14,22.57,1031.01
575,26,22.56,1031.02
548,22,22.51,1030.89
527,19,22.53,1030.91
584,28,22.52,1031.01
567,25,22.53,1030.97
551,23,22.51,1030.88
567,25,22.53,1030.94
649,37,22.54,1030.91
620,33,22.47,1030.73
633,35,22.47,1030.99
556,23,22.52,1031.04
717,48,22.5,1030.92
708,46,22.49,1030.96
572,26,22.52,1030.93
666,40,22.48,1030.95
641,36,22.49,1030.96
740,51,22.51,1030.89
605,31,22.34,1030.74
730,50,22.47,1030.96
710,47,22.48,1031.04
668,40,22.46,1030.95
776,57,22.45,1030.96
749,53,22.47,1031.03
730,50,22.45,1030.95
605,31,22.45,1030.96
726,49,22.42,1030.94
778,57,22.44,1030.96
1009,92,22.44,1030.94
1630,187,22.42,1030.78
1990,242,22.46,1031.08
1984,241,22.47,1030.99
1787,211,22.44,1030.72
1884,226,22.44,1030.92
1630,187,22.42,1030.86
1678,194,22.4,1030.76
1367,147,22.41,1030.93
1432,157,22.4,1030.98
1307,138,22.4,1030.87
1235,127,22.4,1030.92
1134,111,22.38,1030.95
1195,121,22.39,1030.92
1083,104,22.41,1031.0
1038,97,22.41,1030.95
951,83,22.4,1030.99
1047,98,22.45,1031.0
956,84,22.45,1030.93
813,62,22.44,1030.89
1009,92,22.48,1030.97
940,82,22.45,1030.88
880,73,22.39,1030.89
778,57,22.44,1031.04
925,79,22.38,1030.97
902,76,22.4,1030.87
853,69,22.4,1030.83
675,41,22.4,1030.87
885,73,22.39,1030.81
877,72,22.4,1031.01
735,51,22.4,1030.94
817,63,22.39,1030.86
749,53,22.4,1030.88
754,53,22.39,1030.89
726,49,22.4,1030.88
817,63,22.39,1031.04
778,57,22.38,1030.92
726,49,22.33,1030.66
694,44,22.36,1030.95
821,64,22.39,1030.99
795,60,22.39,1030.89
596,29,22.36,1031.0
800,60,22.35,1030.88
800,60,22.33,1030.92
787,58,22.33,1031.02
631,35,22.34,1030.94
690,44,22.33,1031.09
804,61,22.28,1030.96
827,65,22.32,1030.97
652,38,22.3,1030.99
746,52,22.28,1030.96
688,43,22.33,1031.04
668,40,22.27,1030.89
776,57,22.28,1031.04
737,51,22.3,1030.99
717,48,22.31,1031.0
646,37,22.29,1031.05
754,53,22.3,1031.01
783,58,22.29,1031.0
732,50,22.29,1030.94
561,24,22.3,1030.9
752,53,22.29,1031.08
748,53,22.29,1031.1
774,56,22.29,1030.92
600,30,22.31,1030.7
659,39,22.31,1031.11
735,51,22.33,1030.94
631,35,22.29,1031.08
732,50,22.31,1030.85
692,44,22.31,1031.11
652,38,22.33,1030.88
638,36,22.33,1031.06
749,53,22.33,1031.04
728,49,22.34,1030.84
672,41,22.33,1030.92
638,36,22.32,1030.93
730,50,22.34,1030.68
730,50,22.32,1030.94
575,26,22.37,1030.91
631,35,22.37,1030.83
702,46,22.32,1030.83
712,47,22.32,1030.99
624,34,22.34,1030.9
690,44,22.36,1031.03
653,38,22.38,1031.0
668,40,22.33,1031.04
416,2,22.34,1030.74
400,0,22.34,1030.68
400,0,22.39,1031.02
5021,703,22.47,1031.06
7992,1156,22.54,1030.96
7243,1042,22.57,1030.95
6971,1001,22.63,1030.83
6368,909,22.66,1030.98
5923,841,22.68,1030.77
7752,1120,22.66,1030.85
6991,1004,22.69,1030.9
6314,900,22.67,1030.93
7099,1020,22.71,1030.85
6498,928,22.66,1030.96
5277,742,22.65,1030.89
6680,956,22.68,1030.91
6524,932,22.62,1030.91
5856,831,22.68,1030.83
5723,810,22.71,1030.93
6498,928,22.73,1031.04
6070,863,22.69,1030.99
4290,592,23.09,1030.94
0,0,22.74,1030.87
0,0,22.68,1031.0
