tests: added reproducer of cert re-encoding issue

Signed-off-by: Nikos Mavrogiannopoulos <nmav@redhat.com>
6 jobs for tmp-cert-reencoding in 5 minutes and 20 seconds
latest
Status Job ID Name Coverage
  Test
failed #55436297
shared
Build and Check (x86)

00:02:22

failed #55436296
shared
Build and Check (x86-64)

00:02:20

failed #55436299
shared
Build and Check with asan

00:02:19

failed #55436298
shared
Build and Check with clang

00:02:01

failed #55436300
shared
Build and Check with ubsan

00:03:05

failed #55436301
shared docker
MinGW32

00:05:18

 
Name Stage Failure
failed
Build and Check with clang Test
============================================================================
make[3]: *** [test-suite.log] Error 1
make[3]: Leaving directory `/builds/gnutls/libtasn1/tests'
make[2]: *** [check-TESTS] Error 2
make[2]: Leaving directory `/builds/gnutls/libtasn1/tests'
make[1]: *** [check-am] Error 2
make[1]: Leaving directory `/builds/gnutls/libtasn1/tests'
make: *** [check-recursive] Error 1
ERROR: Job failed: exit code 1
failed
Build and Check (x86) Test
============================================================================
make[3]: *** [test-suite.log] Error 1
make[3]: Leaving directory `/builds/gnutls/libtasn1/tests'
make[2]: *** [check-TESTS] Error 2
make[2]: Leaving directory `/builds/gnutls/libtasn1/tests'
make[1]: *** [check-am] Error 2
make[1]: Leaving directory `/builds/gnutls/libtasn1/tests'
make: *** [check-recursive] Error 1
ERROR: Job failed: exit code 1
failed
Build and Check with ubsan Test
Makefile:1620: recipe for target 'check-TESTS' failed
make[2]: Leaving directory '/builds/gnutls/libtasn1/tests'
make[2]: *** [check-TESTS] Error 2
Makefile:1868: recipe for target 'check-am' failed
make[1]: Leaving directory '/builds/gnutls/libtasn1/tests'
make[1]: *** [check-am] Error 2
Makefile:1022: recipe for target 'check-recursive' failed
make: *** [check-recursive] Error 1
ERROR: Job failed: exit code 1
failed
Build and Check (x86-64) Test
============================================================================
make[3]: *** [test-suite.log] Error 1
make[3]: Leaving directory `/builds/gnutls/libtasn1/tests'
make[2]: *** [check-TESTS] Error 2
make[2]: Leaving directory `/builds/gnutls/libtasn1/tests'
make[1]: *** [check-am] Error 2
make[1]: Leaving directory `/builds/gnutls/libtasn1/tests'
make: *** [check-recursive] Error 1
ERROR: Job failed: exit code 1
failed
Build and Check with asan Test
============================================================================
make[3]: *** [test-suite.log] Error 1
make[3]: Leaving directory `/builds/gnutls/libtasn1/tests'
make[2]: *** [check-TESTS] Error 2
make[2]: Leaving directory `/builds/gnutls/libtasn1/tests'
make[1]: *** [check-am] Error 2
make[1]: Leaving directory `/builds/gnutls/libtasn1/tests'
make: *** [check-recursive] Error 1
ERROR: Job failed: exit code 1
failed
MinGW32 Test
Makefile:1868: recipe for target 'check-am' failed
make: *** [check-am] Error 2
make: Leaving directory '/builds/gnutls/libtasn1/build/tests'
Uploading artifacts...
build/*.log: found 1 matching files
build/tests/*.log: found 27 matching files
WARNING: build/tests/*/*.log: no matching files
Uploading artifacts to coordinator... ok id=55436301 responseStatus=201 Created token=RQvo2mxG
ERROR: Job failed: exit code 1