<?xml version="1.0" encoding="UTF-8" standalone="no"?>
<!-- Created with Inkscape (http://www.inkscape.org/) -->

<svg
   version="1.1"
   id="svg10"
   width="185"
   height="160"
   viewBox="0 0 185 160"
   sodipodi:docname="renaper_federador_icon.svg"
   inkscape:version="1.1.2 (0a00cf5339, 2022-02-04)"
   xmlns:inkscape="http://www.inkscape.org/namespaces/inkscape"
   xmlns:sodipodi="http://sodipodi.sourceforge.net/DTD/sodipodi-0.dtd"
   xmlns="http://www.w3.org/2000/svg"
   xmlns:svg="http://www.w3.org/2000/svg"
   xmlns:rdf="http://www.w3.org/1999/02/22-rdf-syntax-ns#"
   xmlns:cc="http://creativecommons.org/ns#"
   xmlns:dc="http://purl.org/dc/elements/1.1/">
  <metadata
     id="metadata16">
    <rdf:RDF>
      <cc:Work
         rdf:about="">
        <dc:format>image/svg+xml</dc:format>
        <dc:type
           rdf:resource="http://purl.org/dc/dcmitype/StillImage" />
      </cc:Work>
    </rdf:RDF>
  </metadata>
  <defs
     id="defs14">
    <rect
       x="65.138177"
       y="21.576661"
       width="52.379957"
       height="46.315905"
       id="rect5447" />
  </defs>
  <sodipodi:namedview
     pagecolor="#ffffff"
     bordercolor="#666666"
     borderopacity="1"
     objecttolerance="10"
     gridtolerance="10"
     guidetolerance="10"
     inkscape:pageopacity="0"
     inkscape:pageshadow="2"
     inkscape:window-width="1366"
     inkscape:window-height="708"
     id="namedview12"
     showgrid="false"
     inkscape:zoom="1.9931572"
     inkscape:cx="-6.2714572"
     inkscape:cy="76.010061"
     inkscape:window-x="0"
     inkscape:window-y="0"
     inkscape:window-maximized="1"
     inkscape:current-layer="svg10"
     inkscape:pagecheckerboard="0" />
  <ellipse
     style="fill:#ececec;stroke:#000000;stroke-width:1.13957107;stroke-opacity:1"
     id="path59"
     cx="93.658539"
     cy="81.064308"
     rx="92.594238"
     ry="80" />
  <text
     xml:space="preserve"
     style="font-style:normal;font-weight:normal;font-size:130.349px;line-height:1.25;font-family:sans-serif;letter-spacing:0px;word-spacing:0px;fill:#000000;fill-opacity:1;stroke:none;stroke-width:0.977613"
     x="20.376213"
     y="113.88037"
     id="text1992"
     transform="scale(1.0434752,0.95833616)"><tspan
       sodipodi:role="line"
       id="tspan1990"
       x="20.376213"
       y="113.88037"
       style="stroke-width:0.977613">R</tspan></text>
  <text
     xml:space="preserve"
     id="text5445"
     style="font-style:normal;font-weight:normal;font-size:40px;line-height:1.25;font-family:sans-serif;white-space:pre;shape-inside:url(#rect5447);fill:#808000;fill-opacity:1;stroke:none"
     transform="matrix(4.2443023,0,0,2.8941717,-184.74763,-13.287104)"><tspan
       x="65.138672"
       y="56.966797"
       id="tspan12407">F</tspan></text>
</svg>
